directory-notifications mailing list archives

Site index · List index
Message view « Date » · « Thread »
Top « Date » · « Thread »
From Apache Jenkins Server <jenk...@builds.apache.org>
Subject Build failed in Jenkins: dir-studio-maven-plugin-deploy-site #1401
Date Wed, 13 Aug 2014 03:05:57 GMT
See <https://builds.apache.org/job/dir-studio-maven-plugin-deploy-site/1401/>

------------------------------------------
Started by timer
Building remotely on ubuntu3 (Ubuntu ubuntu) in workspace <https://builds.apache.org/job/dir-studio-maven-plugin-deploy-site/ws/>
Checking out a fresh workspace because /x1/jenkins/jenkins-slave/workspace/dir-studio-maven-plugin-deploy-site/trunk
doesn't exist
Cleaning local Directory trunk
Checking out http://svn.apache.org/repos/asf/directory/buildtools/studio-plugin/trunk at revision
'2014-08-13T03:04:37.853 +0000'
A         src
A         src/main
A         src/main/java
A         src/main/java/org
A         src/main/java/org/apache
A         src/main/java/org/apache/directory
A         src/main/java/org/apache/directory/studio
A         src/main/java/org/apache/directory/studio/maven
A         src/main/java/org/apache/directory/studio/maven/plugins
AU        src/main/java/org/apache/directory/studio/maven/plugins/StudioPrepareJarPackageMojo.java
AU        src/main/java/org/apache/directory/studio/maven/plugins/StudioUnpackPrefixedMojo.java
AU        src/main/java/org/apache/directory/studio/maven/plugins/StudioCopyEclipseDependencyMojo.java
AU        src/main/java/org/apache/directory/studio/maven/plugins/ArtifactItem.java
AU        src/main/java/org/apache/directory/studio/maven/plugins/StudioReplaceFileInJarMojo.java
AU        src/main/java/org/apache/directory/studio/maven/plugins/StudioCleanMojo.java
AU        src/main/java/org/apache/directory/studio/maven/plugins/AbstractStudioMojo.java
AU        src/main/java/org/apache/directory/studio/maven/plugins/StudioEclipseMojo.java
A         src/site
A         src/site/resources
A         src/site/resources/images
AU        src/site/resources/images/studio-icon_128x128.png
A         src/site/fml
A         src/site/fml/faq.fml
AU        src/site/site.xml
A         src/site/apt
A         src/site/apt/usage.apt
A         src/site/apt/index.apt
A         src/site/apt/examples
A         src/site/apt/examples/replace-file-in-eclipse-artifact.apt
A         src/site/apt/examples/unpack-with-artifactid-prefix.apt
A         src/site/apt/examples/prepare-jar-package.apt
A         src/site/apt/examples/copy-eclipse-artifact.apt
A         src/checkstyle
A         src/checkstyle/suppressions.xml
A         src/test
A         src/test/resources
A         src/test/resources/org
A         src/test/resources/org/apache
A         src/test/resources/org/apache/directory
A         src/test/resources/org/apache/directory/studio
A         src/test/resources/org/apache/directory/studio/maven
A         src/test/resources/org/apache/directory/studio/maven/plugins
A         src/test/resources/org/apache/directory/studio/maven/plugins/test-copy-repo
AU        src/test/resources/org/apache/directory/studio/maven/plugins/test-copy-repo/repo-marker.txt
A         src/test/resources/org/apache/directory/studio/maven/plugins/test-copy-repo/org
A         src/test/resources/org/apache/directory/studio/maven/plugins/test-copy-repo/org/eclipse
A         src/test/resources/org/apache/directory/studio/maven/plugins/test-copy-repo/org/eclipse/core
A         src/test/resources/org/apache/directory/studio/maven/plugins/test-copy-repo/org/eclipse/core/commands
A         src/test/resources/org/apache/directory/studio/maven/plugins/test-copy-repo/org/eclipse/core/commands/3.3.0-I20070605-0010
A         src/test/resources/org/apache/directory/studio/maven/plugins/test-copy-repo/org/eclipse/core/commands/3.3.0-I20070605-0010/commands-3.3.0-I20070605-0010.pom.sha1
A         src/test/resources/org/apache/directory/studio/maven/plugins/test-copy-repo/org/eclipse/core/commands/3.3.0-I20070605-0010/commands-3.3.0-I20070605-0010.jar.sha1
A         src/test/resources/org/apache/directory/studio/maven/plugins/test-copy-repo/org/eclipse/core/commands/3.3.0-I20070605-0010/commands-3.3.0-I20070605-0010.pom
AU        src/test/resources/org/apache/directory/studio/maven/plugins/test-copy-repo/org/eclipse/core/commands/3.3.0-I20070605-0010/commands-3.3.0-I20070605-0010.jar
A         src/test/resources/org/apache/directory/studio/maven/plugins/test-copy-repo/org/eclipse/core/jobs
A         src/test/resources/org/apache/directory/studio/maven/plugins/test-copy-repo/org/eclipse/core/jobs/3.3.1-R33x_v20070709
A         src/test/resources/org/apache/directory/studio/maven/plugins/test-copy-repo/org/eclipse/core/jobs/3.3.1-R33x_v20070709/jobs-3.3.1-R33x_v20070709.pom.sha1
A         src/test/resources/org/apache/directory/studio/maven/plugins/test-copy-repo/org/eclipse/core/jobs/3.3.1-R33x_v20070709/jobs-3.3.1-R33x_v20070709.jar.sha1
A         src/test/resources/org/apache/directory/studio/maven/plugins/test-copy-repo/org/eclipse/core/jobs/3.3.1-R33x_v20070709/jobs-3.3.1-R33x_v20070709.pom
AU        src/test/resources/org/apache/directory/studio/maven/plugins/test-copy-repo/org/eclipse/core/jobs/3.3.1-R33x_v20070709/jobs-3.3.1-R33x_v20070709.jar
A         src/test/resources/unit
A         src/test/resources/unit/basic-unpack-test
AU        src/test/resources/unit/basic-unpack-test/plugin-pom.xml
A         src/test/resources/unit/basic-clean-test
AU        src/test/resources/unit/basic-clean-test/plugin-exception-pom.xml
A         src/test/resources/unit/basic-clean-test/lib
A         src/test/resources/unit/basic-clean-test/lib/dummy.jar
AU        src/test/resources/unit/basic-clean-test/plugin-pom.xml
AU        src/test/resources/unit/basic-clean-test/maven-eclipse.xml
A         src/test/resources/unit/basic-clean-test/.externalToolBuilders
A         src/test/resources/unit/basic-copy-test
AU        src/test/resources/unit/basic-copy-test/plugin-pom.xml
A         src/test/java
A         src/test/java/org
A         src/test/java/org/apache
A         src/test/java/org/apache/directory
A         src/test/java/org/apache/directory/studio
A         src/test/java/org/apache/directory/studio/maven
A         src/test/java/org/apache/directory/studio/maven/plugins
AU        src/test/java/org/apache/directory/studio/maven/plugins/StudioCopyEclipseDependencyMojoTest.java
AU        src/test/java/org/apache/directory/studio/maven/plugins/StudioCleanMojoTest.java
A         src/test/java/org/apache/directory/studio/maven/plugins/stubs
AU        src/test/java/org/apache/directory/studio/maven/plugins/stubs/StudioCleanProjectStub.java
AU        src/test/java/org/apache/directory/studio/maven/plugins/stubs/StudioUnpackPrefixedProjectStub.java
AU        src/test/java/org/apache/directory/studio/maven/plugins/stubs/StudioCopyEclipseDependencyProjectStub.java
AU        src/test/java/org/apache/directory/studio/maven/plugins/StudioUnpackPrefixedMojoTest.java
AU        pom.xml
 U        .
At revision 1617654
no change for http://svn.apache.org/repos/asf/directory/buildtools/studio-plugin/trunk since
the previous build
Parsing POMs
maven3-agent.jar already up to date
maven3-interceptor.jar already up to date
maven3-interceptor-commons.jar already up to date
[trunk] $ /home/jenkins/tools/java/latest1.7/bin/java -cp /home/jenkins/jenkins-slave/maven3-agent.jar:/home/jenkins/tools/maven/apache-maven-3.0.4/boot/plexus-classworlds-2.4.jar
org.jvnet.hudson.maven3.agent.Maven3Main /home/jenkins/tools/maven/apache-maven-3.0.4 /x1/jenkins/jenkins-slave/slave.jar
/home/jenkins/jenkins-slave/maven3-interceptor.jar /home/jenkins/jenkins-slave/maven3-interceptor-commons.jar
43184
<===[JENKINS REMOTING CAPACITY]===>   channel started
log4j:WARN No appenders could be found for logger (org.apache.commons.beanutils.converters.BooleanConverter).
log4j:WARN Please initialize the log4j system properly.
Executing Maven:  -B -f <https://builds.apache.org/job/dir-studio-maven-plugin-deploy-site/ws/trunk/pom.xml>
-Dmaven.repo.local=/home/jenkins/jenkins-slave/maven-repositories/1 -V clean deploy site
Apache Maven 3.0.4 (r1232337; 2012-01-17 08:44:56+0000)
Maven home: /x1/jenkins/tools/maven/apache-maven-3.0.4
Java version: 1.7.0_25, vendor: Oracle Corporation
Java home: /x1/jenkins/tools/java/jdk1.7.0_25-32/jre
Default locale: en_US, platform encoding: ANSI_X3.4-1968
OS name: "linux", version: "3.2.0-67-generic", arch: "i386", family: "unix"
[INFO] Scanning for projects...
[INFO]                                                                         
[INFO] ------------------------------------------------------------------------
[INFO] Building Apache Directory Studio Plugin 1.0.6-SNAPSHOT
[INFO] ------------------------------------------------------------------------
[INFO] 
[INFO] --- maven-clean-plugin:2.4.1:clean (default-clean) @ studio-maven-plugin ---
[INFO] 
[INFO] --- maven-plugin-plugin:2.9:descriptor (default-descriptor) @ studio-maven-plugin ---
[INFO] Using 'UTF-8' encoding to read mojo metadata.
[INFO] Applying mojo extractor for language: java
[INFO] Mojo extractor for language: java found 6 mojo descriptors.
[INFO] Applying mojo extractor for language: bsh
[INFO] Mojo extractor for language: bsh found 0 mojo descriptors.
[INFO] 
[INFO] --- maven-remote-resources-plugin:1.2.1:process (default) @ studio-maven-plugin ---
[INFO] 
[INFO] --- maven-resources-plugin:2.5:resources (default-resources) @ studio-maven-plugin
---
[debug] execute contextualize
[INFO] Using 'UTF-8' encoding to copy filtered resources.
[INFO] skip non existing resourceDirectory <https://builds.apache.org/job/dir-studio-maven-plugin-deploy-site/ws/trunk/src/main/resources>
[INFO] Copying 3 resources
[INFO] 
[INFO] --- maven-compiler-plugin:2.3.2:compile (default-compile) @ studio-maven-plugin ---
[INFO] Compiling 8 source files to <https://builds.apache.org/job/dir-studio-maven-plugin-deploy-site/ws/trunk/target/classes>
[INFO] 
[INFO] --- maven-resources-plugin:2.5:testResources (default-testResources) @ studio-maven-plugin
---
[debug] execute contextualize
[INFO] Using 'UTF-8' encoding to copy filtered resources.
[INFO] Copying 16 resources
[INFO] Copying 3 resources
[INFO] 
[INFO] --- maven-compiler-plugin:2.3.2:testCompile (default-testCompile) @ studio-maven-plugin
---
[INFO] Compiling 6 source files to <https://builds.apache.org/job/dir-studio-maven-plugin-deploy-site/ws/trunk/target/test-classes>
[INFO] 
[INFO] --- maven-surefire-plugin:2.10:test (default-test) @ studio-maven-plugin ---
[INFO] Surefire report directory: <https://builds.apache.org/job/dir-studio-maven-plugin-deploy-site/ws/trunk/target/surefire-reports>

-------------------------------------------------------
 T E S T S
-------------------------------------------------------

Results :

Tests run: 0, Failures: 0, Errors: 0, Skipped: 0

[JENKINS] Recording test results
[INFO] 
[INFO] --- maven-jar-plugin:2.3.2:jar (default-jar) @ studio-maven-plugin ---
[INFO] Building jar: <https://builds.apache.org/job/dir-studio-maven-plugin-deploy-site/ws/trunk/target/studio-maven-plugin-1.0.6-SNAPSHOT.jar>
[INFO] 
[INFO] --- maven-plugin-plugin:2.9:addPluginArtifactMetadata (default-addPluginArtifactMetadata)
@ studio-maven-plugin ---
[WARNING] Failed to getClass for org.apache.maven.plugin.source.SourceJarMojo
[INFO] 
[INFO] --- maven-source-plugin:2.1.2:jar (attach-sources) @ studio-maven-plugin ---
[INFO] META-INF already added, skipping
[INFO] META-INF/DEPENDENCIES already added, skipping
[INFO] META-INF/NOTICE already added, skipping
[INFO] META-INF/LICENSE already added, skipping
[INFO] Building jar: <https://builds.apache.org/job/dir-studio-maven-plugin-deploy-site/ws/trunk/target/studio-maven-plugin-1.0.6-SNAPSHOT-sources.jar>
[INFO] META-INF already added, skipping
[INFO] META-INF/DEPENDENCIES already added, skipping
[INFO] META-INF/NOTICE already added, skipping
[INFO] META-INF/LICENSE already added, skipping
[INFO] 
[INFO] --- tools-maven-plugin:1.4:verify-legal-files (verify-legal-files) @ studio-maven-plugin
---
[INFO] Checking legal files in: studio-maven-plugin-1.0.6-SNAPSHOT.jar
[INFO] Checking legal files in: studio-maven-plugin-1.0.6-SNAPSHOT-sources.jar
[INFO] 
[INFO] --- maven-install-plugin:2.3.1:install (default-install) @ studio-maven-plugin ---
[INFO] Installing <https://builds.apache.org/job/dir-studio-maven-plugin-deploy-site/ws/trunk/target/studio-maven-plugin-1.0.6-SNAPSHOT.jar>
to /home/jenkins/jenkins-slave/maven-repositories/1/org/apache/directory/studio/studio-maven-plugin/1.0.6-SNAPSHOT/studio-maven-plugin-1.0.6-SNAPSHOT.jar
[INFO] Installing <https://builds.apache.org/job/dir-studio-maven-plugin-deploy-site/ws/trunk/pom.xml>
to /home/jenkins/jenkins-slave/maven-repositories/1/org/apache/directory/studio/studio-maven-plugin/1.0.6-SNAPSHOT/studio-maven-plugin-1.0.6-SNAPSHOT.pom
[INFO] Installing <https://builds.apache.org/job/dir-studio-maven-plugin-deploy-site/ws/trunk/target/studio-maven-plugin-1.0.6-SNAPSHOT-sources.jar>
to /home/jenkins/jenkins-slave/maven-repositories/1/org/apache/directory/studio/studio-maven-plugin/1.0.6-SNAPSHOT/studio-maven-plugin-1.0.6-SNAPSHOT-sources.jar
[INFO] 
[INFO] --- maven-deploy-plugin:2.7:deploy (default-deploy) @ studio-maven-plugin ---
Downloading: https://repository.apache.org/content/repositories/snapshots/org/apache/directory/studio/studio-maven-plugin/1.0.6-SNAPSHOT/maven-metadata.xml
[WARNING] Could not transfer metadata org.apache.directory.studio:studio-maven-plugin:1.0.6-SNAPSHOT/maven-metadata.xml
from/to apache.snapshots.https (https://repository.apache.org/content/repositories/snapshots):
Failed to transfer file: https://repository.apache.org/content/repositories/snapshots/org/apache/directory/studio/studio-maven-plugin/1.0.6-SNAPSHOT/maven-metadata.xml.
Return code is: 502, ReasonPhrase:Proxy Error.
[INFO] ------------------------------------------------------------------------
[INFO] BUILD FAILURE
[INFO] ------------------------------------------------------------------------
[INFO] Total time: 1:12.140s
[INFO] Finished at: Wed Aug 13 03:05:56 UTC 2014
[INFO] Final Memory: 31M/169M
[INFO] ------------------------------------------------------------------------
Waiting for Jenkins to finish collecting data
[ERROR] Failed to execute goal org.apache.maven.plugins:maven-deploy-plugin:2.7:deploy (default-deploy)
on project studio-maven-plugin: Failed to retrieve remote metadata org.apache.directory.studio:studio-maven-plugin:1.0.6-SNAPSHOT/maven-metadata.xml:
Could not transfer metadata org.apache.directory.studio:studio-maven-plugin:1.0.6-SNAPSHOT/maven-metadata.xml
from/to apache.snapshots.https (https://repository.apache.org/content/repositories/snapshots):
Failed to transfer file: https://repository.apache.org/content/repositories/snapshots/org/apache/directory/studio/studio-maven-plugin/1.0.6-SNAPSHOT/maven-metadata.xml.
Return code is: 502, ReasonPhrase:Proxy Error. -> [Help 1]
[ERROR] 
[ERROR] To see the full stack trace of the errors, re-run Maven with the -e switch.
[ERROR] Re-run Maven using the -X switch to enable full debug logging.
[ERROR] 
[ERROR] For more information about the errors and possible solutions, please read the following
articles:
[ERROR] [Help 1] http://cwiki.apache.org/confluence/display/MAVEN/MojoExecutionException
[JENKINS] Archiving <https://builds.apache.org/job/dir-studio-maven-plugin-deploy-site/ws/trunk/pom.xml>
to org.apache.directory.studio/studio-maven-plugin/1.0.6-SNAPSHOT/studio-maven-plugin-1.0.6-SNAPSHOT.pom
[JENKINS] Archiving <https://builds.apache.org/job/dir-studio-maven-plugin-deploy-site/ws/trunk/target/studio-maven-plugin-1.0.6-SNAPSHOT.jar>
to org.apache.directory.studio/studio-maven-plugin/1.0.6-SNAPSHOT/studio-maven-plugin-1.0.6-SNAPSHOT.jar
[JENKINS] Archiving <https://builds.apache.org/job/dir-studio-maven-plugin-deploy-site/ws/trunk/target/studio-maven-plugin-1.0.6-SNAPSHOT-sources.jar>
to org.apache.directory.studio/studio-maven-plugin/1.0.6-SNAPSHOT/studio-maven-plugin-1.0.6-SNAPSHOT-sources.jar
Sending artifact delta relative to dir-studio-maven-plugin-deploy-site ? Apache Directory
Studio Plugin #1400
Archived 3 artifacts
Archive block size is 32768
Received 0 blocks and 72922 bytes
Compression is 0.0%
Took 21 ms
Sending e-mails to: notifications@directory.apache.org
channel stopped

Mime
View raw message