directory-notifications mailing list archives

Site index · List index
Message view « Date » · « Thread »
Top « Date » · « Thread »
From Apache Jenkins Server <jenk...@builds.apache.org>
Subject Build failed in Jenkins: dir-mavibot-ubuntu-deploy #348
Date Fri, 22 Aug 2014 03:09:19 GMT
See <https://builds.apache.org/job/dir-mavibot-ubuntu-deploy/348/>

------------------------------------------
[...truncated 109 lines...]
Written 70000 elements in : 53ms
Written 80000 elements in : 21ms
Written 90000 elements in : 20ms
Delta : 904, nbError = 0, Nb insertion per second : 110000
Time to flush 100 000 elements : 142ms
Tests run: 2, Failures: 0, Errors: 0, Skipped: 0, Time elapsed: 1.466 sec - in org.apache.directory.mavibot.btree.InMemoryBTreeFlushTest
Running org.apache.directory.mavibot.btree.InMemoryBTreeTest
Node[r7, nbElems:2] -> {r5|<3>|r7|<5>|r7}
Delta1: 389
Delta2: 333
Delta3: 274
Delta4: 449
Nb elements read : 500000
Delta : 84, nbError = 0, Nb searches per second : 5952380
Delta : 1799, nbError = 0, Nb insertion per second : 555864
Delta : 3660, nbError = 0, Nb deletion per second : 273224
Tests run: 36, Failures: 0, Errors: 0, Skipped: 1, Time elapsed: 7.346 sec - in org.apache.directory.mavibot.btree.InMemoryBTreeTest
Running org.apache.directory.mavibot.btree.PersistedBTreeBuilderTest
Tests run: 1, Failures: 0, Errors: 0, Skipped: 1, Time elapsed: 0 sec - in org.apache.directory.mavibot.btree.PersistedBTreeBuilderTest
Running org.apache.directory.mavibot.btree.PersistedBTreeDuplicateKeyTest
Tests run: 16, Failures: 0, Errors: 0, Skipped: 1, Time elapsed: 0.552 sec - in org.apache.directory.mavibot.btree.PersistedBTreeDuplicateKeyTest
Running org.apache.directory.mavibot.btree.InMemoryLeafTest
Tests run: 8, Failures: 0, Errors: 0, Skipped: 0, Time elapsed: 0.001 sec - in org.apache.directory.mavibot.btree.InMemoryLeafTest
Running org.apache.directory.mavibot.btree.RecordManagerTest
/tmp/junit556480597692159845/c6633047-ba02-4ee6-9fa9-756eb4851add/mavibot.db
/tmp/junit2750749375262754684/c667ed9d-6b99-4111-848f-fd6f0192d684/mavibot.db
/tmp/junit927378499773932543/18087f23-ba91-424c-b950-e5413daf1d24/mavibot.db
/tmp/junit945916537717564724/22315ad7-f717-4937-b237-a83c263a2a7c/mavibot.db
/tmp/junit5895145018191908152/1cedb5e9-bcf8-4f5c-94e3-464106b6d1e9/mavibot.db
/tmp/junit6610234601200587869/26f2cb23-4ca7-4bdd-b09c-eaa79b84131a/mavibot.db
/tmp/junit6443065615222011768/a69c37bf-2c48-4dd0-8f73-a69252f49dd1/mavibot.db
/tmp/junit5476216550653469529/795d70db-c2a4-46fb-807a-c88f2b052b55/mavibot.db
/tmp/junit3607797676069172113/1261f8da-fe9a-470e-b372-0421fd233503/mavibot.db
Tests run: 11, Failures: 0, Errors: 0, Skipped: 2, Time elapsed: 0.101 sec - in org.apache.directory.mavibot.btree.RecordManagerTest
Running org.apache.directory.mavibot.btree.RecordManagerPrivateMethodTest
/tmp/junit7030453585014266210/75a33bcb-efd6-4a2b-88dc-483401dd433a/mavibot.db
/tmp/junit8879394313347751889/4536b148-7e93-4d94-b870-6bec3c7d3053/mavibot.db
Tests run: 2, Failures: 0, Errors: 0, Skipped: 0, Time elapsed: 0.005 sec - in org.apache.directory.mavibot.btree.RecordManagerPrivateMethodTest
Running org.apache.directory.mavibot.btree.RevisionNameSerializerTest
Tests run: 1, Failures: 0, Errors: 0, Skipped: 0, Time elapsed: 0 sec - in org.apache.directory.mavibot.btree.RevisionNameSerializerTest
Running org.apache.directory.mavibot.btree.RecordManagerFreePageTest
Delta : 4987, nbError = 0, Nb insertion per second : 2000
Tests run: 1, Failures: 0, Errors: 0, Skipped: 0, Time elapsed: 5.069 sec - in org.apache.directory.mavibot.btree.RecordManagerFreePageTest
Running org.apache.directory.mavibot.btree.PersistedStoreTest
Tests run: 3, Failures: 0, Errors: 0, Skipped: 0, Time elapsed: 0.003 sec - in org.apache.directory.mavibot.btree.PersistedStoreTest
Running org.apache.directory.mavibot.btree.PersistedSubBtreeKeyCursorTest
Tests run: 1, Failures: 0, Errors: 0, Skipped: 0, Time elapsed: 0.002 sec - in org.apache.directory.mavibot.btree.PersistedSubBtreeKeyCursorTest
Running org.apache.directory.mavibot.btree.PersistedBTreeTransactionTest
Delta without transaction for 100K elements = 317
Tests run: 2, Failures: 0, Errors: 0, Skipped: 1, Time elapsed: 0.321 sec - in org.apache.directory.mavibot.btree.PersistedBTreeTransactionTest
Running org.apache.directory.mavibot.btree.RecordManagerWithDuplicatesTest
Tests run: 3, Failures: 0, Errors: 0, Skipped: 0, Time elapsed: 0.084 sec - in org.apache.directory.mavibot.btree.RecordManagerWithDuplicatesTest
Running org.apache.directory.mavibot.btree.comparator.BooleanArrayComparatorTest
Tests run: 1, Failures: 0, Errors: 0, Skipped: 0, Time elapsed: 0 sec - in org.apache.directory.mavibot.btree.comparator.BooleanArrayComparatorTest
Running org.apache.directory.mavibot.btree.comparator.CharComparatorTest
Tests run: 1, Failures: 0, Errors: 0, Skipped: 0, Time elapsed: 0.001 sec - in org.apache.directory.mavibot.btree.comparator.CharComparatorTest
Running org.apache.directory.mavibot.btree.comparator.StringComparatorTest
Tests run: 1, Failures: 0, Errors: 0, Skipped: 0, Time elapsed: 0 sec - in org.apache.directory.mavibot.btree.comparator.StringComparatorTest
Running org.apache.directory.mavibot.btree.comparator.ByteArrayComparatorTest
Tests run: 1, Failures: 0, Errors: 0, Skipped: 0, Time elapsed: 0 sec - in org.apache.directory.mavibot.btree.comparator.ByteArrayComparatorTest
Running org.apache.directory.mavibot.btree.comparator.BooleanComparatorTest
Tests run: 1, Failures: 0, Errors: 0, Skipped: 0, Time elapsed: 0.001 sec - in org.apache.directory.mavibot.btree.comparator.BooleanComparatorTest
Running org.apache.directory.mavibot.btree.comparator.LongArrayComparatorTest
Tests run: 1, Failures: 0, Errors: 0, Skipped: 0, Time elapsed: 0 sec - in org.apache.directory.mavibot.btree.comparator.LongArrayComparatorTest
Running org.apache.directory.mavibot.btree.comparator.ByteComparatorTest
Tests run: 1, Failures: 0, Errors: 0, Skipped: 0, Time elapsed: 0 sec - in org.apache.directory.mavibot.btree.comparator.ByteComparatorTest
Running org.apache.directory.mavibot.btree.comparator.ShortComparatorTest
Tests run: 1, Failures: 0, Errors: 0, Skipped: 0, Time elapsed: 0 sec - in org.apache.directory.mavibot.btree.comparator.ShortComparatorTest
Running org.apache.directory.mavibot.btree.comparator.IntComparatorTest
Tests run: 1, Failures: 0, Errors: 0, Skipped: 0, Time elapsed: 0 sec - in org.apache.directory.mavibot.btree.comparator.IntComparatorTest
Running org.apache.directory.mavibot.btree.comparator.CharArrayComparatorTest
Tests run: 1, Failures: 0, Errors: 0, Skipped: 0, Time elapsed: 0 sec - in org.apache.directory.mavibot.btree.comparator.CharArrayComparatorTest
Running org.apache.directory.mavibot.btree.comparator.LongComparatorTest
Tests run: 1, Failures: 0, Errors: 0, Skipped: 0, Time elapsed: 0 sec - in org.apache.directory.mavibot.btree.comparator.LongComparatorTest
Running org.apache.directory.mavibot.btree.comparator.IntArrayComparatorTest
Tests run: 1, Failures: 0, Errors: 0, Skipped: 0, Time elapsed: 0 sec - in org.apache.directory.mavibot.btree.comparator.IntArrayComparatorTest
Running org.apache.directory.mavibot.btree.comparator.ShortArrayComparatorTest
Tests run: 1, Failures: 0, Errors: 0, Skipped: 0, Time elapsed: 0 sec - in org.apache.directory.mavibot.btree.comparator.ShortArrayComparatorTest
Running org.apache.directory.mavibot.btree.InMemoryBTreeConfigurationTest
Tests run: 2, Failures: 0, Errors: 0, Skipped: 0, Time elapsed: 0.275 sec - in org.apache.directory.mavibot.btree.InMemoryBTreeConfigurationTest
Running org.apache.directory.mavibot.btree.MultiThreadedInMemoryBtreeTest
 Time to create 1M entries : 650 milliseconds
Written 0 elements
Written 10000 elements
Written 20000 elements
Written 30000 elements
Written 40000 elements
 Time to create 50K entries and to have 100 threads reading them : 1 seconds
Tests run: 2, Failures: 0, Errors: 0, Skipped: 0, Time elapsed: 2.655 sec - in org.apache.directory.mavibot.btree.MultiThreadedInMemoryBtreeTest
Running org.apache.directory.mavibot.btree.InMemoryBulkDataSorterTest
Tests run: 2, Failures: 0, Errors: 0, Skipped: 0, Time elapsed: 7.467 sec - in org.apache.directory.mavibot.btree.InMemoryBulkDataSorterTest
Running org.apache.directory.mavibot.btree.InMemoryBTreeBuilderTest
built rootpage : Node[r0, nbElems:1] -> {r0|<5>|r0}
Tests run: 1, Failures: 0, Errors: 0, Skipped: 0, Time elapsed: 0.002 sec - in org.apache.directory.mavibot.btree.InMemoryBTreeBuilderTest
Running org.apache.directory.mavibot.btree.serializer.BooleanSerializerTest
Tests run: 1, Failures: 0, Errors: 0, Skipped: 0, Time elapsed: 0 sec - in org.apache.directory.mavibot.btree.serializer.BooleanSerializerTest
Running org.apache.directory.mavibot.btree.serializer.IntSerializerTest
Tests run: 1, Failures: 0, Errors: 0, Skipped: 0, Time elapsed: 0 sec - in org.apache.directory.mavibot.btree.serializer.IntSerializerTest
Running org.apache.directory.mavibot.btree.serializer.LongArraySerializerTest
Tests run: 1, Failures: 0, Errors: 0, Skipped: 1, Time elapsed: 0 sec - in org.apache.directory.mavibot.btree.serializer.LongArraySerializerTest
Running org.apache.directory.mavibot.btree.serializer.StringSerializerTest
Tests run: 1, Failures: 0, Errors: 0, Skipped: 0, Time elapsed: 0 sec - in org.apache.directory.mavibot.btree.serializer.StringSerializerTest
Running org.apache.directory.mavibot.btree.serializer.CharSerializerTest
Tests run: 1, Failures: 0, Errors: 0, Skipped: 0, Time elapsed: 0 sec - in org.apache.directory.mavibot.btree.serializer.CharSerializerTest
Running org.apache.directory.mavibot.btree.serializer.ByteSerializerTest
Tests run: 1, Failures: 0, Errors: 0, Skipped: 0, Time elapsed: 0 sec - in org.apache.directory.mavibot.btree.serializer.ByteSerializerTest
Running org.apache.directory.mavibot.btree.serializer.ByteArraySerializerTest
Tests run: 1, Failures: 0, Errors: 0, Skipped: 0, Time elapsed: 0 sec - in org.apache.directory.mavibot.btree.serializer.ByteArraySerializerTest
Running org.apache.directory.mavibot.btree.serializer.ShortSerializerTest
Tests run: 1, Failures: 0, Errors: 0, Skipped: 0, Time elapsed: 0 sec - in org.apache.directory.mavibot.btree.serializer.ShortSerializerTest
Running org.apache.directory.mavibot.btree.serializer.LongSerializerTest
Tests run: 1, Failures: 0, Errors: 0, Skipped: 0, Time elapsed: 0 sec - in org.apache.directory.mavibot.btree.serializer.LongSerializerTest
Running org.apache.directory.mavibot.btree.PersistedBTreeBrowseTest
Tests run: 24, Failures: 0, Errors: 0, Skipped: 2, Time elapsed: 27.528 sec - in org.apache.directory.mavibot.btree.PersistedBTreeBrowseTest
Running org.apache.directory.mavibot.btree.InMemoryBTreeDuplicateKeyTest
Tests run: 14, Failures: 0, Errors: 0, Skipped: 1, Time elapsed: 0.009 sec - in org.apache.directory.mavibot.btree.InMemoryBTreeDuplicateKeyTest
Running org.apache.directory.mavibot.btree.PersistedReadTest
Tests run: 3, Failures: 0, Errors: 0, Skipped: 0, Time elapsed: 0.004 sec - in org.apache.directory.mavibot.btree.PersistedReadTest
Running org.apache.directory.mavibot.btree.RevisionNameComparatorTest
Tests run: 1, Failures: 0, Errors: 0, Skipped: 0, Time elapsed: 0 sec - in org.apache.directory.mavibot.btree.RevisionNameComparatorTest

Results :

Tests run: 158, Failures: 0, Errors: 0, Skipped: 10

[JENKINS] Recording test results
[INFO] 
[INFO] --- maven-jar-plugin:2.5:jar (default-jar) @ mavibot ---
[INFO] Building jar: <https://builds.apache.org/job/dir-mavibot-ubuntu-deploy/ws/mavibot/target/mavibot-1.0.0-M6-SNAPSHOT.jar>
[INFO] 
[INFO] --- maven-site-plugin:3.3:attach-descriptor (attach-descriptor) @ mavibot ---
[INFO] 
[INFO] --- tools-maven-plugin:1.4:verify-legal-files (verify-legal-files) @ mavibot ---
[INFO] Checking legal files in: mavibot-1.0.0-M6-SNAPSHOT.jar
[INFO] 
[INFO] --- maven-source-plugin:2.2.1:jar-no-fork (attach-source) @ mavibot ---
[INFO] Building jar: <https://builds.apache.org/job/dir-mavibot-ubuntu-deploy/ws/mavibot/target/mavibot-1.0.0-M6-SNAPSHOT-sources.jar>
[INFO] 
[INFO] --- maven-install-plugin:2.5.1:install (default-install) @ mavibot ---
[INFO] Installing <https://builds.apache.org/job/dir-mavibot-ubuntu-deploy/ws/mavibot/target/mavibot-1.0.0-M6-SNAPSHOT.jar>
to /home/jenkins/jenkins-slave/maven-repositories/1/org/apache/directory/mavibot/mavibot/1.0.0-M6-SNAPSHOT/mavibot-1.0.0-M6-SNAPSHOT.jar
[INFO] Installing <https://builds.apache.org/job/dir-mavibot-ubuntu-deploy/ws/mavibot/pom.xml>
to /home/jenkins/jenkins-slave/maven-repositories/1/org/apache/directory/mavibot/mavibot/1.0.0-M6-SNAPSHOT/mavibot-1.0.0-M6-SNAPSHOT.pom
[INFO] Installing <https://builds.apache.org/job/dir-mavibot-ubuntu-deploy/ws/mavibot/target/mavibot-1.0.0-M6-SNAPSHOT-sources.jar>
to /home/jenkins/jenkins-slave/maven-repositories/1/org/apache/directory/mavibot/mavibot/1.0.0-M6-SNAPSHOT/mavibot-1.0.0-M6-SNAPSHOT-sources.jar
[INFO] 
[INFO] --- maven-deploy-plugin:2.8.1:deploy (default-deploy) @ mavibot ---
Downloading: https://repository.apache.org/content/repositories/snapshots/org/apache/directory/mavibot/mavibot/1.0.0-M6-SNAPSHOT/maven-metadata.xml
Downloaded: https://repository.apache.org/content/repositories/snapshots/org/apache/directory/mavibot/mavibot/1.0.0-M6-SNAPSHOT/maven-metadata.xml
(1015 B at 0.1 KB/sec)
Uploading: https://repository.apache.org/content/repositories/snapshots/org/apache/directory/mavibot/mavibot/1.0.0-M6-SNAPSHOT/mavibot-1.0.0-M6-20140822.030711-50.jar
[WARNING] Failed to upload SHA-1 checksum for <https://builds.apache.org/job/dir-mavibot-ubuntu-deploy/ws/mavibot/target/mavibot-1.0.0-M6-SNAPSHOT.jar>:
Failed to transfer file: https://repository.apache.org/content/repositories/snapshots/org/apache/directory/mavibot/mavibot/1.0.0-M6-SNAPSHOT/mavibot-1.0.0-M6-20140822.030711-50.jar.sha1.
Return code is: 502, ReasonPhrase:Proxy Error.
org.apache.maven.wagon.TransferFailedException: Failed to transfer file: https://repository.apache.org/content/repositories/snapshots/org/apache/directory/mavibot/mavibot/1.0.0-M6-SNAPSHOT/mavibot-1.0.0-M6-20140822.030711-50.jar.sha1.
Return code is: 502, ReasonPhrase:Proxy Error.
	at org.apache.maven.wagon.shared.http4.AbstractHttpClientWagon.put(AbstractHttpClientWagon.java:562)
	at org.apache.maven.wagon.shared.http4.AbstractHttpClientWagon.put(AbstractHttpClientWagon.java:471)
	at org.apache.maven.wagon.shared.http4.AbstractHttpClientWagon.putFromStream(AbstractHttpClientWagon.java:465)
	at org.sonatype.aether.connector.wagon.WagonRepositoryConnector$PutTask.uploadChecksum(WagonRepositoryConnector.java:886)
	at org.sonatype.aether.connector.wagon.WagonRepositoryConnector$PutTask.uploadChecksums(WagonRepositoryConnector.java:861)
	at org.sonatype.aether.connector.wagon.WagonRepositoryConnector$PutTask.run(WagonRepositoryConnector.java:818)
	at org.sonatype.aether.connector.wagon.WagonRepositoryConnector.put(WagonRepositoryConnector.java:467)
	at org.sonatype.aether.impl.internal.DefaultDeployer.deploy(DefaultDeployer.java:274)
	at org.sonatype.aether.impl.internal.DefaultDeployer.deploy(DefaultDeployer.java:211)
	at org.sonatype.aether.impl.internal.DefaultRepositorySystem.deploy(DefaultRepositorySystem.java:443)
	at org.apache.maven.artifact.deployer.DefaultArtifactDeployer.deploy(DefaultArtifactDeployer.java:137)
	at org.apache.maven.plugin.deploy.AbstractDeployMojo.deploy(AbstractDeployMojo.java:171)
	at org.apache.maven.plugin.deploy.DeployMojo.deployProject(DeployMojo.java:248)
	at org.apache.maven.plugin.deploy.DeployMojo.execute(DeployMojo.java:169)
	at org.apache.maven.plugin.DefaultBuildPluginManager.executeMojo(DefaultBuildPluginManager.java:101)
	at org.apache.maven.lifecycle.internal.MojoExecutor.execute(MojoExecutor.java:209)
	at org.apache.maven.lifecycle.internal.MojoExecutor.execute(MojoExecutor.java:153)
	at org.apache.maven.lifecycle.internal.MojoExecutor.execute(MojoExecutor.java:145)
	at org.apache.maven.lifecycle.internal.LifecycleModuleBuilder.buildProject(LifecycleModuleBuilder.java:84)
	at org.apache.maven.lifecycle.internal.LifecycleModuleBuilder.buildProject(LifecycleModuleBuilder.java:59)
	at org.apache.maven.lifecycle.internal.LifecycleStarter.singleThreadedBuild(LifecycleStarter.java:183)
	at org.apache.maven.lifecycle.internal.LifecycleStarter.execute(LifecycleStarter.java:161)
	at org.apache.maven.DefaultMaven.doExecute(DefaultMaven.java:320)
	at org.apache.maven.DefaultMaven.execute(DefaultMaven.java:156)
	at org.jvnet.hudson.maven3.launcher.Maven3Launcher.main(Maven3Launcher.java:117)
	at sun.reflect.NativeMethodAccessorImpl.invoke0(Native Method)
	at sun.reflect.NativeMethodAccessorImpl.invoke(NativeMethodAccessorImpl.java:57)
	at sun.reflect.DelegatingMethodAccessorImpl.invoke(DelegatingMethodAccessorImpl.java:43)
	at java.lang.reflect.Method.invoke(Method.java:606)
	at org.codehaus.plexus.classworlds.launcher.Launcher.launchStandard(Launcher.java:329)
	at org.codehaus.plexus.classworlds.launcher.Launcher.launch(Launcher.java:239)
	at org.jvnet.hudson.maven3.agent.Maven3Main.launch(Maven3Main.java:178)
	at sun.reflect.NativeMethodAccessorImpl.invoke0(Native Method)
	at sun.reflect.NativeMethodAccessorImpl.invoke(NativeMethodAccessorImpl.java:57)
	at sun.reflect.DelegatingMethodAccessorImpl.invoke(DelegatingMethodAccessorImpl.java:43)
	at java.lang.reflect.Method.invoke(Method.java:606)
	at hudson.maven.Maven3Builder.call(Maven3Builder.java:134)
	at hudson.maven.Maven3Builder.call(Maven3Builder.java:69)
	at hudson.remoting.UserRequest.perform(UserRequest.java:118)
	at hudson.remoting.UserRequest.perform(UserRequest.java:48)
	at hudson.remoting.Request$2.run(Request.java:328)
	at hudson.remoting.InterceptingExecutorService$1.call(InterceptingExecutorService.java:72)
	at java.util.concurrent.FutureTask$Sync.innerRun(FutureTask.java:334)
	at java.util.concurrent.FutureTask.run(FutureTask.java:166)
	at java.util.concurrent.ThreadPoolExecutor.runWorker(ThreadPoolExecutor.java:1145)
	at java.util.concurrent.ThreadPoolExecutor$Worker.run(ThreadPoolExecutor.java:615)
	at java.lang.Thread.run(Thread.java:724)
Uploaded: https://repository.apache.org/content/repositories/snapshots/org/apache/directory/mavibot/mavibot/1.0.0-M6-SNAPSHOT/mavibot-1.0.0-M6-20140822.030711-50.jar
(261 KB at 1.8 KB/sec)
Uploading: https://repository.apache.org/content/repositories/snapshots/org/apache/directory/mavibot/mavibot/1.0.0-M6-SNAPSHOT/mavibot-1.0.0-M6-20140822.030711-50.pom
Uploaded: https://repository.apache.org/content/repositories/snapshots/org/apache/directory/mavibot/mavibot/1.0.0-M6-SNAPSHOT/mavibot-1.0.0-M6-20140822.030711-50.pom
(3 KB at 0.7 KB/sec)
Downloading: https://repository.apache.org/content/repositories/snapshots/org/apache/directory/mavibot/mavibot/maven-metadata.xml
[WARNING] Could not transfer metadata org.apache.directory.mavibot:mavibot/maven-metadata.xml
from/to apache.snapshots.https (https://repository.apache.org/content/repositories/snapshots):
Failed to transfer file: https://repository.apache.org/content/repositories/snapshots/org/apache/directory/mavibot/mavibot/maven-metadata.xml.
Return code is: 502, ReasonPhrase:Proxy Error.
[INFO] ------------------------------------------------------------------------
[INFO] Reactor Summary:
[INFO] 
[INFO] ApacheDS Mavibot Parent ........................... SUCCESS [2:29.721s]
[INFO] ApacheDS MVCC BTree implementation ................ FAILURE [4:47.115s]
[INFO] Apache Mavibot Distribution ....................... SKIPPED
[INFO] ------------------------------------------------------------------------
[INFO] BUILD FAILURE
[INFO] ------------------------------------------------------------------------
[INFO] Total time: 7:20.026s
[INFO] Finished at: Fri Aug 22 03:10:36 UTC 2014
[INFO] Final Memory: 28M/260M
[INFO] ------------------------------------------------------------------------
Waiting for Jenkins to finish collecting data[ERROR] Failed to execute goal org.apache.maven.plugins:maven-deploy-plugin:2.8.1:deploy
(default-deploy) on project mavibot: Failed to retrieve remote metadata org.apache.directory.mavibot:mavibot/maven-metadata.xml:
Could not transfer metadata org.apache.directory.mavibot:mavibot/maven-metadata.xml from/to
apache.snapshots.https (https://repository.apache.org/content/repositories/snapshots): Failed
to transfer file: https://repository.apache.org/content/repositories/snapshots/org/apache/directory/mavibot/mavibot/maven-metadata.xml.
Return code is: 502, ReasonPhrase:Proxy Error. -> [Help 1]
[ERROR] 
[ERROR] To see the full stack trace of the errors, re-run Maven with the -e switch.
[ERROR] Re-run Maven using the -X switch to enable full debug logging.
[ERROR] 
[ERROR] For more information about the errors and possible solutions, please read the following
articles:
[ERROR] [Help 1] http://cwiki.apache.org/confluence/display/MAVEN/MojoExecutionException
[ERROR] 
[ERROR] After correcting the problems, you can resume the build with the command
[ERROR]   mvn <goals> -rf :mavibot

[JENKINS] Archiving <https://builds.apache.org/job/dir-mavibot-ubuntu-deploy/ws/mavibot/pom.xml>
to org.apache.directory.mavibot/mavibot/1.0.0-M6-SNAPSHOT/mavibot-1.0.0-M6-SNAPSHOT.pom
[JENKINS] Archiving <https://builds.apache.org/job/dir-mavibot-ubuntu-deploy/ws/mavibot/target/mavibot-1.0.0-M6-SNAPSHOT.jar>
to org.apache.directory.mavibot/mavibot/1.0.0-M6-SNAPSHOT/mavibot-1.0.0-M6-SNAPSHOT.jar
[JENKINS] Archiving <https://builds.apache.org/job/dir-mavibot-ubuntu-deploy/ws/mavibot/target/mavibot-1.0.0-M6-SNAPSHOT-sources.jar>
to org.apache.directory.mavibot/mavibot/1.0.0-M6-SNAPSHOT/mavibot-1.0.0-M6-SNAPSHOT-sources.jar
Sending artifact delta relative to dir-mavibot-ubuntu-deploy ? ApacheDS MVCC BTree implementation
#347
Archived 3 artifacts
Archive block size is 32768
Received 0 blocks and 524333 bytes
Compression is 0.0%
Took 0.34 sec
[JENKINS] Archiving <https://builds.apache.org/job/dir-mavibot-ubuntu-deploy/ws/pom.xml>
to org.apache.directory.mavibot/mavibot-parent/1.0.0-M6-SNAPSHOT/mavibot-parent-1.0.0-M6-SNAPSHOT.pom
Sending artifact delta relative to dir-mavibot-ubuntu-deploy ? ApacheDS Mavibot Parent #347
Archived 1 artifacts
Archive block size is 32768
Received 0 blocks and 15073 bytes
Compression is 0.0%
Took 78 ms
[JENKINS] Archiving <https://builds.apache.org/job/dir-mavibot-ubuntu-deploy/ws/distribution/pom.xml>
to org.apache.directory.mavibot/distribution/1.0.0-M6-SNAPSHOT/distribution-1.0.0-M6-SNAPSHOT.pom
Sending artifact delta relative to dir-mavibot-ubuntu-deploy ? Apache Mavibot Distribution
#347
Archived 1 artifacts
Archive block size is 32768
Received 0 blocks and 2815 bytes
Compression is 0.0%
Took 89 ms
channel stopped

Mime
View raw message