directory-notifications mailing list archives

Site index · List index
Message view « Date » · « Thread »
Top « Date » · « Thread »
From Apache Jenkins Server <jenk...@builds.apache.org>
Subject Build failed in Jenkins: dir-apacheds-ubuntu-deploy #1384
Date Fri, 11 Jul 2014 05:09:54 GMT
See <https://builds.apache.org/job/dir-apacheds-ubuntu-deploy/1384/>

------------------------------------------
[...truncated 7770 lines...]
[INFO] Installing <https://builds.apache.org/job/dir-apacheds-ubuntu-deploy/ws/trunk/kerberos-test/target/apacheds-kerberos-test-2.0.0-M18-SNAPSHOT.jar>
to /home/jenkins/jenkins-slave/maven-repositories/0/org/apache/directory/server/apacheds-kerberos-test/2.0.0-M18-SNAPSHOT/apacheds-kerberos-test-2.0.0-M18-SNAPSHOT.jar
[INFO] Installing <https://builds.apache.org/job/dir-apacheds-ubuntu-deploy/ws/trunk/kerberos-test/pom.xml>
to /home/jenkins/jenkins-slave/maven-repositories/0/org/apache/directory/server/apacheds-kerberos-test/2.0.0-M18-SNAPSHOT/apacheds-kerberos-test-2.0.0-M18-SNAPSHOT.pom
[INFO] Installing <https://builds.apache.org/job/dir-apacheds-ubuntu-deploy/ws/trunk/kerberos-test/target/apacheds-kerberos-test-2.0.0-M18-SNAPSHOT-tests.jar>
to /home/jenkins/jenkins-slave/maven-repositories/0/org/apache/directory/server/apacheds-kerberos-test/2.0.0-M18-SNAPSHOT/apacheds-kerberos-test-2.0.0-M18-SNAPSHOT-tests.jar
[INFO] Installing <https://builds.apache.org/job/dir-apacheds-ubuntu-deploy/ws/trunk/kerberos-test/target/apacheds-kerberos-test-2.0.0-M18-SNAPSHOT-sources.jar>
to /home/jenkins/jenkins-slave/maven-repositories/0/org/apache/directory/server/apacheds-kerberos-test/2.0.0-M18-SNAPSHOT/apacheds-kerberos-test-2.0.0-M18-SNAPSHOT-sources.jar
[INFO] 
[INFO] --- maven-deploy-plugin:2.8.1:deploy (default-deploy) @ apacheds-kerberos-test ---
Downloading: https://repository.apache.org/content/repositories/snapshots/org/apache/directory/server/apacheds-kerberos-test/2.0.0-M18-SNAPSHOT/maven-metadata.xml
Downloaded: https://repository.apache.org/content/repositories/snapshots/org/apache/directory/server/apacheds-kerberos-test/2.0.0-M18-SNAPSHOT/maven-metadata.xml
(2 KB at 1.9 KB/sec)
Uploading: https://repository.apache.org/content/repositories/snapshots/org/apache/directory/server/apacheds-kerberos-test/2.0.0-M18-SNAPSHOT/apacheds-kerberos-test-2.0.0-M18-20140711.050456-8.jar
Uploaded: https://repository.apache.org/content/repositories/snapshots/org/apache/directory/server/apacheds-kerberos-test/2.0.0-M18-SNAPSHOT/apacheds-kerberos-test-2.0.0-M18-20140711.050456-8.jar
(7 KB at 20.2 KB/sec)
Uploading: https://repository.apache.org/content/repositories/snapshots/org/apache/directory/server/apacheds-kerberos-test/2.0.0-M18-SNAPSHOT/apacheds-kerberos-test-2.0.0-M18-20140711.050456-8.pom
Uploaded: https://repository.apache.org/content/repositories/snapshots/org/apache/directory/server/apacheds-kerberos-test/2.0.0-M18-SNAPSHOT/apacheds-kerberos-test-2.0.0-M18-20140711.050456-8.pom
(5 KB at 11.6 KB/sec)
Downloading: https://repository.apache.org/content/repositories/snapshots/org/apache/directory/server/apacheds-kerberos-test/maven-metadata.xml
Downloaded: https://repository.apache.org/content/repositories/snapshots/org/apache/directory/server/apacheds-kerberos-test/maven-metadata.xml
(417 B at 2.0 KB/sec)
Uploading: https://repository.apache.org/content/repositories/snapshots/org/apache/directory/server/apacheds-kerberos-test/2.0.0-M18-SNAPSHOT/maven-metadata.xml
Uploaded: https://repository.apache.org/content/repositories/snapshots/org/apache/directory/server/apacheds-kerberos-test/2.0.0-M18-SNAPSHOT/maven-metadata.xml
(2 KB at 4.1 KB/sec)
Uploading: https://repository.apache.org/content/repositories/snapshots/org/apache/directory/server/apacheds-kerberos-test/maven-metadata.xml
Uploaded: https://repository.apache.org/content/repositories/snapshots/org/apache/directory/server/apacheds-kerberos-test/maven-metadata.xml
(417 B at 1.1 KB/sec)
Uploading: https://repository.apache.org/content/repositories/snapshots/org/apache/directory/server/apacheds-kerberos-test/2.0.0-M18-SNAPSHOT/apacheds-kerberos-test-2.0.0-M18-20140711.050456-8-tests.jar
Uploaded: https://repository.apache.org/content/repositories/snapshots/org/apache/directory/server/apacheds-kerberos-test/2.0.0-M18-SNAPSHOT/apacheds-kerberos-test-2.0.0-M18-20140711.050456-8-tests.jar
(32 KB at 77.5 KB/sec)
Uploading: https://repository.apache.org/content/repositories/snapshots/org/apache/directory/server/apacheds-kerberos-test/2.0.0-M18-SNAPSHOT/maven-metadata.xml
Uploaded: https://repository.apache.org/content/repositories/snapshots/org/apache/directory/server/apacheds-kerberos-test/2.0.0-M18-SNAPSHOT/maven-metadata.xml
(2 KB at 3.6 KB/sec)
Uploading: https://repository.apache.org/content/repositories/snapshots/org/apache/directory/server/apacheds-kerberos-test/2.0.0-M18-SNAPSHOT/apacheds-kerberos-test-2.0.0-M18-20140711.050456-8-sources.jar
Uploaded: https://repository.apache.org/content/repositories/snapshots/org/apache/directory/server/apacheds-kerberos-test/2.0.0-M18-SNAPSHOT/apacheds-kerberos-test-2.0.0-M18-20140711.050456-8-sources.jar
(7 KB at 13.4 KB/sec)
Uploading: https://repository.apache.org/content/repositories/snapshots/org/apache/directory/server/apacheds-kerberos-test/2.0.0-M18-SNAPSHOT/maven-metadata.xml
Uploaded: https://repository.apache.org/content/repositories/snapshots/org/apache/directory/server/apacheds-kerberos-test/2.0.0-M18-SNAPSHOT/maven-metadata.xml
(2 KB at 3.4 KB/sec)
[JENKINS] Archiving disabled
[INFO]                                                                         
[INFO] ------------------------------------------------------------------------
[INFO] Building ApacheDS Server Integration 2.0.0-M18-SNAPSHOT
[INFO] ------------------------------------------------------------------------
Downloading: http://repo.maven.apache.org/maven2/org/apache/directory/api/api-dsml-engine/1.0.0-M23/api-dsml-engine-1.0.0-M23.pom
Downloaded: http://repo.maven.apache.org/maven2/org/apache/directory/api/api-dsml-engine/1.0.0-M23/api-dsml-engine-1.0.0-M23.pom
(3 KB at 20.8 KB/sec)
Downloading: http://repo.maven.apache.org/maven2/org/apache/directory/api/api-dsml-parent/1.0.0-M23/api-dsml-parent-1.0.0-M23.pom
Downloaded: http://repo.maven.apache.org/maven2/org/apache/directory/api/api-dsml-parent/1.0.0-M23/api-dsml-parent-1.0.0-M23.pom
(2 KB at 74.5 KB/sec)
Downloading: http://repo.maven.apache.org/maven2/org/apache/directory/api/api-dsml-parser/1.0.0-M23/api-dsml-parser-1.0.0-M23.pom
Downloaded: http://repo.maven.apache.org/maven2/org/apache/directory/api/api-dsml-parser/1.0.0-M23/api-dsml-parser-1.0.0-M23.pom
(4 KB at 159.8 KB/sec)
Downloading: http://repo.maven.apache.org/maven2/org/apache/directory/api/api-dsml-engine/1.0.0-M23/api-dsml-engine-1.0.0-M23.jar
Downloading: http://repo.maven.apache.org/maven2/org/apache/directory/api/api-dsml-parser/1.0.0-M23/api-dsml-parser-1.0.0-M23.jar
Downloaded: http://repo.maven.apache.org/maven2/org/apache/directory/api/api-dsml-engine/1.0.0-M23/api-dsml-engine-1.0.0-M23.jar
(16 KB at 395.6 KB/sec)
Downloaded: http://repo.maven.apache.org/maven2/org/apache/directory/api/api-dsml-parser/1.0.0-M23/api-dsml-parser-1.0.0-M23.jar
(210 KB at 5371.0 KB/sec)
[INFO] 
[INFO] --- maven-clean-plugin:2.4.1:clean (default-clean) @ apacheds-server-integ ---
[INFO] 
[INFO] --- maven-remote-resources-plugin:1.2.1:process (default) @ apacheds-server-integ ---
[INFO] 
[INFO] --- maven-resources-plugin:2.6:resources (default-resources) @ apacheds-server-integ
---
[INFO] Using 'UTF-8' encoding to copy filtered resources.
[INFO] Copying 0 resource
[INFO] Copying 3 resources
[INFO] 
[INFO] --- maven-compiler-plugin:3.1:compile (default-compile) @ apacheds-server-integ ---
[INFO] Changes detected - recompiling the module!
[INFO] Compiling 1 source file to <https://builds.apache.org/job/dir-apacheds-ubuntu-deploy/ws/trunk/server-integ/target/classes>
[INFO] 
[INFO] --- maven-dependency-plugin:2.8:copy (copy) @ apacheds-server-integ ---
[INFO] Configured Artifact: org.apache.directory.api:api-ldap-extras-codec:?:jar
[INFO] Copying api-ldap-extras-codec-1.0.0-M23.jar to <https://builds.apache.org/job/dir-apacheds-ubuntu-deploy/ws/trunk/server-integ/target/pluginDirectory/api-ldap-extras-codec-1.0.0-M23.jar>
[INFO] 
[INFO] --- maven-resources-plugin:2.6:testResources (default-testResources) @ apacheds-server-integ
---
[INFO] Using 'UTF-8' encoding to copy filtered resources.
[INFO] Copying 8 resources
[INFO] Copying 3 resources
[INFO] 
[INFO] --- maven-compiler-plugin:3.1:testCompile (default-testCompile) @ apacheds-server-integ
---
[INFO] Changes detected - recompiling the module!
[INFO] Compiling 76 source files to <https://builds.apache.org/job/dir-apacheds-ubuntu-deploy/ws/trunk/server-integ/target/test-classes>
[WARNING] <https://builds.apache.org/job/dir-apacheds-ubuntu-deploy/ws/trunk/server-integ/src/test/java/org/apache/directory/server/operations/bind/SaslBindIT.java>:
<https://builds.apache.org/job/dir-apacheds-ubuntu-deploy/ws/trunk/server-integ/src/test/java/org/apache/directory/server/operations/bind/SaslBindIT.java>
uses unchecked or unsafe operations.
[WARNING] <https://builds.apache.org/job/dir-apacheds-ubuntu-deploy/ws/trunk/server-integ/src/test/java/org/apache/directory/server/operations/bind/SaslBindIT.java>:
Recompile with -Xlint:unchecked for details.
[INFO] 
[INFO] --- maven-surefire-plugin:2.17:test (default-test) @ apacheds-server-integ ---
[INFO] Surefire report directory: <https://builds.apache.org/job/dir-apacheds-ubuntu-deploy/ws/trunk/server-integ/target/surefire-reports>

-------------------------------------------------------
 T E S T S
-------------------------------------------------------
Running org.apache.directory.dsml.engine.Dsmlv2EngineIT
Tests run: 2, Failures: 0, Errors: 0, Skipped: 0, Time elapsed: 11.055 sec - in org.apache.directory.dsml.engine.Dsmlv2EngineIT
Running org.apache.directory.server.schema.SchemaIT
Tests run: 3, Failures: 0, Errors: 0, Skipped: 0, Time elapsed: 34.603 sec - in org.apache.directory.server.schema.SchemaIT
Running org.apache.directory.server.operations.add.AddAliasIT
Tests run: 3, Failures: 0, Errors: 0, Skipped: 0, Time elapsed: 11.251 sec - in org.apache.directory.server.operations.add.AddAliasIT
Running org.apache.directory.server.operations.add.AddIT
Tests run: 33, Failures: 0, Errors: 0, Skipped: 0, Time elapsed: 57.084 sec - in org.apache.directory.server.operations.add.AddIT
Running org.apache.directory.server.operations.add.AddingEntriesWithSpecialCharactersInRDNIT
Tests run: 9, Failures: 0, Errors: 0, Skipped: 0, Time elapsed: 17.766 sec - in org.apache.directory.server.operations.add.AddingEntriesWithSpecialCharactersInRDNIT
Running org.apache.directory.server.operations.delete.DeleteIT
Tests run: 8, Failures: 0, Errors: 0, Skipped: 0, Time elapsed: 11.696 sec - in org.apache.directory.server.operations.delete.DeleteIT
Running org.apache.directory.server.operations.delete.DeleteAliasIT
Tests run: 2, Failures: 0, Errors: 0, Skipped: 0, Time elapsed: 10.04 sec - in org.apache.directory.server.operations.delete.DeleteAliasIT
Running org.apache.directory.server.operations.compare.CompareIT
Tests run: 7, Failures: 0, Errors: 0, Skipped: 0, Time elapsed: 13.793 sec - in org.apache.directory.server.operations.compare.CompareIT
Running org.apache.directory.server.operations.compare.MatchingRuleCompareIT
Tests run: 2, Failures: 0, Errors: 0, Skipped: 0, Time elapsed: 8.729 sec - in org.apache.directory.server.operations.compare.MatchingRuleCompareIT
Running org.apache.directory.server.operations.extended.PwdModifyIT
Tests run: 9, Failures: 0, Errors: 0, Skipped: 0, Time elapsed: 14.173 sec - in org.apache.directory.server.operations.extended.PwdModifyIT
Running org.apache.directory.server.operations.extended.WhoAmIIT
Tests run: 1, Failures: 0, Errors: 0, Skipped: 0, Time elapsed: 7.697 sec - in org.apache.directory.server.operations.extended.WhoAmIIT
Running org.apache.directory.server.operations.extended.StoredProcedureIT
Tests run: 2, Failures: 0, Errors: 0, Skipped: 2, Time elapsed: 12.99 sec - in org.apache.directory.server.operations.extended.StoredProcedureIT
Running org.apache.directory.server.operations.extended.ExtendedIT
Tests run: 1, Failures: 0, Errors: 0, Skipped: 0, Time elapsed: 8.488 sec - in org.apache.directory.server.operations.extended.ExtendedIT
Running org.apache.directory.server.operations.modify.IllegalModificationIT
Killed

Results :

Tests run: 82, Failures: 0, Errors: 0, Skipped: 2

[JENKINS] Recording test results
[JENKINS] Archiving disabled
[INFO] ------------------------------------------------------------------------
[INFO] Reactor Summary:
[INFO] 
[INFO] ApacheDS .......................................... SUCCESS [33.121s]
[INFO] ApacheDS I18n ..................................... SUCCESS [20.768s]
[INFO] ApacheDS Core Constants ........................... SUCCESS [13.404s]
[INFO] ApacheDS Core API ................................. SUCCESS [45.073s]
[INFO] ApacheDS Core Shared .............................. SUCCESS [20.698s]
[INFO] ApacheDS Interceptors ............................. SUCCESS [5.053s]
[INFO] ApacheDS AdministrativePoint Interceptor .......... SUCCESS [17.356s]
[INFO] ApacheDS Authentication Interceptor ............... SUCCESS [20.165s]
[INFO] ApacheDS Interceptor to increment numeric attributes  SUCCESS [14.334s]
[INFO] ApacheDS Authorization Interceptor ................ SUCCESS [21.338s]
[INFO] ApacheDS ChangeLog Interceptor .................... SUCCESS [24.100s]
[INFO] ApacheDS Collective Attribute Interceptor ......... SUCCESS [16.980s]
[INFO] ApacheDS Event Interceptor ........................ SUCCESS [14.440s]
[INFO] ApacheDS Exception Interceptor .................... SUCCESS [14.941s]
[INFO] ApacheDS Journal Interceptor ...................... SUCCESS [15.117s]
[INFO] ApacheDS Normalization Interceptor ................ SUCCESS [18.220s]
[INFO] ApacheDS Operational Attribute Interceptor ........ SUCCESS [16.824s]
[INFO] ApacheDS Referral Interceptor ..................... SUCCESS [14.372s]
[INFO] ApacheDS Schema Interceptor ....................... SUCCESS [19.881s]
[INFO] ApacheDS Subtree Interceptor ...................... SUCCESS [23.955s]
[INFO] ApacheDS Triggers Interceptor ..................... SUCCESS [16.320s]
[INFO] ApacheDS Core ..................................... SUCCESS [23.750s]
[INFO] ApacheDS Core AVL ................................. SUCCESS [28.893s]
[INFO] ApacheDS Generalized (X) DBM Partition ............ SUCCESS [35.678s]
[INFO] ApacheDS LDIF Partition ........................... SUCCESS [32.417s]
[INFO] ApacheDS JDBM Partition ........................... SUCCESS [1:47.280s]
[INFO] ApacheDS Mavibot Partition ........................ SUCCESS [20.301s]
[INFO] ApacheDS Core Annotations ......................... SUCCESS [1:41.911s]
[INFO] ApacheDS Core JNDI ................................ SUCCESS [19.806s]
[INFO] ApacheDS Protocol Kerberos Codec .................. SUCCESS [45.218s]
[INFO] ApacheDS Interceptors for Kerberos ................ SUCCESS [17.987s]
[INFO] ApacheDS Protocol Dhcp ............................ SUCCESS [17.581s]
[INFO] ApacheDS Protocol Shared .......................... SUCCESS [16.770s]
[INFO] ApacheDS Protocol Dns ............................. SUCCESS [20.273s]
[INFO] ApacheDS Protocol Kerberos ........................ SUCCESS [17.711s]
[INFO] ApacheDS Protocol Ldap ............................ SUCCESS [2:16.224s]
[INFO] ApacheDS Protocol Ntp ............................. SUCCESS [18.293s]
[INFO] Apacheds Server Annotations ....................... SUCCESS [1:43.890s]
[INFO] ApacheDS Server Config ............................ SUCCESS [32.516s]
[INFO] ApacheDS Server JNDI .............................. SUCCESS [15.629s]
[INFO] ApacheDS Test Framework ........................... SUCCESS [3:05.816s]
[INFO] ApacheDS All ...................................... SUCCESS [12.590s]
[INFO] ApacheDS Logger Interceptor ....................... SUCCESS [15.223s]
[INFO] ApacheDS Password Hashing Interceptor ............. SUCCESS [14.405s]
[INFO] ApacheDS Core Integration ......................... SUCCESS [34:52.390s]
[INFO] ApacheDS Protocol Kerberos Test ................... SUCCESS [1:09.547s]
[INFO] ApacheDS Server Integration ....................... FAILURE [3:51.738s]
[INFO] ApacheDS DirectoryService-WebApp bridge ........... SKIPPED
[INFO] ApacheDS Jetty HTTP Server Integration ............ SKIPPED
[INFO] ApacheDS Service Builder .......................... SKIPPED
[INFO] Apache Directory LDAP Client API test ............. SKIPPED
[INFO] kerberos-client ................................... SKIPPED
[INFO] ApacheDS Service .................................. SKIPPED
[INFO] ApacheDS Wrapper .................................. SKIPPED
[INFO] ApacheDS Installers Maven Plugin .................. SKIPPED
[INFO] ApacheDS Installers ............................... SKIPPED
[INFO] ApacheDS Mavibot bulkloader ....................... SKIPPED
[INFO] ------------------------------------------------------------------------
[INFO] BUILD FAILURE
[INFO] ------------------------------------------------------------------------
[INFO] Total time: 1:04:51.245s
[INFO] Finished at: Fri Jul 11 05:08:56 UTC 2014
[INFO] Final Memory: 61M/390M
[INFO] ------------------------------------------------------------------------
[JENKINS] Archiving disabled
[JENKINS] Archiving disabled
[JENKINS] Archiving disabled
[JENKINS] Archiving disabled
[JENKINS] Archiving disabled
[JENKINS] Archiving disabled
[JENKINS] Archiving disabled
[JENKINS] Archiving disabled
[JENKINS] Archiving disabled
[JENKINS] Archiving disabled
[JENKINS] Archiving disabled
[JENKINS] Archiving disabled
[JENKINS] Archiving disabled
[JENKINS] Archiving disabled
[JENKINS] Archiving disabled
[JENKINS] Archiving disabled
[JENKINS] Archiving disabled
[JENKINS] Archiving disabled
[JENKINS] Archiving disabled
[JENKINS] Archiving disabled
[JENKINS] Archiving disabled
[JENKINS] Archiving disabled
[JENKINS] Archiving disabled
[JENKINS] Archiving disabled
[JENKINS] Archiving disabled
[JENKINS] Archiving disabled
[JENKINS] Archiving disabled
[JENKINS] Archiving disabled
[JENKINS] Archiving disabled
[JENKINS] Archiving disabled
[JENKINS] Archiving disabled
[JENKINS] Archiving disabled
[JENKINS] Archiving disabled
[JENKINS] Archiving disabled
[JENKINS] Archiving disabled
[JENKINS] Archiving disabled
[JENKINS] Archiving disabled
[JENKINS] Archiving disabled
[JENKINS] Archiving disabled
[JENKINS] Archiving disabled
[JENKINS] Archiving disabled
[JENKINS] Archiving disabled
[JENKINS] Archiving disabled
[JENKINS] Archiving disabled
[JENKINS] Archiving disabled
[JENKINS] Archiving disabled
[JENKINS] Archiving disabled
[JENKINS] Archiving disabled
[JENKINS] Archiving disabled
[JENKINS] Archiving disabled
[JENKINS] Archiving disabled
[JENKINS] Archiving disabled
[JENKINS] Archiving disabled
[JENKINS] Archiving disabled
[JENKINS] Archiving disabled
[JENKINS] Archiving disabled
[JENKINS] Archiving disabled
Waiting for Jenkins to finish collecting data
[ERROR] Failed to execute goal org.apache.maven.plugins:maven-surefire-plugin:2.17:test (default-test)
on project apacheds-server-integ: Execution default-test of goal org.apache.maven.plugins:maven-surefire-plugin:2.17:test
failed: The forked VM terminated without properly saying goodbye. VM crash or System.exit
called?
[ERROR] Command was /bin/sh -c cd <https://builds.apache.org/job/dir-apacheds-ubuntu-deploy/ws/trunk/server-integ>
&& /home/hudson/tools/java/jdk1.7.0_25-32/jre/bin/java -Xmx1024m -jar <https://builds.apache.org/job/dir-apacheds-ubuntu-deploy/ws/trunk/server-integ/target/surefire/surefirebooter2817751375394735206.jar>
<https://builds.apache.org/job/dir-apacheds-ubuntu-deploy/ws/trunk/server-integ/target/surefire/surefire8099643694801127033tmp>
<https://builds.apache.org/job/dir-apacheds-ubuntu-deploy/ws/trunk/server-integ/target/surefire/surefire_27873039480752060484tmp>
[ERROR] -> [Help 1]
[ERROR] 
[ERROR] To see the full stack trace of the errors, re-run Maven with the -e switch.
[ERROR] Re-run Maven using the -X switch to enable full debug logging.
[ERROR] 
[ERROR] For more information about the errors and possible solutions, please read the following
articles:
[ERROR] [Help 1] http://cwiki.apache.org/confluence/display/MAVEN/PluginExecutionException
[ERROR] 
[ERROR] After correcting the problems, you can resume the build with the command
[ERROR]   mvn <goals> -rf :apacheds-server-integ
channel stopped

Mime
View raw message