directory-notifications mailing list archives

Site index · List index
Message view « Date » · « Thread »
Top « Date » · « Thread »
From Apache Jenkins Server <jenk...@builds.apache.org>
Subject Build failed in Jenkins: dir-apacheds-ubuntu-deploy #1387
Date Mon, 14 Jul 2014 04:10:20 GMT
See <https://builds.apache.org/job/dir-apacheds-ubuntu-deploy/1387/>

------------------------------------------
[...truncated 2676 lines...]
[JENKINS] Recording test results[INFO] 
[INFO] --- maven-bundle-plugin:2.5.0:bundle (default-bundle) @ apacheds-interceptor-kerberos
---

[INFO] 
[INFO] --- maven-site-plugin:3.3:attach-descriptor (attach-descriptor) @ apacheds-interceptor-kerberos
---
[INFO] 
[INFO] --- tools-maven-plugin:1.4:verify-legal-files (verify-legal-files) @ apacheds-interceptor-kerberos
---
[INFO] Checking legal files in: apacheds-interceptor-kerberos-2.0.0-M18-SNAPSHOT.jar
[WARNING] Failed to getClass for org.apache.maven.plugin.source.SourceJarMojo
[INFO] 
[INFO] --- maven-source-plugin:2.2.1:jar (attach-sources) @ apacheds-interceptor-kerberos
---
[INFO] Building jar: <https://builds.apache.org/job/dir-apacheds-ubuntu-deploy/ws/trunk/interceptor-kerberos/target/apacheds-interceptor-kerberos-2.0.0-M18-SNAPSHOT-sources.jar>
[INFO] 
[INFO] --- maven-install-plugin:2.5.1:install (default-install) @ apacheds-interceptor-kerberos
---
[INFO] Installing <https://builds.apache.org/job/dir-apacheds-ubuntu-deploy/ws/trunk/interceptor-kerberos/target/apacheds-interceptor-kerberos-2.0.0-M18-SNAPSHOT.jar>
to /home/jenkins/jenkins-slave/maven-repositories/0/org/apache/directory/server/apacheds-interceptor-kerberos/2.0.0-M18-SNAPSHOT/apacheds-interceptor-kerberos-2.0.0-M18-SNAPSHOT.jar
[INFO] Installing <https://builds.apache.org/job/dir-apacheds-ubuntu-deploy/ws/trunk/interceptor-kerberos/pom.xml>
to /home/jenkins/jenkins-slave/maven-repositories/0/org/apache/directory/server/apacheds-interceptor-kerberos/2.0.0-M18-SNAPSHOT/apacheds-interceptor-kerberos-2.0.0-M18-SNAPSHOT.pom
[INFO] Installing <https://builds.apache.org/job/dir-apacheds-ubuntu-deploy/ws/trunk/interceptor-kerberos/target/apacheds-interceptor-kerberos-2.0.0-M18-SNAPSHOT-sources.jar>
to /home/jenkins/jenkins-slave/maven-repositories/0/org/apache/directory/server/apacheds-interceptor-kerberos/2.0.0-M18-SNAPSHOT/apacheds-interceptor-kerberos-2.0.0-M18-SNAPSHOT-sources.jar
[INFO] 
[INFO] --- maven-bundle-plugin:2.5.0:install (default-install) @ apacheds-interceptor-kerberos
---
[INFO] Installing org/apache/directory/server/apacheds-interceptor-kerberos/2.0.0-M18-SNAPSHOT/apacheds-interceptor-kerberos-2.0.0-M18-SNAPSHOT.jar
[INFO] Writing OBR metadata
[INFO] 
[INFO] --- maven-deploy-plugin:2.8.1:deploy (default-deploy) @ apacheds-interceptor-kerberos
---
Downloading: https://repository.apache.org/content/repositories/snapshots/org/apache/directory/server/apacheds-interceptor-kerberos/2.0.0-M18-SNAPSHOT/maven-metadata.xml
Downloaded: https://repository.apache.org/content/repositories/snapshots/org/apache/directory/server/apacheds-interceptor-kerberos/2.0.0-M18-SNAPSHOT/maven-metadata.xml
(2 KB at 0.9 KB/sec)
Uploading: https://repository.apache.org/content/repositories/snapshots/org/apache/directory/server/apacheds-interceptor-kerberos/2.0.0-M18-SNAPSHOT/apacheds-interceptor-kerberos-2.0.0-M18-20140714.040928-10.jar
Uploaded: https://repository.apache.org/content/repositories/snapshots/org/apache/directory/server/apacheds-interceptor-kerberos/2.0.0-M18-SNAPSHOT/apacheds-interceptor-kerberos-2.0.0-M18-20140714.040928-10.jar
(16 KB at 111.3 KB/sec)
Uploading: https://repository.apache.org/content/repositories/snapshots/org/apache/directory/server/apacheds-interceptor-kerberos/2.0.0-M18-SNAPSHOT/apacheds-interceptor-kerberos-2.0.0-M18-20140714.040928-10.pom
Uploaded: https://repository.apache.org/content/repositories/snapshots/org/apache/directory/server/apacheds-interceptor-kerberos/2.0.0-M18-SNAPSHOT/apacheds-interceptor-kerberos-2.0.0-M18-20140714.040928-10.pom
(5 KB at 29.2 KB/sec)
Downloading: https://repository.apache.org/content/repositories/snapshots/org/apache/directory/server/apacheds-interceptor-kerberos/maven-metadata.xml
Downloaded: https://repository.apache.org/content/repositories/snapshots/org/apache/directory/server/apacheds-interceptor-kerberos/maven-metadata.xml
(424 B at 0.4 KB/sec)
Uploading: https://repository.apache.org/content/repositories/snapshots/org/apache/directory/server/apacheds-interceptor-kerberos/2.0.0-M18-SNAPSHOT/maven-metadata.xml
Uploaded: https://repository.apache.org/content/repositories/snapshots/org/apache/directory/server/apacheds-interceptor-kerberos/2.0.0-M18-SNAPSHOT/maven-metadata.xml
(2 KB at 4.4 KB/sec)
Uploading: https://repository.apache.org/content/repositories/snapshots/org/apache/directory/server/apacheds-interceptor-kerberos/maven-metadata.xml
Uploaded: https://repository.apache.org/content/repositories/snapshots/org/apache/directory/server/apacheds-interceptor-kerberos/maven-metadata.xml
(424 B at 2.8 KB/sec)
Uploading: https://repository.apache.org/content/repositories/snapshots/org/apache/directory/server/apacheds-interceptor-kerberos/2.0.0-M18-SNAPSHOT/apacheds-interceptor-kerberos-2.0.0-M18-20140714.040928-10-sources.jar
Uploaded: https://repository.apache.org/content/repositories/snapshots/org/apache/directory/server/apacheds-interceptor-kerberos/2.0.0-M18-SNAPSHOT/apacheds-interceptor-kerberos-2.0.0-M18-20140714.040928-10-sources.jar
(12 KB at 206.2 KB/sec)
Uploading: https://repository.apache.org/content/repositories/snapshots/org/apache/directory/server/apacheds-interceptor-kerberos/2.0.0-M18-SNAPSHOT/maven-metadata.xml
Uploaded: https://repository.apache.org/content/repositories/snapshots/org/apache/directory/server/apacheds-interceptor-kerberos/2.0.0-M18-SNAPSHOT/maven-metadata.xml
(2 KB at 10.4 KB/sec)
[INFO] 
[INFO] --- maven-bundle-plugin:2.5.0:deploy (default-deploy) @ apacheds-interceptor-kerberos
---
[INFO] Remote OBR update disabled (enable with -DremoteOBR)
[JENKINS] Archiving disabled
[INFO]                                                                         
[INFO] ------------------------------------------------------------------------
[INFO] Building ApacheDS Protocol Dhcp 2.0.0-M18-SNAPSHOT
[INFO] ------------------------------------------------------------------------
[INFO] 
[INFO] --- maven-clean-plugin:2.4.1:clean (default-clean) @ apacheds-protocol-dhcp ---
[INFO] Deleting <https://builds.apache.org/job/dir-apacheds-ubuntu-deploy/ws/trunk/protocol-dhcp/target>
[INFO] 
[INFO] --- maven-remote-resources-plugin:1.2.1:process (default) @ apacheds-protocol-dhcp
---
[INFO] 
[INFO] --- maven-resources-plugin:2.6:resources (default-resources) @ apacheds-protocol-dhcp
---
[INFO] Using 'UTF-8' encoding to copy filtered resources.
[INFO] Copying 0 resource
[INFO] Copying 3 resources
[INFO] 
[INFO] --- maven-compiler-plugin:3.1:compile (default-compile) @ apacheds-protocol-dhcp ---
[INFO] Changes detected - recompiling the module!
[INFO] Compiling 116 source files to <https://builds.apache.org/job/dir-apacheds-ubuntu-deploy/ws/trunk/protocol-dhcp/target/classes>
[WARNING] <https://builds.apache.org/job/dir-apacheds-ubuntu-deploy/ws/trunk/protocol-dhcp/src/main/java/org/apache/directory/server/dhcp/options/OptionsField.java>:
Some input files use unchecked or unsafe operations.
[WARNING] <https://builds.apache.org/job/dir-apacheds-ubuntu-deploy/ws/trunk/protocol-dhcp/src/main/java/org/apache/directory/server/dhcp/options/OptionsField.java>:
Recompile with -Xlint:unchecked for details.
[INFO] 
[INFO] --- maven-resources-plugin:2.6:testResources (default-testResources) @ apacheds-protocol-dhcp
---
[INFO] Using 'UTF-8' encoding to copy filtered resources.
[INFO] Copying 5 resources
[INFO] Copying 3 resources
[INFO] 
[INFO] --- maven-compiler-plugin:3.1:testCompile (default-testCompile) @ apacheds-protocol-dhcp
---
[INFO] Changes detected - recompiling the module!
[INFO] Compiling 2 source files to <https://builds.apache.org/job/dir-apacheds-ubuntu-deploy/ws/trunk/protocol-dhcp/target/test-classes>
[INFO] 
[INFO] --- maven-surefire-plugin:2.17:test (default-test) @ apacheds-protocol-dhcp ---
[INFO] Surefire report directory: <https://builds.apache.org/job/dir-apacheds-ubuntu-deploy/ws/trunk/protocol-dhcp/target/surefire-reports>

-------------------------------------------------------
 T E S T S
-------------------------------------------------------
Running org.apache.directory.server.dhcp.DhcpMessageDecoderTest
SLF4J: The following set of substitute loggers may have been accessed
SLF4J: during the initialization phase. Logging calls during this
SLF4J: phase were not honored. However, subsequent logging calls to these
SLF4J: loggers will work as normally expected.
SLF4J: See also http://www.slf4j.org/codes.html#substituteLogger
SLF4J: org.apache.directory.server.dhcp.DhcpMessageDecoderTest
Tests run: 2, Failures: 0, Errors: 0, Skipped: 0, Time elapsed: 0.151 sec - in org.apache.directory.server.dhcp.DhcpMessageDecoderTest

Results :

Tests run: 2, Failures: 0, Errors: 0, Skipped: 0

[JENKINS] Recording test results
[INFO] 
[INFO] --- maven-bundle-plugin:2.5.0:bundle (default-bundle) @ apacheds-protocol-dhcp ---
[INFO] 
[INFO] --- maven-site-plugin:3.3:attach-descriptor (attach-descriptor) @ apacheds-protocol-dhcp
---
[INFO] 
[INFO] --- tools-maven-plugin:1.4:verify-legal-files (verify-legal-files) @ apacheds-protocol-dhcp
---
[INFO] Checking legal files in: apacheds-protocol-dhcp-2.0.0-M18-SNAPSHOT.jar
[INFO] 
[INFO] --- maven-install-plugin:2.5.1:install (default-install) @ apacheds-protocol-dhcp ---
[INFO] Installing <https://builds.apache.org/job/dir-apacheds-ubuntu-deploy/ws/trunk/protocol-dhcp/target/apacheds-protocol-dhcp-2.0.0-M18-SNAPSHOT.jar>
to /home/jenkins/jenkins-slave/maven-repositories/0/org/apache/directory/server/apacheds-protocol-dhcp/2.0.0-M18-SNAPSHOT/apacheds-protocol-dhcp-2.0.0-M18-SNAPSHOT.jar
[INFO] Installing <https://builds.apache.org/job/dir-apacheds-ubuntu-deploy/ws/trunk/protocol-dhcp/pom.xml>
to /home/jenkins/jenkins-slave/maven-repositories/0/org/apache/directory/server/apacheds-protocol-dhcp/2.0.0-M18-SNAPSHOT/apacheds-protocol-dhcp-2.0.0-M18-SNAPSHOT.pom
[INFO] 
[INFO] --- maven-bundle-plugin:2.5.0:install (default-install) @ apacheds-protocol-dhcp ---
[INFO] Installing org/apache/directory/server/apacheds-protocol-dhcp/2.0.0-M18-SNAPSHOT/apacheds-protocol-dhcp-2.0.0-M18-SNAPSHOT.jar
[INFO] Writing OBR metadata
[INFO] 
[INFO] --- maven-deploy-plugin:2.8.1:deploy (default-deploy) @ apacheds-protocol-dhcp ---
Downloading: https://repository.apache.org/content/repositories/snapshots/org/apache/directory/server/apacheds-protocol-dhcp/2.0.0-M18-SNAPSHOT/maven-metadata.xml
[WARNING] Could not transfer metadata org.apache.directory.server:apacheds-protocol-dhcp:2.0.0-M18-SNAPSHOT/maven-metadata.xml
from/to apache.snapshots.https (https://repository.apache.org/content/repositories/snapshots):
Failed to transfer file: https://repository.apache.org/content/repositories/snapshots/org/apache/directory/server/apacheds-protocol-dhcp/2.0.0-M18-SNAPSHOT/maven-metadata.xml.
Return code is: 502, ReasonPhrase:Proxy Error.
[JENKINS] Archiving disabled
[INFO] ------------------------------------------------------------------------
[INFO] Reactor Summary:
[INFO] 
[INFO] ApacheDS .......................................... SUCCESS [7.319s]
[INFO] ApacheDS I18n ..................................... SUCCESS [9.610s]
[INFO] ApacheDS Core Constants ........................... SUCCESS [7.778s]
[INFO] ApacheDS Core API ................................. SUCCESS [19.435s]
[INFO] ApacheDS Core Shared .............................. SUCCESS [7.692s]
[INFO] ApacheDS Interceptors ............................. SUCCESS [0.882s]
[INFO] ApacheDS AdministrativePoint Interceptor .......... SUCCESS [10.613s]
[INFO] ApacheDS Authentication Interceptor ............... SUCCESS [11.482s]
[INFO] ApacheDS Interceptor to increment numeric attributes  SUCCESS [8.901s]
[INFO] ApacheDS Authorization Interceptor ................ SUCCESS [11.699s]
[INFO] ApacheDS ChangeLog Interceptor .................... SUCCESS [9.281s]
[INFO] ApacheDS Collective Attribute Interceptor ......... SUCCESS [6.627s]
[INFO] ApacheDS Event Interceptor ........................ SUCCESS [8.491s]
[INFO] ApacheDS Exception Interceptor .................... SUCCESS [8.843s]
[INFO] ApacheDS Journal Interceptor ...................... SUCCESS [7.745s]
[INFO] ApacheDS Normalization Interceptor ................ SUCCESS [9.763s]
[INFO] ApacheDS Operational Attribute Interceptor ........ SUCCESS [8.692s]
[INFO] ApacheDS Referral Interceptor ..................... SUCCESS [7.634s]
[INFO] ApacheDS Schema Interceptor ....................... SUCCESS [12.578s]
[INFO] ApacheDS Subtree Interceptor ...................... SUCCESS [11.311s]
[INFO] ApacheDS Triggers Interceptor ..................... SUCCESS [9.373s]
[INFO] ApacheDS Core ..................................... SUCCESS [14.881s]
[INFO] ApacheDS Core AVL ................................. SUCCESS [13.923s]
[INFO] ApacheDS Generalized (X) DBM Partition ............ SUCCESS [16.419s]
[INFO] ApacheDS LDIF Partition ........................... SUCCESS [27.647s]
[INFO] ApacheDS JDBM Partition ........................... SUCCESS [1:12.150s]
[INFO] ApacheDS Mavibot Partition ........................ SUCCESS [10.668s]
[INFO] ApacheDS Core Annotations ......................... SUCCESS [1:07.486s]
[INFO] ApacheDS Core JNDI ................................ SUCCESS [8.602s]
[INFO] ApacheDS Protocol Kerberos Codec .................. SUCCESS [19.416s]
[INFO] ApacheDS Interceptors for Kerberos ................ SUCCESS [10.453s]
[INFO] ApacheDS Protocol Dhcp ............................ FAILURE [39.430s]
[INFO] ApacheDS Protocol Shared .......................... SKIPPED
[INFO] ApacheDS Protocol Dns ............................. SKIPPED
[INFO] ApacheDS Protocol Kerberos ........................ SKIPPED
[INFO] ApacheDS Protocol Ldap ............................ SKIPPED
[INFO] ApacheDS Protocol Ntp ............................. SKIPPED
[INFO] Apacheds Server Annotations ....................... SKIPPED
[INFO] ApacheDS Server Config ............................ SKIPPED
[INFO] ApacheDS Server JNDI .............................. SKIPPED
[INFO] ApacheDS Test Framework ........................... SKIPPED
[INFO] ApacheDS All ...................................... SKIPPED
[INFO] ApacheDS Logger Interceptor ....................... SKIPPED
[INFO] ApacheDS Password Hashing Interceptor ............. SKIPPED
[INFO] ApacheDS Core Integration ......................... SKIPPED
[INFO] ApacheDS Protocol Kerberos Test ................... SKIPPED
[INFO] ApacheDS Server Integration ....................... SKIPPED
[INFO] ApacheDS DirectoryService-WebApp bridge ........... SKIPPED
[INFO] ApacheDS Jetty HTTP Server Integration ............ SKIPPED
[INFO] ApacheDS Service Builder .......................... SKIPPED
[INFO] Apache Directory LDAP Client API test ............. SKIPPED
[INFO] kerberos-client ................................... SKIPPED
[INFO] ApacheDS Service .................................. SKIPPED
[INFO] ApacheDS Wrapper .................................. SKIPPED
[INFO] ApacheDS Installers Maven Plugin .................. SKIPPED
[INFO] ApacheDS Installers ............................... SKIPPED
[INFO] ApacheDS Mavibot bulkloader ....................... SKIPPED
[INFO] ------------------------------------------------------------------------
[INFO] BUILD FAILURE
[INFO] ------------------------------------------------------------------------
[INFO] Total time: 8:31.572s
[INFO] Finished at: Mon Jul 14 04:10:10 UTC 2014
[INFO] Final Memory: 64M/424M
[INFO] ------------------------------------------------------------------------
[JENKINS] Archiving disabled
[JENKINS] Archiving disabled
[JENKINS] Archiving disabled
[JENKINS] Archiving disabled
[JENKINS] Archiving disabled
[JENKINS] Archiving disabled
[JENKINS] Archiving disabled
[JENKINS] Archiving disabled
[JENKINS] Archiving disabled
[JENKINS] Archiving disabled
[JENKINS] Archiving disabled
[JENKINS] Archiving disabled
[JENKINS] Archiving disabled
[JENKINS] Archiving disabled
[JENKINS] Archiving disabled
[JENKINS] Archiving disabled
[JENKINS] Archiving disabled
[JENKINS] Archiving disabled
[JENKINS] Archiving disabled
[JENKINS] Archiving disabled
[JENKINS] Archiving disabled
[JENKINS] Archiving disabled
[JENKINS] Archiving disabled
[JENKINS] Archiving disabled
[JENKINS] Archiving disabled
[JENKINS] Archiving disabled
[JENKINS] Archiving disabled
[JENKINS] Archiving disabled
[JENKINS] Archiving disabled
[JENKINS] Archiving disabled
[JENKINS] Archiving disabled
[JENKINS] Archiving disabled
[JENKINS] Archiving disabled
[JENKINS] Archiving disabled
[JENKINS] Archiving disabled
[JENKINS] Archiving disabled
[JENKINS] Archiving disabled
[JENKINS] Archiving disabled
[JENKINS] Archiving disabled
[JENKINS] Archiving disabled
[JENKINS] Archiving disabled
[JENKINS] Archiving disabled
[JENKINS] Archiving disabled
[JENKINS] Archiving disabled
[JENKINS] Archiving disabled
[JENKINS] Archiving disabled
[JENKINS] Archiving disabled
[JENKINS] Archiving disabled
[JENKINS] Archiving disabled
[JENKINS] Archiving disabled
[JENKINS] Archiving disabled
[JENKINS] Archiving disabled
[JENKINS] Archiving disabled
[JENKINS] Archiving disabled
[JENKINS] Archiving disabled
[JENKINS] Archiving disabled
[JENKINS] Archiving disabled
Waiting for Jenkins to finish collecting data
[ERROR] Failed to execute goal org.apache.maven.plugins:maven-deploy-plugin:2.8.1:deploy (default-deploy)
on project apacheds-protocol-dhcp: Failed to retrieve remote metadata org.apache.directory.server:apacheds-protocol-dhcp:2.0.0-M18-SNAPSHOT/maven-metadata.xml:
Could not transfer metadata org.apache.directory.server:apacheds-protocol-dhcp:2.0.0-M18-SNAPSHOT/maven-metadata.xml
from/to apache.snapshots.https (https://repository.apache.org/content/repositories/snapshots):
Failed to transfer file: https://repository.apache.org/content/repositories/snapshots/org/apache/directory/server/apacheds-protocol-dhcp/2.0.0-M18-SNAPSHOT/maven-metadata.xml.
Return code is: 502, ReasonPhrase:Proxy Error. -> [Help 1]
[ERROR] 
[ERROR] To see the full stack trace of the errors, re-run Maven with the -e switch.
[ERROR] Re-run Maven using the -X switch to enable full debug logging.
[ERROR] 
[ERROR] For more information about the errors and possible solutions, please read the following
articles:
[ERROR] [Help 1] http://cwiki.apache.org/confluence/display/MAVEN/MojoExecutionException
[ERROR] 
[ERROR] After correcting the problems, you can resume the build with the command
[ERROR]   mvn <goals> -rf :apacheds-protocol-dhcp
channel stopped

Mime
View raw message