directory-notifications mailing list archives

Site index · List index
Message view « Date » · « Thread »
Top « Date » · « Thread »
From Apache Jenkins Server <jenk...@builds.apache.org>
Subject Build failed in Jenkins: dir-apacheds-ubuntu-deploy #1393
Date Sun, 20 Jul 2014 04:22:01 GMT
See <https://builds.apache.org/job/dir-apacheds-ubuntu-deploy/1393/changes>

Changes:

[elecharny] Removed an empty directory

[elecharny] Removed an empty directory

------------------------------------------
[...truncated 7834 lines...]
Running org.apache.directory.server.operations.search.IndexedNegationSearchIT
Tests run: 3, Failures: 0, Errors: 0, Skipped: 0, Time elapsed: 1.1 sec - in org.apache.directory.server.operations.search.IndexedNegationSearchIT
Running org.apache.directory.server.operations.search.ReferralSearchMoveAndRenameIT
Tests run: 1, Failures: 0, Errors: 0, Skipped: 0, Time elapsed: 1.102 sec - in org.apache.directory.server.operations.search.ReferralSearchMoveAndRenameIT
Running org.apache.directory.server.operations.search.NegationSearchIT
Tests run: 2, Failures: 0, Errors: 0, Skipped: 0, Time elapsed: 1.056 sec - in org.apache.directory.server.operations.search.NegationSearchIT
Running org.apache.directory.server.operations.search.ReferralSearchIT
Tests run: 7, Failures: 0, Errors: 0, Skipped: 0, Time elapsed: 1.42 sec - in org.apache.directory.server.operations.search.ReferralSearchIT
Running org.apache.directory.server.operations.search.SortedSearchIT
Tests run: 6, Failures: 0, Errors: 0, Skipped: 0, Time elapsed: 2.476 sec - in org.apache.directory.server.operations.search.SortedSearchIT
Running org.apache.directory.server.operations.add.AddIT
Tests run: 33, Failures: 0, Errors: 0, Skipped: 0, Time elapsed: 5.875 sec - in org.apache.directory.server.operations.add.AddIT
Running org.apache.directory.server.operations.add.AddingEntriesWithSpecialCharactersInRDNIT
Tests run: 9, Failures: 0, Errors: 0, Skipped: 0, Time elapsed: 1.469 sec - in org.apache.directory.server.operations.add.AddingEntriesWithSpecialCharactersInRDNIT
Running org.apache.directory.server.operations.add.AddAliasIT
Tests run: 3, Failures: 0, Errors: 0, Skipped: 0, Time elapsed: 1.323 sec - in org.apache.directory.server.operations.add.AddAliasIT
Running org.apache.directory.server.operations.modifydn.MoveIT
Tests run: 4, Failures: 0, Errors: 0, Skipped: 0, Time elapsed: 1.115 sec - in org.apache.directory.server.operations.modifydn.MoveIT
Running org.apache.directory.server.operations.modifydn.ModifyDnReferralIT
Tests run: 7, Failures: 0, Errors: 0, Skipped: 0, Time elapsed: 1.097 sec - in org.apache.directory.server.operations.modifydn.ModifyDnReferralIT
Running org.apache.directory.server.operations.modifydn.ModifyRdnIT
Tests run: 19, Failures: 0, Errors: 0, Skipped: 2, Time elapsed: 1.963 sec - in org.apache.directory.server.operations.modifydn.ModifyRdnIT
Running org.apache.directory.server.operations.modify.ModifyMultipleChangesIT
Tests run: 2, Failures: 0, Errors: 0, Skipped: 0, Time elapsed: 1.077 sec - in org.apache.directory.server.operations.modify.ModifyMultipleChangesIT
Running org.apache.directory.server.operations.modify.IllegalModificationIT
Tests run: 2, Failures: 0, Errors: 0, Skipped: 0, Time elapsed: 1.015 sec - in org.apache.directory.server.operations.modify.IllegalModificationIT
Running org.apache.directory.server.operations.modify.ModifyRemoveIT
Tests run: 16, Failures: 0, Errors: 0, Skipped: 0, Time elapsed: 3.538 sec - in org.apache.directory.server.operations.modify.ModifyRemoveIT
Running org.apache.directory.server.operations.modify.ModifyReplaceIT
Tests run: 7, Failures: 0, Errors: 0, Skipped: 0, Time elapsed: 1.129 sec - in org.apache.directory.server.operations.modify.ModifyReplaceIT
Running org.apache.directory.server.operations.modify.ModifyAddIT
Tests run: 18, Failures: 0, Errors: 0, Skipped: 0, Time elapsed: 5.392 sec - in org.apache.directory.server.operations.modify.ModifyAddIT
Running org.apache.directory.server.operations.modify.ModifyReferralIT
Tests run: 4, Failures: 0, Errors: 0, Skipped: 0, Time elapsed: 1.076 sec - in org.apache.directory.server.operations.modify.ModifyReferralIT
Running org.apache.directory.server.operations.delete.DeleteAliasIT
Tests run: 2, Failures: 0, Errors: 0, Skipped: 0, Time elapsed: 1.079 sec - in org.apache.directory.server.operations.delete.DeleteAliasIT
Running org.apache.directory.server.operations.delete.DeleteIT
Tests run: 8, Failures: 0, Errors: 0, Skipped: 0, Time elapsed: 1.126 sec - in org.apache.directory.server.operations.delete.DeleteIT
Running org.apache.directory.server.operations.extended.StoredProcedureIT
Tests run: 2, Failures: 0, Errors: 0, Skipped: 2, Time elapsed: 0.993 sec - in org.apache.directory.server.operations.extended.StoredProcedureIT
Running org.apache.directory.server.operations.extended.PwdModifyIT
Tests run: 9, Failures: 0, Errors: 0, Skipped: 0, Time elapsed: 1.706 sec - in org.apache.directory.server.operations.extended.PwdModifyIT
Running org.apache.directory.server.operations.extended.ExtendedIT
Tests run: 1, Failures: 0, Errors: 0, Skipped: 0, Time elapsed: 0.984 sec - in org.apache.directory.server.operations.extended.ExtendedIT
Running org.apache.directory.server.operations.extended.WhoAmIIT
Tests run: 1, Failures: 0, Errors: 0, Skipped: 0, Time elapsed: 0.98 sec - in org.apache.directory.server.operations.extended.WhoAmIIT
Running org.apache.directory.server.operations.lookup.LookupIT
Tests run: 3, Failures: 0, Errors: 0, Skipped: 0, Time elapsed: 0.991 sec - in org.apache.directory.server.operations.lookup.LookupIT
Running org.apache.directory.server.operations.compare.MatchingRuleCompareIT
Tests run: 2, Failures: 0, Errors: 0, Skipped: 0, Time elapsed: 1.041 sec - in org.apache.directory.server.operations.compare.MatchingRuleCompareIT
Running org.apache.directory.server.operations.compare.CompareIT
Tests run: 7, Failures: 0, Errors: 0, Skipped: 0, Time elapsed: 1.052 sec - in org.apache.directory.server.operations.compare.CompareIT
Running org.apache.directory.server.ssl.LdapsUpdateCertificateIT
Tests run: 1, Failures: 0, Errors: 0, Skipped: 0, Time elapsed: 1.165 sec - in org.apache.directory.server.ssl.LdapsUpdateCertificateIT
Running org.apache.directory.server.ssl.StartTlsIT
Tests run: 1, Failures: 0, Errors: 0, Skipped: 0, Time elapsed: 1.714 sec - in org.apache.directory.server.ssl.StartTlsIT
Running org.apache.directory.server.ssl.LdapsIT
Tests run: 1, Failures: 0, Errors: 0, Skipped: 0, Time elapsed: 1.063 sec - in org.apache.directory.server.ssl.LdapsIT
Running org.apache.directory.server.ssl.StartTlsUpdateCertificateIT
Tests run: 1, Failures: 0, Errors: 0, Skipped: 0, Time elapsed: 3.154 sec - in org.apache.directory.server.ssl.StartTlsUpdateCertificateIT
Running org.apache.directory.server.ssl.StartTlsConfidentialityIT
Tests run: 1, Failures: 0, Errors: 0, Skipped: 0, Time elapsed: 1.142 sec - in org.apache.directory.server.ssl.StartTlsConfidentialityIT
Running org.apache.directory.server.admin.AdministrativePointModifyDelIT
Tests run: 3, Failures: 0, Errors: 0, Skipped: 1, Time elapsed: 1.23 sec - in org.apache.directory.server.admin.AdministrativePointModifyDelIT
Running org.apache.directory.server.admin.AdministrativePointAddIT
Tests run: 2, Failures: 0, Errors: 0, Skipped: 0, Time elapsed: 1.378 sec - in org.apache.directory.server.admin.AdministrativePointAddIT
Running org.apache.directory.server.admin.AdministrativePointPersistentIT
Tests run: 1, Failures: 0, Errors: 0, Skipped: 0, Time elapsed: 1.54 sec - in org.apache.directory.server.admin.AdministrativePointPersistentIT
Running org.apache.directory.server.admin.AdministrativePointModifyIT
Tests run: 1, Failures: 0, Errors: 0, Skipped: 0, Time elapsed: 1.271 sec - in org.apache.directory.server.admin.AdministrativePointModifyIT
Running org.apache.directory.dsml.engine.Dsmlv2EngineIT
Tests run: 2, Failures: 0, Errors: 0, Skipped: 0, Time elapsed: 1.118 sec - in org.apache.directory.dsml.engine.Dsmlv2EngineIT
Running org.apache.directory.IndexIT
Tests run: 2, Failures: 0, Errors: 0, Skipped: 1, Time elapsed: 0.433 sec - in org.apache.directory.IndexIT

Results :

Tests in error: 
  DelegatedAuthIT.testMultipleAuthenticators:183 ? NullPointer
  DelegatedAuthOverTlsIT.testDelegatedTlsAuthentication:125 ? IllegalState The c...
  DelegatedAuthOverSslIT.testDelegatedSSLAuthentication:125 ? NullPointer

Tests run: 449, Failures: 0, Errors: 3, Skipped: 15

[ERROR] There are test failures.

Please refer to <https://builds.apache.org/job/dir-apacheds-ubuntu-deploy/ws/trunk/server-integ/target/surefire-reports>
for the individual test results.
[JENKINS] Recording test results
[INFO] 
[INFO] --- maven-bundle-plugin:2.5.0:bundle (default-bundle) @ apacheds-server-integ ---
[INFO] 
[INFO] --- maven-site-plugin:3.3:attach-descriptor (attach-descriptor) @ apacheds-server-integ
---
[INFO] 
[INFO] --- maven-jar-plugin:2.5:test-jar (default) @ apacheds-server-integ ---
[INFO] Building jar: <https://builds.apache.org/job/dir-apacheds-ubuntu-deploy/ws/trunk/server-integ/target/apacheds-server-integ-2.0.0-M18-SNAPSHOT-tests.jar>
[INFO] 
[INFO] --- tools-maven-plugin:1.4:verify-legal-files (verify-legal-files) @ apacheds-server-integ
---
[INFO] Checking legal files in: apacheds-server-integ-2.0.0-M18-SNAPSHOT.jar
[INFO] Checking legal files in: apacheds-server-integ-2.0.0-M18-SNAPSHOT-tests.jar
[INFO] 
[INFO] --- maven-install-plugin:2.5.1:install (default-install) @ apacheds-server-integ ---
[INFO] Installing <https://builds.apache.org/job/dir-apacheds-ubuntu-deploy/ws/trunk/server-integ/target/apacheds-server-integ-2.0.0-M18-SNAPSHOT.jar>
to /home/jenkins/jenkins-slave/maven-repositories/1/org/apache/directory/server/apacheds-server-integ/2.0.0-M18-SNAPSHOT/apacheds-server-integ-2.0.0-M18-SNAPSHOT.jar
[INFO] Installing <https://builds.apache.org/job/dir-apacheds-ubuntu-deploy/ws/trunk/server-integ/pom.xml>
to /home/jenkins/jenkins-slave/maven-repositories/1/org/apache/directory/server/apacheds-server-integ/2.0.0-M18-SNAPSHOT/apacheds-server-integ-2.0.0-M18-SNAPSHOT.pom
[INFO] Installing <https://builds.apache.org/job/dir-apacheds-ubuntu-deploy/ws/trunk/server-integ/target/apacheds-server-integ-2.0.0-M18-SNAPSHOT-tests.jar>
to /home/jenkins/jenkins-slave/maven-repositories/1/org/apache/directory/server/apacheds-server-integ/2.0.0-M18-SNAPSHOT/apacheds-server-integ-2.0.0-M18-SNAPSHOT-tests.jar
[INFO] 
[INFO] --- maven-bundle-plugin:2.5.0:install (default-install) @ apacheds-server-integ ---
[INFO] Installing org/apache/directory/server/apacheds-server-integ/2.0.0-M18-SNAPSHOT/apacheds-server-integ-2.0.0-M18-SNAPSHOT.jar
[INFO] Writing OBR metadata
[INFO] 
[INFO] --- maven-deploy-plugin:2.8.1:deploy (default-deploy) @ apacheds-server-integ ---
Downloading: https://repository.apache.org/content/repositories/snapshots/org/apache/directory/server/apacheds-server-integ/2.0.0-M18-SNAPSHOT/maven-metadata.xml
[WARNING] Could not transfer metadata org.apache.directory.server:apacheds-server-integ:2.0.0-M18-SNAPSHOT/maven-metadata.xml
from/to apache.snapshots.https (https://repository.apache.org/content/repositories/snapshots):
repository.apache.org: Name or service not known
[JENKINS] Archiving disabled
[INFO] ------------------------------------------------------------------------
[INFO] Reactor Summary:
[INFO] 
[INFO] ApacheDS .......................................... SUCCESS [32.626s]
[INFO] ApacheDS I18n ..................................... SUCCESS [14.255s]
[INFO] ApacheDS Core Constants ........................... SUCCESS [8.225s]
[INFO] ApacheDS Core API ................................. SUCCESS [26.550s]
[INFO] ApacheDS Core Shared .............................. SUCCESS [9.066s]
[INFO] ApacheDS Interceptors ............................. SUCCESS [3.046s]
[INFO] ApacheDS AdministrativePoint Interceptor .......... SUCCESS [12.372s]
[INFO] ApacheDS Authentication Interceptor ............... SUCCESS [9.087s]
[INFO] ApacheDS Interceptor to increment numeric attributes  SUCCESS [8.861s]
[INFO] ApacheDS Authorization Interceptor ................ SUCCESS [12.090s]
[INFO] ApacheDS ChangeLog Interceptor .................... SUCCESS [8.800s]
[INFO] ApacheDS Collective Attribute Interceptor ......... SUCCESS [8.392s]
[INFO] ApacheDS Event Interceptor ........................ SUCCESS [8.520s]
[INFO] ApacheDS Exception Interceptor .................... SUCCESS [8.226s]
[INFO] ApacheDS Journal Interceptor ...................... SUCCESS [8.841s]
[INFO] ApacheDS Normalization Interceptor ................ SUCCESS [11.128s]
[INFO] ApacheDS Operational Attribute Interceptor ........ SUCCESS [8.820s]
[INFO] ApacheDS Referral Interceptor ..................... SUCCESS [7.967s]
[INFO] ApacheDS Schema Interceptor ....................... SUCCESS [11.605s]
[INFO] ApacheDS Subtree Interceptor ...................... SUCCESS [11.489s]
[INFO] ApacheDS Triggers Interceptor ..................... SUCCESS [8.197s]
[INFO] ApacheDS Core ..................................... SUCCESS [11.830s]
[INFO] ApacheDS Core AVL ................................. SUCCESS [17.152s]
[INFO] ApacheDS Generalized (X) DBM Partition ............ SUCCESS [18.482s]
[INFO] ApacheDS LDIF Partition ........................... SUCCESS [11.740s]
[INFO] ApacheDS JDBM Partition ........................... SUCCESS [20.588s]
[INFO] ApacheDS Mavibot Partition ........................ SUCCESS [11.336s]
[INFO] ApacheDS Core Annotations ......................... SUCCESS [20.795s]
[INFO] ApacheDS Core JNDI ................................ SUCCESS [11.431s]
[INFO] ApacheDS Protocol Kerberos Codec .................. SUCCESS [26.720s]
[INFO] ApacheDS Interceptors for Kerberos ................ SUCCESS [10.874s]
[INFO] ApacheDS Protocol Dhcp ............................ SUCCESS [8.548s]
[INFO] ApacheDS Protocol Shared .......................... SUCCESS [8.580s]
[INFO] ApacheDS Protocol Dns ............................. SUCCESS [14.287s]
[INFO] ApacheDS Protocol Kerberos ........................ SUCCESS [14.649s]
[INFO] ApacheDS Protocol Ldap ............................ SUCCESS [20.251s]
[INFO] ApacheDS Protocol Ntp ............................. SUCCESS [12.071s]
[INFO] Apacheds Server Annotations ....................... SUCCESS [25.913s]
[INFO] ApacheDS Server Config ............................ SUCCESS [14.876s]
[INFO] ApacheDS Server JNDI .............................. SUCCESS [10.965s]
[INFO] ApacheDS Test Framework ........................... SUCCESS [35.459s]
[INFO] ApacheDS All ...................................... SUCCESS [11.450s]
[INFO] ApacheDS Logger Interceptor ....................... SUCCESS [8.378s]
[INFO] ApacheDS Password Hashing Interceptor ............. SUCCESS [8.844s]
[INFO] ApacheDS Core Integration ......................... SUCCESS [3:11.182s]
[INFO] ApacheDS Protocol Kerberos Test ................... SUCCESS [19.743s]
[INFO] ApacheDS Server Integration ....................... FAILURE [4:47.748s]
[INFO] ApacheDS DirectoryService-WebApp bridge ........... SKIPPED
[INFO] ApacheDS Jetty HTTP Server Integration ............ SKIPPED
[INFO] ApacheDS Service Builder .......................... SKIPPED
[INFO] Apache Directory LDAP Client API test ............. SKIPPED
[INFO] kerberos-client ................................... SKIPPED
[INFO] ApacheDS Service .................................. SKIPPED
[INFO] ApacheDS Wrapper .................................. SKIPPED
[INFO] ApacheDS Installers Maven Plugin .................. SKIPPED
[INFO] ApacheDS Installers ............................... SKIPPED
[INFO] ApacheDS Mavibot bulkloader ....................... SKIPPED
[INFO] ------------------------------------------------------------------------
[INFO] BUILD FAILURE
[INFO] ------------------------------------------------------------------------
[INFO] Total time: 18:49.575s
[INFO] Finished at: Sun Jul 20 04:20:36 UTC 2014
[INFO] Final Memory: 58M/279M
[INFO] ------------------------------------------------------------------------
[JENKINS] Archiving disabled
[JENKINS] Archiving disabled
[JENKINS] Archiving disabled
[JENKINS] Archiving disabled
[JENKINS] Archiving disabled
[JENKINS] Archiving disabled
[JENKINS] Archiving disabled
[JENKINS] Archiving disabled
[JENKINS] Archiving disabled
[JENKINS] Archiving disabled
[JENKINS] Archiving disabled
[JENKINS] Archiving disabled
[JENKINS] Archiving disabled
[JENKINS] Archiving disabled
[JENKINS] Archiving disabled
[JENKINS] Archiving disabled
[JENKINS] Archiving disabled
[JENKINS] Archiving disabled
[JENKINS] Archiving disabled
[JENKINS] Archiving disabled
[JENKINS] Archiving disabled
[JENKINS] Archiving disabled
[JENKINS] Archiving disabled
[JENKINS] Archiving disabled
[JENKINS] Archiving disabled
[JENKINS] Archiving disabled
[JENKINS] Archiving disabled
[JENKINS] Archiving disabled
[JENKINS] Archiving disabled
[JENKINS] Archiving disabled
[JENKINS] Archiving disabled
[JENKINS] Archiving disabled
[JENKINS] Archiving disabled
[JENKINS] Archiving disabled
[JENKINS] Archiving disabled
[JENKINS] Archiving disabled
[JENKINS] Archiving disabled
[JENKINS] Archiving disabled
[JENKINS] Archiving disabled
[JENKINS] Archiving disabled
[JENKINS] Archiving disabled
[JENKINS] Archiving disabled
[JENKINS] Archiving disabled
[JENKINS] Archiving disabled
[JENKINS] Archiving disabled
[JENKINS] Archiving disabled
[JENKINS] Archiving disabled
[JENKINS] Archiving disabled
[JENKINS] Archiving disabled
[JENKINS] Archiving disabled
[JENKINS] Archiving disabled
[JENKINS] Archiving disabled
[JENKINS] Archiving disabled
[JENKINS] Archiving disabled
[JENKINS] Archiving disabled
[JENKINS] Archiving disabled
[JENKINS] Archiving disabled
Waiting for Jenkins to finish collecting data[ERROR] Failed to execute goal org.apache.maven.plugins:maven-deploy-plugin:2.8.1:deploy
(default-deploy) on project apacheds-server-integ: Failed to retrieve remote metadata org.apache.directory.server:apacheds-server-integ:2.0.0-M18-SNAPSHOT/maven-metadata.xml:
Could not transfer metadata org.apache.directory.server:apacheds-server-integ:2.0.0-M18-SNAPSHOT/maven-metadata.xml
from/to apache.snapshots.https (https://repository.apache.org/content/repositories/snapshots):
repository.apache.org: Name or service not known: Unknown host repository.apache.org: Name
or service not known -> [Help 1]
[ERROR] 
[ERROR] To see the full stack trace of the errors, re-run Maven with the -e switch.
[ERROR] Re-run Maven using the -X switch to enable full debug logging.
[ERROR] 
[ERROR] For more information about the errors and possible solutions, please read the following
articles:
[ERROR] [Help 1] http://cwiki.apache.org/confluence/display/MAVEN/MojoExecutionException
[ERROR] 
[ERROR] After correcting the problems, you can resume the build with the command
[ERROR]   mvn <goals> -rf :apacheds-server-integ

channel stopped

Mime
View raw message