directory-notifications mailing list archives

Site index · List index
Message view « Date » · « Thread »
Top « Date » · « Thread »
From Apache Jenkins Server <jenk...@builds.apache.org>
Subject Build failed in Jenkins: dir-apacheds-ubuntu-deploy #1362
Date Thu, 19 Jun 2014 04:20:34 GMT
See <https://builds.apache.org/job/dir-apacheds-ubuntu-deploy/1362/changes>

Changes:

[kayyagari] leaves are removed from memory after creating the size equivalent to numKeysInNode

------------------------------------------
[...truncated 4184 lines...]
Tests run: 1, Failures: 0, Errors: 0, Skipped: 0, Time elapsed: 1.048 sec - in org.apache.directory.server.core.subtree.SubentryServiceEntryModificationHandlingIT
Running org.apache.directory.server.core.authn.SimpleAuthenticationIT
Tests run: 12, Failures: 0, Errors: 0, Skipped: 0, Time elapsed: 1.492 sec - in org.apache.directory.server.core.authn.SimpleAuthenticationIT
Running org.apache.directory.server.core.trigger.TriggerInterceptorIT
Tests run: 1, Failures: 0, Errors: 0, Skipped: 1, Time elapsed: 0 sec - in org.apache.directory.server.core.trigger.TriggerInterceptorIT
Running org.apache.directory.server.core.trigger.SubentryServiceForTriggersIT
Tests run: 1, Failures: 0, Errors: 0, Skipped: 1, Time elapsed: 0.001 sec - in org.apache.directory.server.core.trigger.SubentryServiceForTriggersIT
Running org.apache.directory.server.core.collective.CollectiveAttributeServiceIT
----- Checking exclusions
found entry ou=partitions,ou=configuration,ou=system
found entry ou=services,ou=configuration,ou=system
found entry ou=users,ou=system
found entry ou=groups,ou=system
found entry prefNodeName=sysPrefRoot,ou=system
found entry ou=system
found entry ou=configuration,ou=system
found entry cn=Administrators,ou=groups,ou=system
found entry uid=admin,ou=system
found entry ou=interceptors,ou=configuration,ou=system
----- Exclusions OK
Tests run: 6, Failures: 0, Errors: 0, Skipped: 1, Time elapsed: 1.166 sec - in org.apache.directory.server.core.collective.CollectiveAttributeServiceIT
Running org.apache.directory.server.core.event.EventServiceIT
Tests run: 2, Failures: 0, Errors: 0, Skipped: 0, Time elapsed: 6.971 sec - in org.apache.directory.server.core.event.EventServiceIT
Running org.apache.directory.server.core.schema.MetaAttributeTypeHandlerIT
Tests run: 19, Failures: 0, Errors: 0, Skipped: 11, Time elapsed: 1.092 sec - in org.apache.directory.server.core.schema.MetaAttributeTypeHandlerIT
Running org.apache.directory.server.core.schema.MetaSchemaHandlerIT
Tests run: 29, Failures: 0, Errors: 0, Skipped: 16, Time elapsed: 1.177 sec - in org.apache.directory.server.core.schema.MetaSchemaHandlerIT
Running org.apache.directory.server.core.schema.MetaObjectClassHandlerIT
Tests run: 27, Failures: 0, Errors: 0, Skipped: 12, Time elapsed: 1.168 sec - in org.apache.directory.server.core.schema.MetaObjectClassHandlerIT
Running org.apache.directory.server.core.schema.ObjectClassCreateIT
Tests run: 4, Failures: 0, Errors: 0, Skipped: 0, Time elapsed: 1.01 sec - in org.apache.directory.server.core.schema.ObjectClassCreateIT
Running org.apache.directory.server.core.schema.MetaNormalizerHandlerIT
Tests run: 20, Failures: 0, Errors: 0, Skipped: 12, Time elapsed: 1.047 sec - in org.apache.directory.server.core.schema.MetaNormalizerHandlerIT
Running org.apache.directory.server.core.schema.MetaMatchingRuleHandlerIT
Tests run: 14, Failures: 0, Errors: 0, Skipped: 9, Time elapsed: 1.185 sec - in org.apache.directory.server.core.schema.MetaMatchingRuleHandlerIT
Running org.apache.directory.server.core.schema.SubschemaSubentryIT
Tests run: 18, Failures: 0, Errors: 0, Skipped: 1, Time elapsed: 24.401 sec - in org.apache.directory.server.core.schema.SubschemaSubentryIT
Running org.apache.directory.server.core.schema.SchemaServiceIT
Tests run: 23, Failures: 0, Errors: 0, Skipped: 0, Time elapsed: 2.717 sec - in org.apache.directory.server.core.schema.SchemaServiceIT
Running org.apache.directory.server.core.schema.SchemaPersistenceIT
Tests run: 2, Failures: 0, Errors: 0, Skipped: 0, Time elapsed: 3.111 sec - in org.apache.directory.server.core.schema.SchemaPersistenceIT
Running org.apache.directory.server.core.schema.PartitionSchemaLoaderIT
Tests run: 1, Failures: 0, Errors: 0, Skipped: 0, Time elapsed: 0.359 sec - in org.apache.directory.server.core.schema.PartitionSchemaLoaderIT
Running org.apache.directory.server.core.schema.MetaSyntaxHandlerIT
Tests run: 18, Failures: 0, Errors: 0, Skipped: 12, Time elapsed: 1.065 sec - in org.apache.directory.server.core.schema.MetaSyntaxHandlerIT
Running org.apache.directory.server.core.schema.MetaComparatorHandlerIT
Tests run: 20, Failures: 0, Errors: 0, Skipped: 12, Time elapsed: 1.024 sec - in org.apache.directory.server.core.schema.MetaComparatorHandlerIT
Running org.apache.directory.server.core.schema.MetaSyntaxCheckerHandlerIT
Tests run: 20, Failures: 0, Errors: 0, Skipped: 12, Time elapsed: 1.073 sec - in org.apache.directory.server.core.schema.MetaSyntaxCheckerHandlerIT
Running org.apache.directory.server.core.authz.support.MaxImmSubFilterIT
Tests run: 5, Failures: 0, Errors: 0, Skipped: 1, Time elapsed: 0.899 sec - in org.apache.directory.server.core.authz.support.MaxImmSubFilterIT
Running org.apache.directory.server.core.authz.SearchAuthorizationIT
Tests run: 16, Failures: 0, Errors: 0, Skipped: 1, Time elapsed: 3.204 sec - in org.apache.directory.server.core.authz.SearchAuthorizationIT
Running org.apache.directory.server.core.authz.MoveRenameAuthorizationIT
Tests run: 5, Failures: 0, Errors: 0, Skipped: 0, Time elapsed: 3.841 sec - in org.apache.directory.server.core.authz.MoveRenameAuthorizationIT
Running org.apache.directory.server.core.authz.AuthorizationServiceAsNonAdminIT
Tests run: 4, Failures: 0, Errors: 0, Skipped: 0, Time elapsed: 1.003 sec - in org.apache.directory.server.core.authz.AuthorizationServiceAsNonAdminIT
Running org.apache.directory.server.core.authz.AdministratorsGroupIT
Tests run: 2, Failures: 0, Errors: 0, Skipped: 0, Time elapsed: 2.959 sec - in org.apache.directory.server.core.authz.AdministratorsGroupIT
Running org.apache.directory.server.core.authz.DeleteAuthorizationIT
Tests run: 4, Failures: 0, Errors: 0, Skipped: 0, Time elapsed: 1.455 sec - in org.apache.directory.server.core.authz.DeleteAuthorizationIT
Running org.apache.directory.server.core.authz.CompareAuthorizationIT
Tests run: 5, Failures: 0, Errors: 0, Skipped: 0, Time elapsed: 1.493 sec - in org.apache.directory.server.core.authz.CompareAuthorizationIT
Running org.apache.directory.server.core.authz.LookupAuthorizationIT
Tests run: 1, Failures: 0, Errors: 0, Skipped: 0, Time elapsed: 0.948 sec - in org.apache.directory.server.core.authz.LookupAuthorizationIT
Running org.apache.directory.server.core.authz.AuthorizationServiceAsAdminIT
Tests run: 4, Failures: 0, Errors: 0, Skipped: 0, Time elapsed: 0.925 sec - in org.apache.directory.server.core.authz.AuthorizationServiceAsAdminIT
Running org.apache.directory.server.core.authz.AddAuthorizationIT
Tests run: 4, Failures: 0, Errors: 0, Skipped: 0, Time elapsed: 1.637 sec - in org.apache.directory.server.core.authz.AddAuthorizationIT
Running org.apache.directory.server.core.authz.GeneralAuthorizationIT
Tests run: 1, Failures: 0, Errors: 0, Skipped: 0, Time elapsed: 0.908 sec - in org.apache.directory.server.core.authz.GeneralAuthorizationIT
Running org.apache.directory.server.core.authz.AuthzAuthnIT
Tests run: 3, Failures: 0, Errors: 0, Skipped: 0, Time elapsed: 0.966 sec - in org.apache.directory.server.core.authz.AuthzAuthnIT
Running org.apache.directory.server.core.authz.ModifyAuthorizationIT
Tests run: 7, Failures: 0, Errors: 0, Skipped: 0, Time elapsed: 2.917 sec - in org.apache.directory.server.core.authz.ModifyAuthorizationIT
Running org.apache.directory.server.core.sp.LdapClassLoaderIT
Tests run: 2, Failures: 0, Errors: 0, Skipped: 0, Time elapsed: 0.94 sec - in org.apache.directory.server.core.sp.LdapClassLoaderIT
Running org.apache.directory.server.core.normalization.NormalizationServiceIT
Tests run: 1, Failures: 0, Errors: 0, Skipped: 0, Time elapsed: 0.917 sec - in org.apache.directory.server.core.normalization.NormalizationServiceIT

Results :

Tests run: 694, Failures: 0, Errors: 0, Skipped: 132

[JENKINS] Recording test results
[INFO] 
[INFO] --- maven-bundle-plugin:2.3.7:bundle (default-bundle) @ apacheds-core-integ ---
[WARNING] Bundle org.apache.directory.server:apacheds-core-integ:bundle:2.0.0-M17-SNAPSHOT
: Split package org/apache/directory/server/core/integ
Use directive -split-package:=(merge-first|merge-last|error|first) on Export/Private Package
instruction to get rid of this warning
Package found in   [Jar:., Jar:apacheds-test-framework]
Reference from     <https://builds.apache.org/job/dir-apacheds-ubuntu-deploy/ws/trunk/test-framework/target/apacheds-test-framework-2.0.0-M17-SNAPSHOT.jar>
Classpath          [Jar:., Jar:mina-core, Jar:apacheds-core, Jar:apacheds-interceptors-admin,
Jar:apacheds-interceptors-number, Jar:apacheds-interceptors-authz, Jar:apacheds-interceptors-changelog,
Jar:apacheds-interceptors-collective, Jar:apacheds-interceptors-event, Jar:apacheds-interceptors-exception,
Jar:apacheds-interceptors-journal, Jar:apacheds-interceptors-normalization, Jar:apacheds-interceptors-operational,
Jar:apacheds-interceptors-referral, Jar:apacheds-interceptors-schema, Jar:apacheds-interceptors-subtree,
Jar:apacheds-interceptors-trigger, Jar:api-ldap-extras-util, Jar:bcprov-jdk15, Jar:apacheds-core-annotations,
Jar:apacheds-ldif-partition, Jar:apacheds-jdbm-partition, Jar:apacheds-core-avl, Jar:apacheds-xdbm-partition,
Jar:mavibot, Jar:apacheds-mavibot-partition, Jar:apacheds-core-api, Jar:apacheds-core-constants,
Jar:api-i18n, Jar:api-ldap-extras-aci, Jar:ehcache-core, Jar:apacheds-core-jndi, Jar:apacheds-core-shared,
Jar:api-ldap-extras-codec-api, Jar:apacheds-interceptors-authn, Jar:commons-collections, Jar:apacheds-interceptors-hash,
Jar:api-ldap-extras-trigger, Jar:apacheds-i18n, Jar:apacheds-protocol-ldap, Jar:apacheds-protocol-shared,
Jar:apacheds-jdbm1, Jar:apacheds-kerberos-codec, Jar:api-asn1-ber, Jar:apacheds-server-annotations,
Jar:apacheds-protocol-kerberos, Jar:apacheds-test-framework, Jar:commons-io, Jar:commons-lang,
Jar:api-ldap-client-api, Jar:commons-pool, Jar:api-ldap-extras-codec, Jar:api-asn1-api, Jar:api-ldap-extras-sp,
Jar:api-ldap-codec-core, Jar:api-ldap-model, Jar:antlr, Jar:api-ldap-schema-data, Jar:api-util,
Jar:annotations, Jar:slf4j-api, Jar:log4j]
[INFO] 
[INFO] --- maven-site-plugin:3.3:attach-descriptor (attach-descriptor) @ apacheds-core-integ
---
[INFO] 
[INFO] --- maven-jar-plugin:2.4:test-jar (default) @ apacheds-core-integ ---
[INFO] Building jar: <https://builds.apache.org/job/dir-apacheds-ubuntu-deploy/ws/trunk/core-integ/target/apacheds-core-integ-2.0.0-M17-SNAPSHOT-tests.jar>
[INFO] 
[INFO] --- tools-maven-plugin:1.4:verify-legal-files (verify-legal-files) @ apacheds-core-integ
---
[INFO] Checking legal files in: apacheds-core-integ-2.0.0-M17-SNAPSHOT.jar
[INFO] Checking legal files in: apacheds-core-integ-2.0.0-M17-SNAPSHOT-tests.jar
[INFO] 
[INFO] --- maven-install-plugin:2.4:install (default-install) @ apacheds-core-integ ---
[INFO] Installing <https://builds.apache.org/job/dir-apacheds-ubuntu-deploy/ws/trunk/core-integ/target/apacheds-core-integ-2.0.0-M17-SNAPSHOT.jar>
to /home/jenkins/jenkins-slave/maven-repositories/0/org/apache/directory/server/apacheds-core-integ/2.0.0-M17-SNAPSHOT/apacheds-core-integ-2.0.0-M17-SNAPSHOT.jar
[INFO] Installing <https://builds.apache.org/job/dir-apacheds-ubuntu-deploy/ws/trunk/core-integ/pom.xml>
to /home/jenkins/jenkins-slave/maven-repositories/0/org/apache/directory/server/apacheds-core-integ/2.0.0-M17-SNAPSHOT/apacheds-core-integ-2.0.0-M17-SNAPSHOT.pom
[INFO] Installing <https://builds.apache.org/job/dir-apacheds-ubuntu-deploy/ws/trunk/core-integ/target/apacheds-core-integ-2.0.0-M17-SNAPSHOT-tests.jar>
to /home/jenkins/jenkins-slave/maven-repositories/0/org/apache/directory/server/apacheds-core-integ/2.0.0-M17-SNAPSHOT/apacheds-core-integ-2.0.0-M17-SNAPSHOT-tests.jar
[INFO] 
[INFO] --- maven-bundle-plugin:2.3.7:install (default-install) @ apacheds-core-integ ---
[INFO] Installing org/apache/directory/server/apacheds-core-integ/2.0.0-M17-SNAPSHOT/apacheds-core-integ-2.0.0-M17-SNAPSHOT.jar
[INFO] Writing OBR metadata
[INFO] 
[INFO] --- maven-deploy-plugin:2.7:deploy (default-deploy) @ apacheds-core-integ ---
Downloading: https://repository.apache.org/content/repositories/snapshots/org/apache/directory/server/apacheds-core-integ/2.0.0-M17-SNAPSHOT/maven-metadata.xml
[WARNING] Could not transfer metadata org.apache.directory.server:apacheds-core-integ:2.0.0-M17-SNAPSHOT/maven-metadata.xml
from/to apache.snapshots.https (https://repository.apache.org/content/repositories/snapshots):
Failed to transfer file: https://repository.apache.org/content/repositories/snapshots/org/apache/directory/server/apacheds-core-integ/2.0.0-M17-SNAPSHOT/maven-metadata.xml.
Return code is: 503, ReasonPhrase:Service Temporarily Unavailable.
[JENKINS] Archiving disabled
[INFO] ------------------------------------------------------------------------
[INFO] Reactor Summary:
[INFO] 
[INFO] ApacheDS .......................................... SUCCESS [43.509s]
[INFO] ApacheDS I18n ..................................... SUCCESS [13.903s]
[INFO] ApacheDS Core Constants ........................... SUCCESS [8.106s]
[INFO] ApacheDS Core API ................................. SUCCESS [45.176s]
[INFO] ApacheDS Core Shared .............................. SUCCESS [17.927s]
[INFO] ApacheDS Interceptors ............................. SUCCESS [4.576s]
[INFO] ApacheDS AdministrativePoint Interceptor .......... SUCCESS [8.351s]
[INFO] ApacheDS Authentication Interceptor ............... SUCCESS [12.987s]
[INFO] ApacheDS Interceptor to increment numeric attributes  SUCCESS [7.310s]
[INFO] ApacheDS Authorization Interceptor ................ SUCCESS [14.519s]
[INFO] ApacheDS ChangeLog Interceptor .................... SUCCESS [10.990s]
[INFO] ApacheDS Collective Attribute Interceptor ......... SUCCESS [8.323s]
[INFO] ApacheDS Event Interceptor ........................ SUCCESS [8.441s]
[INFO] ApacheDS Exception Interceptor .................... SUCCESS [11.218s]
[INFO] ApacheDS Journal Interceptor ...................... SUCCESS [9.040s]
[INFO] ApacheDS Normalization Interceptor ................ SUCCESS [17.817s]
[INFO] ApacheDS Operational Attribute Interceptor ........ SUCCESS [8.598s]
[INFO] ApacheDS Referral Interceptor ..................... SUCCESS [8.952s]
[INFO] ApacheDS Schema Interceptor ....................... SUCCESS [11.811s]
[INFO] ApacheDS Subtree Interceptor ...................... SUCCESS [12.385s]
[INFO] ApacheDS Triggers Interceptor ..................... SUCCESS [11.582s]
[INFO] ApacheDS Core ..................................... SUCCESS [10.895s]
[INFO] ApacheDS Core AVL ................................. SUCCESS [17.407s]
[INFO] ApacheDS Generalized (X) DBM Partition ............ SUCCESS [25.956s]
[INFO] ApacheDS LDIF Partition ........................... SUCCESS [11.944s]
[INFO] ApacheDS JDBM Partition ........................... SUCCESS [26.553s]
[INFO] ApacheDS Mavibot Partition ........................ SUCCESS [14.891s]
[INFO] ApacheDS Core Annotations ......................... SUCCESS [23.530s]
[INFO] ApacheDS Core JNDI ................................ SUCCESS [11.400s]
[INFO] ApacheDS Protocol Kerberos Codec .................. SUCCESS [38.272s]
[INFO] ApacheDS Interceptors for Kerberos ................ SUCCESS [11.097s]
[INFO] ApacheDS Protocol Dhcp ............................ SUCCESS [10.884s]
[INFO] ApacheDS Protocol Shared .......................... SUCCESS [11.453s]
[INFO] ApacheDS Protocol Dns ............................. SUCCESS [14.025s]
[INFO] ApacheDS Protocol Kerberos ........................ SUCCESS [17.997s]
[INFO] ApacheDS Protocol Ldap ............................ SUCCESS [23.816s]
[INFO] ApacheDS Protocol Ntp ............................. SUCCESS [15.887s]
[INFO] Apacheds Server Annotations ....................... SUCCESS [22.820s]
[INFO] ApacheDS Server Config ............................ SUCCESS [17.731s]
[INFO] ApacheDS Server JNDI .............................. SUCCESS [16.856s]
[INFO] ApacheDS Test Framework ........................... SUCCESS [29.731s]
[INFO] ApacheDS All ...................................... SUCCESS [12.131s]
[INFO] ApacheDS Logger Interceptor ....................... SUCCESS [8.488s]
[INFO] ApacheDS Password Hashing Interceptor ............. SUCCESS [11.187s]
[INFO] ApacheDS Core Integration ......................... FAILURE [2:58.786s]
[INFO] ApacheDS Protocol Kerberos Test ................... SKIPPED
[INFO] ApacheDS Server Integration ....................... SKIPPED
[INFO] ApacheDS DirectoryService-WebApp bridge ........... SKIPPED
[INFO] ApacheDS Jetty HTTP Server Integration ............ SKIPPED
[INFO] ApacheDS Service Builder .......................... SKIPPED
[INFO] Apache Directory LDAP Client API test ............. SKIPPED
[INFO] kerberos-client ................................... SKIPPED
[INFO] ApacheDS Service .................................. SKIPPED
[INFO] ApacheDS Wrapper .................................. SKIPPED
[INFO] ApacheDS Installers Maven Plugin .................. SKIPPED
[INFO] ApacheDS Installers ............................... SKIPPED
[INFO] ------------------------------------------------------------------------
[INFO] BUILD FAILURE
[INFO] ------------------------------------------------------------------------
[INFO] Total time: 15:38.498s
[INFO] Finished at: Thu Jun 19 04:19:04 UTC 2014
[INFO] Final Memory: 66M/281M
[INFO] ------------------------------------------------------------------------
[JENKINS] Archiving disabled
[JENKINS] Archiving disabled
[JENKINS] Archiving disabled
[JENKINS] Archiving disabled
[JENKINS] Archiving disabled
[JENKINS] Archiving disabled
[JENKINS] Archiving disabled
[JENKINS] Archiving disabled
[JENKINS] Archiving disabled
[JENKINS] Archiving disabled
[JENKINS] Archiving disabled
[JENKINS] Archiving disabled
[JENKINS] Archiving disabled
[JENKINS] Archiving disabled
[JENKINS] Archiving disabled
[JENKINS] Archiving disabled
[JENKINS] Archiving disabled
[JENKINS] Archiving disabled
[JENKINS] Archiving disabled
[JENKINS] Archiving disabled
[JENKINS] Archiving disabled
[JENKINS] Archiving disabled
[JENKINS] Archiving disabled
[JENKINS] Archiving disabled
[JENKINS] Archiving disabled
[JENKINS] Archiving disabled
[JENKINS] Archiving disabled
[JENKINS] Archiving disabled
[JENKINS] Archiving disabled
[JENKINS] Archiving disabled
[JENKINS] Archiving disabled
[JENKINS] Archiving disabled
[JENKINS] Archiving disabled
[JENKINS] Archiving disabled
[JENKINS] Archiving disabled
[JENKINS] Archiving disabled
[JENKINS] Archiving disabled
[JENKINS] Archiving disabled
[JENKINS] Archiving disabled
[JENKINS] Archiving disabled
[JENKINS] Archiving disabled
[JENKINS] Archiving disabled
[JENKINS] Archiving disabled
[JENKINS] Archiving disabled
[JENKINS] Archiving disabled
[JENKINS] Archiving disabled
[JENKINS] Archiving disabled
[JENKINS] Archiving disabled
[JENKINS] Archiving disabled
[JENKINS] Archiving disabled
[JENKINS] Archiving disabled
[JENKINS] Archiving disabled
[JENKINS] Archiving disabled
[JENKINS] Archiving disabled
[JENKINS] Archiving disabled
[JENKINS] Archiving disabled
Waiting for Jenkins to finish collecting data
[ERROR] Failed to execute goal org.apache.maven.plugins:maven-deploy-plugin:2.7:deploy (default-deploy)
on project apacheds-core-integ: Failed to retrieve remote metadata org.apache.directory.server:apacheds-core-integ:2.0.0-M17-SNAPSHOT/maven-metadata.xml:
Could not transfer metadata org.apache.directory.server:apacheds-core-integ:2.0.0-M17-SNAPSHOT/maven-metadata.xml
from/to apache.snapshots.https (https://repository.apache.org/content/repositories/snapshots):
Failed to transfer file: https://repository.apache.org/content/repositories/snapshots/org/apache/directory/server/apacheds-core-integ/2.0.0-M17-SNAPSHOT/maven-metadata.xml.
Return code is: 503, ReasonPhrase:Service Temporarily Unavailable. -> [Help 1]
[ERROR] 
[ERROR] To see the full stack trace of the errors, re-run Maven with the -e switch.
[ERROR] Re-run Maven using the -X switch to enable full debug logging.
[ERROR] 
[ERROR] For more information about the errors and possible solutions, please read the following
articles:
[ERROR] [Help 1] http://cwiki.apache.org/confluence/display/MAVEN/MojoExecutionException
[ERROR] 
[ERROR] After correcting the problems, you can resume the build with the command
[ERROR]   mvn <goals> -rf :apacheds-core-integ
channel stopped

Mime
View raw message