directory-notifications mailing list archives

Site index · List index
Message view « Date » · « Thread »
Top « Date » · « Thread »
From Apache Jenkins Server <jenk...@builds.apache.org>
Subject Build failed in Jenkins: dir-junit-addons-deploy-site #1349
Date Wed, 18 Jun 2014 02:04:19 GMT
See <https://builds.apache.org/job/dir-junit-addons-deploy-site/1349/>

------------------------------------------
Started by timer
Building remotely on ubuntu6 (Ubuntu ubuntu) in workspace <https://builds.apache.org/job/dir-junit-addons-deploy-site/ws/>
Updating https://svn.apache.org/repos/asf/directory/buildtools/junit-addons/trunk at revision
'2014-06-18T02:02:43.825 +0000'
At revision 1603345
no change for https://svn.apache.org/repos/asf/directory/buildtools/junit-addons/trunk since
the previous build
Parsing POMs
maven3-agent.jar already up to date
maven3-interceptor.jar already up to date
maven3-interceptor-commons.jar already up to date
[trunk] $ /home/hudson/tools/java/latest1.7/bin/java -Xmx512m -XX:MaxPermSize=128m -Djava.awt.headless=true
-cp /home/jenkins/jenkins-slave/maven3-agent.jar:/home/hudson/tools/maven/apache-maven-3.0.4/boot/plexus-classworlds-2.4.jar
org.jvnet.hudson.maven3.agent.Maven3Main /home/hudson/tools/maven/apache-maven-3.0.4 /home/jenkins/jenkins-slave/slave.jar
/home/jenkins/jenkins-slave/maven3-interceptor.jar /home/jenkins/jenkins-slave/maven3-interceptor-commons.jar
60168
<===[JENKINS REMOTING CAPACITY]===>   channel started
log4j:WARN No appenders could be found for logger (org.apache.commons.beanutils.converters.BooleanConverter).
log4j:WARN Please initialize the log4j system properly.
Executing Maven:  -B -f <https://builds.apache.org/job/dir-junit-addons-deploy-site/ws/trunk/pom.xml>
-Dmaven.repo.local=/home/jenkins/jenkins-slave/maven-repositories/0 -V clean deploy site
Apache Maven 3.0.4 (r1232337; 2012-01-17 08:44:56+0000)
Maven home: /home/jenkins/tools/maven/apache-maven-3.0.4
Java version: 1.7.0_25, vendor: Oracle Corporation
Java home: /home/jenkins/tools/java/jdk1.7.0_25-32/jre
Default locale: en_US, platform encoding: ANSI_X3.4-1968
OS name: "linux", version: "3.2.0-57-generic", arch: "i386", family: "unix"
[INFO] Scanning for projects...
[INFO]                                                                         
[INFO] ------------------------------------------------------------------------
[INFO] Building Apache Directory JUnit Add-ons 0.2-SNAPSHOT
[INFO] ------------------------------------------------------------------------
[INFO] 
[INFO] --- maven-clean-plugin:2.4.1:clean (default-clean) @ junit-addons ---
[INFO] Deleting <https://builds.apache.org/job/dir-junit-addons-deploy-site/ws/trunk/target>
[INFO] 
[INFO] --- maven-remote-resources-plugin:1.2.1:process (default) @ junit-addons ---
[INFO] 
[INFO] --- maven-resources-plugin:2.5:resources (default-resources) @ junit-addons ---
[debug] execute contextualize
[INFO] Using 'UTF-8' encoding to copy filtered resources.
[INFO] skip non existing resourceDirectory <https://builds.apache.org/job/dir-junit-addons-deploy-site/ws/trunk/src/main/resources>
[INFO] Copying 3 resources
[INFO] 
[INFO] --- maven-compiler-plugin:2.5.1:compile (default-compile) @ junit-addons ---
[INFO] Compiling 9 source files to <https://builds.apache.org/job/dir-junit-addons-deploy-site/ws/trunk/target/classes>
[INFO] 
[INFO] --- maven-resources-plugin:2.5:testResources (default-testResources) @ junit-addons
---
[debug] execute contextualize
[INFO] Using 'UTF-8' encoding to copy filtered resources.
[INFO] skip non existing resourceDirectory <https://builds.apache.org/job/dir-junit-addons-deploy-site/ws/trunk/src/test/resources>
[INFO] Copying 3 resources
[INFO] 
[INFO] --- maven-compiler-plugin:2.5.1:testCompile (default-testCompile) @ junit-addons ---
[INFO] Compiling 2 source files to <https://builds.apache.org/job/dir-junit-addons-deploy-site/ws/trunk/target/test-classes>
[INFO] 
[INFO] --- maven-surefire-plugin:2.12.2:test (default-test) @ junit-addons ---
[INFO] Surefire report directory: <https://builds.apache.org/job/dir-junit-addons-deploy-site/ws/trunk/target/surefire-reports>

-------------------------------------------------------
 T E S T S
-------------------------------------------------------
Running org.apache.directory.junit.tools.MultiThreadedMultiInvokerThreadsafeTest
Tests run: 10, Failures: 0, Errors: 0, Skipped: 0, Time elapsed: 4.62 sec
Running org.apache.directory.junit.tools.MultiThreadedMultiInvokerNotThreadsafeTest
Tests run: 10, Failures: 0, Errors: 0, Skipped: 0, Time elapsed: 0.224 sec

Results :

Tests run: 20, Failures: 0, Errors: 0, Skipped: 0

[JENKINS] Recording test results
[INFO] 
[INFO] --- maven-bundle-plugin:2.3.7:bundle (default-bundle) @ junit-addons ---
[INFO] 
[INFO] --- maven-site-plugin:3.1:attach-descriptor (attach-descriptor) @ junit-addons ---
[INFO] 
[INFO] --- tools-maven-plugin:1.4:verify-legal-files (verify-legal-files) @ junit-addons ---
[INFO] Checking legal files in: junit-addons-0.2-SNAPSHOT.jar
[INFO] 
[INFO] --- maven-install-plugin:2.3.1:install (default-install) @ junit-addons ---
[INFO] Installing <https://builds.apache.org/job/dir-junit-addons-deploy-site/ws/trunk/target/junit-addons-0.2-SNAPSHOT.jar>
to /home/jenkins/jenkins-slave/maven-repositories/0/org/apache/directory/junit/junit-addons/0.2-SNAPSHOT/junit-addons-0.2-SNAPSHOT.jar
[INFO] Installing <https://builds.apache.org/job/dir-junit-addons-deploy-site/ws/trunk/pom.xml>
to /home/jenkins/jenkins-slave/maven-repositories/0/org/apache/directory/junit/junit-addons/0.2-SNAPSHOT/junit-addons-0.2-SNAPSHOT.pom
[INFO] 
[INFO] --- maven-bundle-plugin:2.3.7:install (default-install) @ junit-addons ---
[INFO] Installing org/apache/directory/junit/junit-addons/0.2-SNAPSHOT/junit-addons-0.2-SNAPSHOT.jar
[INFO] Writing OBR metadata
[INFO] 
[INFO] --- maven-deploy-plugin:2.7:deploy (default-deploy) @ junit-addons ---
Downloading: https://repository.apache.org/content/repositories/snapshots/org/apache/directory/junit/junit-addons/0.2-SNAPSHOT/maven-metadata.xml
[WARNING] Could not transfer metadata org.apache.directory.junit:junit-addons:0.2-SNAPSHOT/maven-metadata.xml
from/to apache.snapshots.https (https://repository.apache.org/content/repositories/snapshots):
Failed to transfer file: https://repository.apache.org/content/repositories/snapshots/org/apache/directory/junit/junit-addons/0.2-SNAPSHOT/maven-metadata.xml.
Return code is: 503, ReasonPhrase:Service Temporarily Unavailable.
[INFO] ------------------------------------------------------------------------
[INFO] BUILD FAILURE
[INFO] ------------------------------------------------------------------------
[INFO] Total time: 56.568s
[INFO] Finished at: Wed Jun 18 02:04:16 UTC 2014
[INFO] Final Memory: 24M/205M
[INFO] ------------------------------------------------------------------------
Waiting for Jenkins to finish collecting data
[ERROR] Failed to execute goal org.apache.maven.plugins:maven-deploy-plugin:2.7:deploy (default-deploy)
on project junit-addons: Failed to retrieve remote metadata org.apache.directory.junit:junit-addons:0.2-SNAPSHOT/maven-metadata.xml:
Could not transfer metadata org.apache.directory.junit:junit-addons:0.2-SNAPSHOT/maven-metadata.xml
from/to apache.snapshots.https (https://repository.apache.org/content/repositories/snapshots):
Failed to transfer file: https://repository.apache.org/content/repositories/snapshots/org/apache/directory/junit/junit-addons/0.2-SNAPSHOT/maven-metadata.xml.
Return code is: 503, ReasonPhrase:Service Temporarily Unavailable. -> [Help 1]
[ERROR] 
[ERROR] To see the full stack trace of the errors, re-run Maven with the -e switch.
[ERROR] Re-run Maven using the -X switch to enable full debug logging.
[ERROR] 
[ERROR] For more information about the errors and possible solutions, please read the following
articles:
[ERROR] [Help 1] http://cwiki.apache.org/confluence/display/MAVEN/MojoExecutionException
[JENKINS] Archiving <https://builds.apache.org/job/dir-junit-addons-deploy-site/ws/trunk/pom.xml>
to org.apache.directory.junit/junit-addons/0.2-SNAPSHOT/junit-addons-0.2-SNAPSHOT.pom
[JENKINS] Archiving <https://builds.apache.org/job/dir-junit-addons-deploy-site/ws/trunk/target/junit-addons-0.2-SNAPSHOT.jar>
to org.apache.directory.junit/junit-addons/0.2-SNAPSHOT/junit-addons-0.2-SNAPSHOT.jar
Sending artifact delta relative to dir-junit-addons-deploy-site ? Apache Directory JUnit Add-ons
#1348
Archived 2 artifacts
Archive block size is 32768
Received 0 blocks and 28029 bytes
Compression is 0.0%
Took 0.17 sec
Sending e-mails to: notifications@directory.apache.org
channel stopped

Mime
View raw message