directory-notifications mailing list archives

Site index · List index
Message view « Date » · « Thread »
Top « Date » · « Thread »
From Apache Jenkins Server <jenk...@builds.apache.org>
Subject Build failed in Jenkins: dir-apacheds-ubuntu-deploy #1336
Date Wed, 07 May 2014 04:15:19 GMT
See <https://builds.apache.org/job/dir-apacheds-ubuntu-deploy/1336/changes>

Changes:

[kayyagari] fixed building of a new index that was added after adding data to a partition
(DIRSERVER-1976)

------------------------------------------
[...truncated 3113 lines...]

[JENKINS] Recording test results
[INFO] 
[INFO] --- maven-bundle-plugin:2.3.7:bundle (default-bundle) @ apacheds-protocol-ldap ---
[INFO] 
[INFO] --- maven-site-plugin:3.3:attach-descriptor (attach-descriptor) @ apacheds-protocol-ldap
---
[INFO] 
[INFO] --- tools-maven-plugin:1.4:verify-legal-files (verify-legal-files) @ apacheds-protocol-ldap
---
[INFO] Checking legal files in: apacheds-protocol-ldap-2.0.0-M17-SNAPSHOT.jar
[WARNING] Failed to getClass for org.apache.maven.plugin.source.SourceJarMojo
[INFO] 
[INFO] --- maven-source-plugin:2.2.1:jar (attach-sources) @ apacheds-protocol-ldap ---
[INFO] Building jar: <https://builds.apache.org/job/dir-apacheds-ubuntu-deploy/ws/trunk/protocol-ldap/target/apacheds-protocol-ldap-2.0.0-M17-SNAPSHOT-sources.jar>
[INFO] 
[INFO] --- maven-install-plugin:2.4:install (default-install) @ apacheds-protocol-ldap ---
[INFO] Installing <https://builds.apache.org/job/dir-apacheds-ubuntu-deploy/ws/trunk/protocol-ldap/target/apacheds-protocol-ldap-2.0.0-M17-SNAPSHOT.jar>
to /home/jenkins/jenkins-slave/maven-repositories/0/org/apache/directory/server/apacheds-protocol-ldap/2.0.0-M17-SNAPSHOT/apacheds-protocol-ldap-2.0.0-M17-SNAPSHOT.jar
[INFO] Installing <https://builds.apache.org/job/dir-apacheds-ubuntu-deploy/ws/trunk/protocol-ldap/pom.xml>
to /home/jenkins/jenkins-slave/maven-repositories/0/org/apache/directory/server/apacheds-protocol-ldap/2.0.0-M17-SNAPSHOT/apacheds-protocol-ldap-2.0.0-M17-SNAPSHOT.pom
[INFO] Installing <https://builds.apache.org/job/dir-apacheds-ubuntu-deploy/ws/trunk/protocol-ldap/target/apacheds-protocol-ldap-2.0.0-M17-SNAPSHOT-sources.jar>
to /home/jenkins/jenkins-slave/maven-repositories/0/org/apache/directory/server/apacheds-protocol-ldap/2.0.0-M17-SNAPSHOT/apacheds-protocol-ldap-2.0.0-M17-SNAPSHOT-sources.jar
[INFO] 
[INFO] --- maven-bundle-plugin:2.3.7:install (default-install) @ apacheds-protocol-ldap ---
[INFO] Installing org/apache/directory/server/apacheds-protocol-ldap/2.0.0-M17-SNAPSHOT/apacheds-protocol-ldap-2.0.0-M17-SNAPSHOT.jar
[INFO] Writing OBR metadata
[INFO] 
[INFO] --- maven-deploy-plugin:2.7:deploy (default-deploy) @ apacheds-protocol-ldap ---
Downloading: https://repository.apache.org/content/repositories/snapshots/org/apache/directory/server/apacheds-protocol-ldap/2.0.0-M17-SNAPSHOT/maven-metadata.xml
Downloaded: https://repository.apache.org/content/repositories/snapshots/org/apache/directory/server/apacheds-protocol-ldap/2.0.0-M17-SNAPSHOT/maven-metadata.xml
(2 KB at 0.7 KB/sec)
Uploading: https://repository.apache.org/content/repositories/snapshots/org/apache/directory/server/apacheds-protocol-ldap/2.0.0-M17-SNAPSHOT/apacheds-protocol-ldap-2.0.0-M17-20140507.041223-39.jar
Uploaded: https://repository.apache.org/content/repositories/snapshots/org/apache/directory/server/apacheds-protocol-ldap/2.0.0-M17-SNAPSHOT/apacheds-protocol-ldap-2.0.0-M17-20140507.041223-39.jar
(227 KB at 2867.4 KB/sec)
Uploading: https://repository.apache.org/content/repositories/snapshots/org/apache/directory/server/apacheds-protocol-ldap/2.0.0-M17-SNAPSHOT/apacheds-protocol-ldap-2.0.0-M17-20140507.041223-39.pom
Uploaded: https://repository.apache.org/content/repositories/snapshots/org/apache/directory/server/apacheds-protocol-ldap/2.0.0-M17-SNAPSHOT/apacheds-protocol-ldap-2.0.0-M17-20140507.041223-39.pom
(6 KB at 116.8 KB/sec)
Downloading: https://repository.apache.org/content/repositories/snapshots/org/apache/directory/server/apacheds-protocol-ldap/maven-metadata.xml
Downloaded: https://repository.apache.org/content/repositories/snapshots/org/apache/directory/server/apacheds-protocol-ldap/maven-metadata.xml
(417 B at 2.7 KB/sec)
Uploading: https://repository.apache.org/content/repositories/snapshots/org/apache/directory/server/apacheds-protocol-ldap/2.0.0-M17-SNAPSHOT/maven-metadata.xml
Uploaded: https://repository.apache.org/content/repositories/snapshots/org/apache/directory/server/apacheds-protocol-ldap/2.0.0-M17-SNAPSHOT/maven-metadata.xml
(2 KB at 15.3 KB/sec)
Uploading: https://repository.apache.org/content/repositories/snapshots/org/apache/directory/server/apacheds-protocol-ldap/maven-metadata.xml
Uploaded: https://repository.apache.org/content/repositories/snapshots/org/apache/directory/server/apacheds-protocol-ldap/maven-metadata.xml
(417 B at 4.0 KB/sec)
Uploading: https://repository.apache.org/content/repositories/snapshots/org/apache/directory/server/apacheds-protocol-ldap/2.0.0-M17-SNAPSHOT/apacheds-protocol-ldap-2.0.0-M17-20140507.041223-39-sources.jar
Uploaded: https://repository.apache.org/content/repositories/snapshots/org/apache/directory/server/apacheds-protocol-ldap/2.0.0-M17-SNAPSHOT/apacheds-protocol-ldap-2.0.0-M17-20140507.041223-39-sources.jar
(190 KB at 2312.4 KB/sec)
Uploading: https://repository.apache.org/content/repositories/snapshots/org/apache/directory/server/apacheds-protocol-ldap/2.0.0-M17-SNAPSHOT/maven-metadata.xml
Uploaded: https://repository.apache.org/content/repositories/snapshots/org/apache/directory/server/apacheds-protocol-ldap/2.0.0-M17-SNAPSHOT/maven-metadata.xml
(2 KB at 20.2 KB/sec)
[INFO] 
[INFO] --- maven-bundle-plugin:2.3.7:deploy (default-deploy) @ apacheds-protocol-ldap ---
[INFO] Remote OBR update disabled (enable with -DremoteOBR)
[JENKINS] Archiving disabled
[INFO]                                                                         
[INFO] ------------------------------------------------------------------------
[INFO] Building ApacheDS Protocol Ntp 2.0.0-M17-SNAPSHOT
[INFO] ------------------------------------------------------------------------
[INFO] 
[INFO] --- maven-clean-plugin:2.4.1:clean (default-clean) @ apacheds-protocol-ntp ---
[INFO] Deleting <https://builds.apache.org/job/dir-apacheds-ubuntu-deploy/ws/trunk/protocol-ntp/target>
[INFO] 
[INFO] --- maven-remote-resources-plugin:1.2.1:process (default) @ apacheds-protocol-ntp ---
[INFO] 
[INFO] --- maven-resources-plugin:2.6:resources (default-resources) @ apacheds-protocol-ntp
---
[INFO] Using 'UTF-8' encoding to copy filtered resources.
[INFO] Copying 0 resource
[INFO] Copying 3 resources
[INFO] 
[INFO] --- maven-compiler-plugin:3.1:compile (default-compile) @ apacheds-protocol-ntp ---
[INFO] Changes detected - recompiling the module!
[INFO] Compiling 22 source files to <https://builds.apache.org/job/dir-apacheds-ubuntu-deploy/ws/trunk/protocol-ntp/target/classes>
[INFO] 
[INFO] --- maven-resources-plugin:2.6:testResources (default-testResources) @ apacheds-protocol-ntp
---
[INFO] Using 'UTF-8' encoding to copy filtered resources.
[INFO] Copying 1 resource
[INFO] Copying 3 resources
[INFO] 
[INFO] --- maven-compiler-plugin:3.1:testCompile (default-testCompile) @ apacheds-protocol-ntp
---
[INFO] Changes detected - recompiling the module!
[INFO] Compiling 4 source files to <https://builds.apache.org/job/dir-apacheds-ubuntu-deploy/ws/trunk/protocol-ntp/target/test-classes>
[INFO] 
[INFO] --- maven-surefire-plugin:2.15:test (default-test) @ apacheds-protocol-ntp ---
[INFO] Surefire report directory: <https://builds.apache.org/job/dir-apacheds-ubuntu-deploy/ws/trunk/protocol-ntp/target/surefire-reports>

-------------------------------------------------------
 T E S T S
-------------------------------------------------------
Running org.apache.directory.server.ntp.NtpMessageEncoderTest
Tests run: 1, Failures: 0, Errors: 0, Skipped: 0, Time elapsed: 0.13 sec - in org.apache.directory.server.ntp.NtpMessageEncoderTest
Running org.apache.directory.server.ntp.NtpITest
Tests run: 1, Failures: 0, Errors: 0, Skipped: 1, Time elapsed: 0.005 sec - in org.apache.directory.server.ntp.NtpITest
Running org.apache.directory.server.ntp.messages.NtpTimeStampTest
Tests run: 8, Failures: 0, Errors: 0, Skipped: 0, Time elapsed: 0.004 sec - in org.apache.directory.server.ntp.messages.NtpTimeStampTest
Running org.apache.directory.server.ntp.NtpMessageDecoderTest
Tests run: 2, Failures: 0, Errors: 0, Skipped: 0, Time elapsed: 0.003 sec - in org.apache.directory.server.ntp.NtpMessageDecoderTest

Results :

Tests run: 12, Failures: 0, Errors: 0, Skipped: 1

[JENKINS] Recording test results
[INFO] 
[INFO] --- maven-bundle-plugin:2.3.7:bundle (default-bundle) @ apacheds-protocol-ntp ---
[INFO] 
[INFO] --- maven-site-plugin:3.3:attach-descriptor (attach-descriptor) @ apacheds-protocol-ntp
---
[INFO] 
[INFO] --- tools-maven-plugin:1.4:verify-legal-files (verify-legal-files) @ apacheds-protocol-ntp
---
[INFO] Checking legal files in: apacheds-protocol-ntp-2.0.0-M17-SNAPSHOT.jar
[WARNING] Failed to getClass for org.apache.maven.plugin.source.SourceJarMojo
[INFO] 
[INFO] --- maven-source-plugin:2.2.1:jar (attach-sources) @ apacheds-protocol-ntp ---
[INFO] Building jar: <https://builds.apache.org/job/dir-apacheds-ubuntu-deploy/ws/trunk/protocol-ntp/target/apacheds-protocol-ntp-2.0.0-M17-SNAPSHOT-sources.jar>
[INFO] 
[INFO] --- maven-install-plugin:2.4:install (default-install) @ apacheds-protocol-ntp ---
[INFO] Installing <https://builds.apache.org/job/dir-apacheds-ubuntu-deploy/ws/trunk/protocol-ntp/target/apacheds-protocol-ntp-2.0.0-M17-SNAPSHOT.jar>
to /home/jenkins/jenkins-slave/maven-repositories/0/org/apache/directory/server/apacheds-protocol-ntp/2.0.0-M17-SNAPSHOT/apacheds-protocol-ntp-2.0.0-M17-SNAPSHOT.jar
[INFO] Installing <https://builds.apache.org/job/dir-apacheds-ubuntu-deploy/ws/trunk/protocol-ntp/pom.xml>
to /home/jenkins/jenkins-slave/maven-repositories/0/org/apache/directory/server/apacheds-protocol-ntp/2.0.0-M17-SNAPSHOT/apacheds-protocol-ntp-2.0.0-M17-SNAPSHOT.pom
[INFO] Installing <https://builds.apache.org/job/dir-apacheds-ubuntu-deploy/ws/trunk/protocol-ntp/target/apacheds-protocol-ntp-2.0.0-M17-SNAPSHOT-sources.jar>
to /home/jenkins/jenkins-slave/maven-repositories/0/org/apache/directory/server/apacheds-protocol-ntp/2.0.0-M17-SNAPSHOT/apacheds-protocol-ntp-2.0.0-M17-SNAPSHOT-sources.jar
[INFO] 
[INFO] --- maven-bundle-plugin:2.3.7:install (default-install) @ apacheds-protocol-ntp ---
[INFO] Installing org/apache/directory/server/apacheds-protocol-ntp/2.0.0-M17-SNAPSHOT/apacheds-protocol-ntp-2.0.0-M17-SNAPSHOT.jar
[INFO] Writing OBR metadata
[INFO] 
[INFO] --- maven-deploy-plugin:2.7:deploy (default-deploy) @ apacheds-protocol-ntp ---
Downloading: https://repository.apache.org/content/repositories/snapshots/org/apache/directory/server/apacheds-protocol-ntp/2.0.0-M17-SNAPSHOT/maven-metadata.xml
[WARNING] Could not transfer metadata org.apache.directory.server:apacheds-protocol-ntp:2.0.0-M17-SNAPSHOT/maven-metadata.xml
from/to apache.snapshots.https (https://repository.apache.org/content/repositories/snapshots):
Failed to transfer file: https://repository.apache.org/content/repositories/snapshots/org/apache/directory/server/apacheds-protocol-ntp/2.0.0-M17-SNAPSHOT/maven-metadata.xml.
Return code is: 503, ReasonPhrase:Service Temporarily Unavailable.
[JENKINS] Archiving disabled
[INFO] ------------------------------------------------------------------------
[INFO] Reactor Summary:
[INFO] 
[INFO] ApacheDS .......................................... SUCCESS [24.579s]
[INFO] ApacheDS I18n ..................................... SUCCESS [12.237s]
[INFO] ApacheDS Core Constants ........................... SUCCESS [9.276s]
[INFO] ApacheDS Core API ................................. SUCCESS [36.782s]
[INFO] ApacheDS Core Shared .............................. SUCCESS [14.044s]
[INFO] ApacheDS Interceptors ............................. SUCCESS [8.378s]
[INFO] ApacheDS AdministrativePoint Interceptor .......... SUCCESS [10.020s]
[INFO] ApacheDS Authentication Interceptor ............... SUCCESS [10.638s]
[INFO] ApacheDS Authorization Interceptor ................ SUCCESS [12.297s]
[INFO] ApacheDS ChangeLog Interceptor .................... SUCCESS [12.648s]
[INFO] ApacheDS Collective Attribute Interceptor ......... SUCCESS [11.581s]
[INFO] ApacheDS Event Interceptor ........................ SUCCESS [9.587s]
[INFO] ApacheDS Exception Interceptor .................... SUCCESS [9.189s]
[INFO] ApacheDS Journal Interceptor ...................... SUCCESS [9.755s]
[INFO] ApacheDS Normalization Interceptor ................ SUCCESS [11.091s]
[INFO] ApacheDS Operational Attribute Interceptor ........ SUCCESS [9.983s]
[INFO] ApacheDS Referral Interceptor ..................... SUCCESS [11.038s]
[INFO] ApacheDS Schema Interceptor ....................... SUCCESS [12.979s]
[INFO] ApacheDS Subtree Interceptor ...................... SUCCESS [18.170s]
[INFO] ApacheDS Triggers Interceptor ..................... SUCCESS [13.471s]
[INFO] ApacheDS Core ..................................... SUCCESS [13.758s]
[INFO] ApacheDS Core AVL ................................. SUCCESS [16.346s]
[INFO] ApacheDS Generalized (X) DBM Partition ............ SUCCESS [19.497s]
[INFO] ApacheDS LDIF Partition ........................... SUCCESS [27.946s]
[INFO] ApacheDS JDBM Partition ........................... SUCCESS [58.122s]
[INFO] ApacheDS Mavibot Partition ........................ SUCCESS [13.015s]
[INFO] ApacheDS Core Annotations ......................... SUCCESS [49.447s]
[INFO] ApacheDS Core JNDI ................................ SUCCESS [11.004s]
[INFO] ApacheDS Protocol Kerberos Codec .................. SUCCESS [20.580s]
[INFO] ApacheDS Interceptors for Kerberos ................ SUCCESS [8.353s]
[INFO] ApacheDS Protocol Dhcp ............................ SUCCESS [13.260s]
[INFO] ApacheDS Protocol Shared .......................... SUCCESS [12.574s]
[INFO] ApacheDS Protocol Dns ............................. SUCCESS [12.643s]
[INFO] ApacheDS Protocol Kerberos ........................ SUCCESS [15.935s]
[INFO] ApacheDS Protocol Ldap ............................ SUCCESS [1:20.303s]
[INFO] ApacheDS Protocol Ntp ............................. FAILURE [45.708s]
[INFO] Apacheds Server Annotations ....................... SKIPPED
[INFO] ApacheDS Server Config ............................ SKIPPED
[INFO] ApacheDS Server JNDI .............................. SKIPPED
[INFO] ApacheDS Test Framework ........................... SKIPPED
[INFO] ApacheDS All ...................................... SKIPPED
[INFO] ApacheDS Logger Interceptor ....................... SKIPPED
[INFO] ApacheDS Password Hashing Interceptor ............. SKIPPED
[INFO] ApacheDS Core Integration ......................... SKIPPED
[INFO] ApacheDS Protocol Kerberos Test ................... SKIPPED
[INFO] ApacheDS Server Integration ....................... SKIPPED
[INFO] ApacheDS DirectoryService-WebApp bridge ........... SKIPPED
[INFO] ApacheDS Jetty HTTP Server Integration ............ SKIPPED
[INFO] ApacheDS Service Builder .......................... SKIPPED
[INFO] Apache Directory LDAP Client API test ............. SKIPPED
[INFO] kerberos-client ................................... SKIPPED
[INFO] ApacheDS Service .................................. SKIPPED
[INFO] ApacheDS Wrapper .................................. SKIPPED
[INFO] ApacheDS Installers Maven Plugin .................. SKIPPED
[INFO] ApacheDS Installers ............................... SKIPPED
[INFO] ------------------------------------------------------------------------
[INFO] BUILD FAILURE
[INFO] ------------------------------------------------------------------------
[INFO] Total time: 12:34.118s
[INFO] Finished at: Wed May 07 04:13:14 UTC 2014
[INFO] Final Memory: 62M/431M
[INFO] ------------------------------------------------------------------------
[JENKINS] Archiving disabled
[JENKINS] Archiving disabled
[JENKINS] Archiving disabled
[JENKINS] Archiving disabled
[JENKINS] Archiving disabled
[JENKINS] Archiving disabled
[JENKINS] Archiving disabled
[JENKINS] Archiving disabled
[JENKINS] Archiving disabled
[JENKINS] Archiving disabled
[JENKINS] Archiving disabled
[JENKINS] Archiving disabled
[JENKINS] Archiving disabled
[JENKINS] Archiving disabled
[JENKINS] Archiving disabled
[JENKINS] Archiving disabled
[JENKINS] Archiving disabled
[JENKINS] Archiving disabled
[JENKINS] Archiving disabled
[JENKINS] Archiving disabled
[JENKINS] Archiving disabled
[JENKINS] Archiving disabled
[JENKINS] Archiving disabled
[JENKINS] Archiving disabled
[JENKINS] Archiving disabled
[JENKINS] Archiving disabled
[JENKINS] Archiving disabled
[JENKINS] Archiving disabled
[JENKINS] Archiving disabled
[JENKINS] Archiving disabled
[JENKINS] Archiving disabled
[JENKINS] Archiving disabled
[JENKINS] Archiving disabled
[JENKINS] Archiving disabled
[JENKINS] Archiving disabled
[JENKINS] Archiving disabled
[JENKINS] Archiving disabled
[JENKINS] Archiving disabled
[JENKINS] Archiving disabled
[JENKINS] Archiving disabled
[JENKINS] Archiving disabled
[JENKINS] Archiving disabled
[JENKINS] Archiving disabled
[JENKINS] Archiving disabled
[JENKINS] Archiving disabled
[JENKINS] Archiving disabled
[JENKINS] Archiving disabled
[JENKINS] Archiving disabled
[JENKINS] Archiving disabled
[JENKINS] Archiving disabled
[JENKINS] Archiving disabled
[JENKINS] Archiving disabled
[JENKINS] Archiving disabled
[JENKINS] Archiving disabled
[JENKINS] Archiving disabled
Waiting for Jenkins to finish collecting data
[ERROR] Failed to execute goal org.apache.maven.plugins:maven-deploy-plugin:2.7:deploy (default-deploy)
on project apacheds-protocol-ntp: Failed to retrieve remote metadata org.apache.directory.server:apacheds-protocol-ntp:2.0.0-M17-SNAPSHOT/maven-metadata.xml:
Could not transfer metadata org.apache.directory.server:apacheds-protocol-ntp:2.0.0-M17-SNAPSHOT/maven-metadata.xml
from/to apache.snapshots.https (https://repository.apache.org/content/repositories/snapshots):
Failed to transfer file: https://repository.apache.org/content/repositories/snapshots/org/apache/directory/server/apacheds-protocol-ntp/2.0.0-M17-SNAPSHOT/maven-metadata.xml.
Return code is: 503, ReasonPhrase:Service Temporarily Unavailable. -> [Help 1]
[ERROR] 
[ERROR] To see the full stack trace of the errors, re-run Maven with the -e switch.
[ERROR] Re-run Maven using the -X switch to enable full debug logging.
[ERROR] 
[ERROR] For more information about the errors and possible solutions, please read the following
articles:
[ERROR] [Help 1] http://cwiki.apache.org/confluence/display/MAVEN/MojoExecutionException
[ERROR] 
[ERROR] After correcting the problems, you can resume the build with the command
[ERROR]   mvn <goals> -rf :apacheds-protocol-ntp
channel stopped

Mime
View raw message