directory-notifications mailing list archives

Site index · List index
Message view « Date » · « Thread »
Top « Date » · « Thread »
From Apache Jenkins Server <jenk...@builds.apache.org>
Subject Build failed in Jenkins: dir-studio-maven-plugin-deploy-site #1319
Date Wed, 07 May 2014 03:32:08 GMT
See <https://builds.apache.org/job/dir-studio-maven-plugin-deploy-site/1319/>

------------------------------------------
Started by timer
Building remotely on ubuntu5 (Ubuntu ubuntu) in workspace <https://builds.apache.org/job/dir-studio-maven-plugin-deploy-site/ws/>
Updating http://svn.apache.org/repos/asf/directory/buildtools/studio-plugin/trunk at revision
'2014-05-07T03:31:06.124 +0000'
At revision 1592935
no change for http://svn.apache.org/repos/asf/directory/buildtools/studio-plugin/trunk since
the previous build
Parsing POMs
maven3-agent.jar already up to date
maven3-interceptor.jar already up to date
maven3-interceptor-commons.jar already up to date
[trunk] $ /home/hudson/tools/java/latest1.7/bin/java -cp /home/jenkins/jenkins-slave/maven3-agent.jar:/home/hudson/tools/maven/apache-maven-3.0.4/boot/plexus-classworlds-2.4.jar
org.jvnet.hudson.maven3.agent.Maven3Main /home/hudson/tools/maven/apache-maven-3.0.4 /home/jenkins/jenkins-slave/slave.jar
/home/jenkins/jenkins-slave/maven3-interceptor.jar /home/jenkins/jenkins-slave/maven3-interceptor-commons.jar
38993
<===[JENKINS REMOTING CAPACITY]===>   channel started
Executing Maven:  -B -f <https://builds.apache.org/job/dir-studio-maven-plugin-deploy-site/ws/trunk/pom.xml>
-Dmaven.repo.local=/home/jenkins/jenkins-slave/maven-repositories/1 -V clean deploy site
Apache Maven 3.0.4 (r1232337; 2012-01-17 08:44:56+0000)
Maven home: /home/jenkins/tools/maven/apache-maven-3.0.4
Java version: 1.7.0_25, vendor: Oracle Corporation
Java home: /home/jenkins/tools/java/jdk1.7.0_25-32/jre
Default locale: en_US, platform encoding: ANSI_X3.4-1968
OS name: "linux", version: "3.2.0-51-generic", arch: "i386", family: "unix"
[INFO] Scanning for projects...
[INFO]                                                                         
[INFO] ------------------------------------------------------------------------
[INFO] Building Apache Directory Studio Plugin 1.0.6-SNAPSHOT
[INFO] ------------------------------------------------------------------------
[INFO] 
[INFO] --- maven-clean-plugin:2.4.1:clean (default-clean) @ studio-maven-plugin ---
[INFO] Deleting <https://builds.apache.org/job/dir-studio-maven-plugin-deploy-site/ws/trunk/target>
[INFO] 
[INFO] --- maven-plugin-plugin:2.9:descriptor (default-descriptor) @ studio-maven-plugin ---
[INFO] Using 'UTF-8' encoding to read mojo metadata.
[INFO] Applying mojo extractor for language: java
[INFO] Mojo extractor for language: java found 6 mojo descriptors.
[INFO] Applying mojo extractor for language: bsh
[INFO] Mojo extractor for language: bsh found 0 mojo descriptors.
[INFO] 
[INFO] --- maven-remote-resources-plugin:1.2.1:process (default) @ studio-maven-plugin ---
[INFO] 
[INFO] --- maven-resources-plugin:2.5:resources (default-resources) @ studio-maven-plugin
---
[debug] execute contextualize
[INFO] Using 'UTF-8' encoding to copy filtered resources.
[INFO] skip non existing resourceDirectory <https://builds.apache.org/job/dir-studio-maven-plugin-deploy-site/ws/trunk/src/main/resources>
[INFO] Copying 3 resources
[INFO] 
[INFO] --- maven-compiler-plugin:2.3.2:compile (default-compile) @ studio-maven-plugin ---
[INFO] Compiling 8 source files to <https://builds.apache.org/job/dir-studio-maven-plugin-deploy-site/ws/trunk/target/classes>
[INFO] 
[INFO] --- maven-resources-plugin:2.5:testResources (default-testResources) @ studio-maven-plugin
---
[debug] execute contextualize
[INFO] Using 'UTF-8' encoding to copy filtered resources.
[INFO] Copying 16 resources
[INFO] Copying 3 resources
[INFO] 
[INFO] --- maven-compiler-plugin:2.3.2:testCompile (default-testCompile) @ studio-maven-plugin
---
[INFO] Compiling 6 source files to <https://builds.apache.org/job/dir-studio-maven-plugin-deploy-site/ws/trunk/target/test-classes>
[INFO] 
[INFO] --- maven-surefire-plugin:2.10:test (default-test) @ studio-maven-plugin ---
[INFO] Surefire report directory: <https://builds.apache.org/job/dir-studio-maven-plugin-deploy-site/ws/trunk/target/surefire-reports>

-------------------------------------------------------
 T E S T S
-------------------------------------------------------

Results :

Tests run: 0, Failures: 0, Errors: 0, Skipped: 0

[JENKINS] Recording test results
[INFO] 
[INFO] --- maven-jar-plugin:2.3.2:jar (default-jar) @ studio-maven-plugin ---
[INFO] Building jar: <https://builds.apache.org/job/dir-studio-maven-plugin-deploy-site/ws/trunk/target/studio-maven-plugin-1.0.6-SNAPSHOT.jar>
[INFO] 
[INFO] --- maven-plugin-plugin:2.9:addPluginArtifactMetadata (default-addPluginArtifactMetadata)
@ studio-maven-plugin ---
[WARNING] Failed to getClass for org.apache.maven.plugin.source.SourceJarMojo
[INFO] 
[INFO] --- maven-source-plugin:2.1.2:jar (attach-sources) @ studio-maven-plugin ---
[INFO] META-INF already added, skipping
[INFO] META-INF/NOTICE already added, skipping
[INFO] META-INF/LICENSE already added, skipping
[INFO] META-INF/DEPENDENCIES already added, skipping
[INFO] Building jar: <https://builds.apache.org/job/dir-studio-maven-plugin-deploy-site/ws/trunk/target/studio-maven-plugin-1.0.6-SNAPSHOT-sources.jar>
[INFO] META-INF already added, skipping
[INFO] META-INF/NOTICE already added, skipping
[INFO] META-INF/LICENSE already added, skipping
[INFO] META-INF/DEPENDENCIES already added, skipping
[INFO] 
[INFO] --- tools-maven-plugin:1.4:verify-legal-files (verify-legal-files) @ studio-maven-plugin
---
[INFO] Checking legal files in: studio-maven-plugin-1.0.6-SNAPSHOT.jar
[INFO] Checking legal files in: studio-maven-plugin-1.0.6-SNAPSHOT-sources.jar
[INFO] 
[INFO] --- maven-install-plugin:2.3.1:install (default-install) @ studio-maven-plugin ---
[INFO] Installing <https://builds.apache.org/job/dir-studio-maven-plugin-deploy-site/ws/trunk/target/studio-maven-plugin-1.0.6-SNAPSHOT.jar>
to /home/jenkins/jenkins-slave/maven-repositories/1/org/apache/directory/studio/studio-maven-plugin/1.0.6-SNAPSHOT/studio-maven-plugin-1.0.6-SNAPSHOT.jar
[INFO] Installing <https://builds.apache.org/job/dir-studio-maven-plugin-deploy-site/ws/trunk/pom.xml>
to /home/jenkins/jenkins-slave/maven-repositories/1/org/apache/directory/studio/studio-maven-plugin/1.0.6-SNAPSHOT/studio-maven-plugin-1.0.6-SNAPSHOT.pom
[INFO] Installing <https://builds.apache.org/job/dir-studio-maven-plugin-deploy-site/ws/trunk/target/studio-maven-plugin-1.0.6-SNAPSHOT-sources.jar>
to /home/jenkins/jenkins-slave/maven-repositories/1/org/apache/directory/studio/studio-maven-plugin/1.0.6-SNAPSHOT/studio-maven-plugin-1.0.6-SNAPSHOT-sources.jar
[INFO] 
[INFO] --- maven-deploy-plugin:2.7:deploy (default-deploy) @ studio-maven-plugin ---
Downloading: https://repository.apache.org/content/repositories/snapshots/org/apache/directory/studio/studio-maven-plugin/1.0.6-SNAPSHOT/maven-metadata.xml
Downloaded: https://repository.apache.org/content/repositories/snapshots/org/apache/directory/studio/studio-maven-plugin/1.0.6-SNAPSHOT/maven-metadata.xml
(1018 B at 0.1 KB/sec)
Uploading: https://repository.apache.org/content/repositories/snapshots/org/apache/directory/studio/studio-maven-plugin/1.0.6-SNAPSHOT/studio-maven-plugin-1.0.6-20140507.033145-763.jar
Uploaded: https://repository.apache.org/content/repositories/snapshots/org/apache/directory/studio/studio-maven-plugin/1.0.6-SNAPSHOT/studio-maven-plugin-1.0.6-20140507.033145-763.jar
(36 KB at 102.8 KB/sec)
Uploading: https://repository.apache.org/content/repositories/snapshots/org/apache/directory/studio/studio-maven-plugin/1.0.6-SNAPSHOT/studio-maven-plugin-1.0.6-20140507.033145-763.pom
Uploaded: https://repository.apache.org/content/repositories/snapshots/org/apache/directory/studio/studio-maven-plugin/1.0.6-SNAPSHOT/studio-maven-plugin-1.0.6-20140507.033145-763.pom
(10 KB at 26.0 KB/sec)
Downloading: https://repository.apache.org/content/repositories/snapshots/org/apache/directory/studio/studio-maven-plugin/maven-metadata.xml
Downloaded: https://repository.apache.org/content/repositories/snapshots/org/apache/directory/studio/studio-maven-plugin/maven-metadata.xml
(366 B at 0.9 KB/sec)
Downloading: https://repository.apache.org/content/repositories/snapshots/org/apache/directory/studio/maven-metadata.xml
Downloaded: https://repository.apache.org/content/repositories/snapshots/org/apache/directory/studio/maven-metadata.xml
(243 B at 0.8 KB/sec)
Uploading: https://repository.apache.org/content/repositories/snapshots/org/apache/directory/studio/studio-maven-plugin/1.0.6-SNAPSHOT/maven-metadata.xml
Uploaded: https://repository.apache.org/content/repositories/snapshots/org/apache/directory/studio/studio-maven-plugin/1.0.6-SNAPSHOT/maven-metadata.xml
(1018 B at 2.9 KB/sec)
Uploading: https://repository.apache.org/content/repositories/snapshots/org/apache/directory/studio/studio-maven-plugin/maven-metadata.xml
Uploaded: https://repository.apache.org/content/repositories/snapshots/org/apache/directory/studio/studio-maven-plugin/maven-metadata.xml
(366 B at 0.5 KB/sec)
Uploading: https://repository.apache.org/content/repositories/snapshots/org/apache/directory/studio/maven-metadata.xml
[WARNING] Failed to upload MD5 checksum for /home/jenkins/jenkins-slave/maven-repositories/1/org/apache/directory/studio/maven-metadata-apache.snapshots.https.xml:
Failed to transfer file: https://repository.apache.org/content/repositories/snapshots/org/apache/directory/studio/maven-metadata.xml.md5.
Return code is: 503, ReasonPhrase:Service Temporarily Unavailable.
org.apache.maven.wagon.TransferFailedException: Failed to transfer file: https://repository.apache.org/content/repositories/snapshots/org/apache/directory/studio/maven-metadata.xml.md5.
Return code is: 503, ReasonPhrase:Service Temporarily Unavailable.
	at org.apache.maven.wagon.shared.http4.AbstractHttpClientWagon.put(AbstractHttpClientWagon.java:562)
	at org.apache.maven.wagon.shared.http4.AbstractHttpClientWagon.put(AbstractHttpClientWagon.java:471)
	at org.apache.maven.wagon.shared.http4.AbstractHttpClientWagon.putFromStream(AbstractHttpClientWagon.java:465)
	at org.sonatype.aether.connector.wagon.WagonRepositoryConnector$PutTask.uploadChecksum(WagonRepositoryConnector.java:886)
	at org.sonatype.aether.connector.wagon.WagonRepositoryConnector$PutTask.uploadChecksums(WagonRepositoryConnector.java:861)
	at org.sonatype.aether.connector.wagon.WagonRepositoryConnector$PutTask.run(WagonRepositoryConnector.java:818)
	at org.sonatype.aether.connector.wagon.WagonRepositoryConnector.put(WagonRepositoryConnector.java:475)
	at org.sonatype.aether.impl.internal.DefaultDeployer.deploy(DefaultDeployer.java:305)
	at org.sonatype.aether.impl.internal.DefaultDeployer.deploy(DefaultDeployer.java:211)
	at org.sonatype.aether.impl.internal.DefaultRepositorySystem.deploy(DefaultRepositorySystem.java:443)
	at org.apache.maven.artifact.deployer.DefaultArtifactDeployer.deploy(DefaultArtifactDeployer.java:137)
	at org.apache.maven.plugin.deploy.AbstractDeployMojo.deploy(AbstractDeployMojo.java:167)
	at org.apache.maven.plugin.deploy.DeployMojo.execute(DeployMojo.java:157)
	at org.apache.maven.plugin.DefaultBuildPluginManager.executeMojo(DefaultBuildPluginManager.java:101)
	at org.apache.maven.lifecycle.internal.MojoExecutor.execute(MojoExecutor.java:209)
	at org.apache.maven.lifecycle.internal.MojoExecutor.execute(MojoExecutor.java:153)
	at org.apache.maven.lifecycle.internal.MojoExecutor.execute(MojoExecutor.java:145)
	at org.apache.maven.lifecycle.internal.LifecycleModuleBuilder.buildProject(LifecycleModuleBuilder.java:84)
	at org.apache.maven.lifecycle.internal.LifecycleModuleBuilder.buildProject(LifecycleModuleBuilder.java:59)
	at org.apache.maven.lifecycle.internal.LifecycleStarter.singleThreadedBuild(LifecycleStarter.java:183)
	at org.apache.maven.lifecycle.internal.LifecycleStarter.execute(LifecycleStarter.java:161)
	at org.apache.maven.DefaultMaven.doExecute(DefaultMaven.java:320)
	at org.apache.maven.DefaultMaven.execute(DefaultMaven.java:156)
	at org.jvnet.hudson.maven3.launcher.Maven3Launcher.main(Maven3Launcher.java:117)
	at sun.reflect.NativeMethodAccessorImpl.invoke0(Native Method)
	at sun.reflect.NativeMethodAccessorImpl.invoke(NativeMethodAccessorImpl.java:57)
	at sun.reflect.DelegatingMethodAccessorImpl.invoke(DelegatingMethodAccessorImpl.java:43)
	at java.lang.reflect.Method.invoke(Method.java:606)
	at org.codehaus.plexus.classworlds.launcher.Launcher.launchStandard(Launcher.java:329)
	at org.codehaus.plexus.classworlds.launcher.Launcher.launch(Launcher.java:239)
	at org.jvnet.hudson.maven3.agent.Maven3Main.launch(Maven3Main.java:178)
	at sun.reflect.NativeMethodAccessorImpl.invoke0(Native Method)
	at sun.reflect.NativeMethodAccessorImpl.invoke(NativeMethodAccessorImpl.java:57)
	at sun.reflect.DelegatingMethodAccessorImpl.invoke(DelegatingMethodAccessorImpl.java:43)
	at java.lang.reflect.Method.invoke(Method.java:606)
	at hudson.maven.Maven3Builder.call(Maven3Builder.java:134)
	at hudson.maven.Maven3Builder.call(Maven3Builder.java:69)
	at hudson.remoting.UserRequest.perform(UserRequest.java:118)
	at hudson.remoting.UserRequest.perform(UserRequest.java:48)
	at hudson.remoting.Request$2.run(Request.java:328)
	at hudson.remoting.InterceptingExecutorService$1.call(InterceptingExecutorService.java:72)
	at java.util.concurrent.FutureTask$Sync.innerRun(FutureTask.java:334)
	at java.util.concurrent.FutureTask.run(FutureTask.java:166)
	at java.util.concurrent.ThreadPoolExecutor.runWorker(ThreadPoolExecutor.java:1145)
	at java.util.concurrent.ThreadPoolExecutor$Worker.run(ThreadPoolExecutor.java:615)
	at java.lang.Thread.run(Thread.java:724)
Uploaded: https://repository.apache.org/content/repositories/snapshots/org/apache/directory/studio/maven-metadata.xml
(243 B at 0.7 KB/sec)
Uploading: https://repository.apache.org/content/repositories/snapshots/org/apache/directory/studio/studio-maven-plugin/1.0.6-SNAPSHOT/studio-maven-plugin-1.0.6-20140507.033145-763-sources.jar
[INFO] ------------------------------------------------------------------------
[INFO] BUILD FAILURE
[INFO] ------------------------------------------------------------------------
[INFO] Total time: 33.605s
[INFO] Finished at: Wed May 07 03:31:50 UTC 2014
[INFO] Final Memory: 29M/285M
[INFO] ------------------------------------------------------------------------
Waiting for Jenkins to finish collecting data
[ERROR] Failed to execute goal org.apache.maven.plugins:maven-deploy-plugin:2.7:deploy (default-deploy)
on project studio-maven-plugin: Failed to deploy artifacts: Could not transfer artifact org.apache.directory.studio:studio-maven-plugin:jar:sources:1.0.6-20140507.033145-763
from/to apache.snapshots.https (https://repository.apache.org/content/repositories/snapshots):
Failed to transfer file: https://repository.apache.org/content/repositories/snapshots/org/apache/directory/studio/studio-maven-plugin/1.0.6-SNAPSHOT/studio-maven-plugin-1.0.6-20140507.033145-763-sources.jar.
Return code is: 503, ReasonPhrase:Service Temporarily Unavailable. -> [Help 1]
[ERROR] 
[ERROR] To see the full stack trace of the errors, re-run Maven with the -e switch.
[ERROR] Re-run Maven using the -X switch to enable full debug logging.
[ERROR] 
[ERROR] For more information about the errors and possible solutions, please read the following
articles:
[ERROR] [Help 1] http://cwiki.apache.org/confluence/display/MAVEN/MojoExecutionException
[JENKINS] Archiving <https://builds.apache.org/job/dir-studio-maven-plugin-deploy-site/ws/trunk/pom.xml>
to org.apache.directory.studio/studio-maven-plugin/1.0.6-SNAPSHOT/studio-maven-plugin-1.0.6-SNAPSHOT.pom
[JENKINS] Archiving <https://builds.apache.org/job/dir-studio-maven-plugin-deploy-site/ws/trunk/target/studio-maven-plugin-1.0.6-SNAPSHOT.jar>
to org.apache.directory.studio/studio-maven-plugin/1.0.6-20140507.033145-763/studio-maven-plugin-1.0.6-20140507.033145-763.jar
[JENKINS] Archiving <https://builds.apache.org/job/dir-studio-maven-plugin-deploy-site/ws/trunk/target/studio-maven-plugin-1.0.6-SNAPSHOT-sources.jar>
to org.apache.directory.studio/studio-maven-plugin/1.0.6-20140507.033145-763/studio-maven-plugin-1.0.6-20140507.033145-763-sources.jar
Sending e-mails to: notifications@directory.apache.org
channel stopped

Mime
View raw message