directory-notifications mailing list archives

Site index · List index
Message view « Date » · « Thread »
Top « Date » · « Thread »
From Apache Jenkins Server <jenk...@builds.apache.org>
Subject Build failed in Jenkins: dir-shared-ubuntu-deploy » Apache Directory API Integration Tests #1297
Date Mon, 17 Mar 2014 03:17:15 GMT
See <https://builds.apache.org/job/dir-shared-ubuntu-deploy/org.apache.directory.api$api-integ/1297/>

------------------------------------------
[INFO]                                                                         
[INFO] ------------------------------------------------------------------------
[INFO] Building Apache Directory API Integration Tests 1.0.0-M22-SNAPSHOT
[INFO] ------------------------------------------------------------------------
[INFO] 
[INFO] --- maven-clean-plugin:2.4.1:clean (default-clean) @ api-integ ---
[INFO] Deleting <https://builds.apache.org/job/dir-shared-ubuntu-deploy/org.apache.directory.api$api-integ/ws/target>
[INFO] 
[INFO] --- maven-remote-resources-plugin:1.2.1:process (default) @ api-integ ---
[INFO] 
[INFO] --- maven-resources-plugin:2.6:resources (default-resources) @ api-integ ---
[INFO] Using 'UTF-8' encoding to copy filtered resources.
[INFO] skip non existing resourceDirectory <https://builds.apache.org/job/dir-shared-ubuntu-deploy/org.apache.directory.api$api-integ/ws/src/main/resources>
[INFO] Copying 3 resources
[INFO] 
[INFO] --- maven-compiler-plugin:3.1:compile (default-compile) @ api-integ ---
[INFO] No sources to compile
[INFO] 
[INFO] --- maven-resources-plugin:2.6:testResources (default-testResources) @ api-integ ---
[INFO] Using 'UTF-8' encoding to copy filtered resources.
[INFO] Copying 1 resource
[INFO] Copying 3 resources
[INFO] 
[INFO] --- maven-dependency-plugin:2.8:copy (copy) @ api-integ ---
[INFO] Configured Artifact: org.apache.directory.api:api-ldap-extras-codec:1.0.0-M22-SNAPSHOT:jar
[INFO] Copying api-ldap-extras-codec-1.0.0-M22-SNAPSHOT.jar to <https://builds.apache.org/job/dir-shared-ubuntu-deploy/org.apache.directory.api$api-integ/ws/target/pluginDirectory/api-ldap-extras-codec-1.0.0-M22-SNAPSHOT.jar>
[INFO] 
[INFO] --- maven-compiler-plugin:3.1:testCompile (default-testCompile) @ api-integ ---
[INFO] Changes detected - recompiling the module!
[INFO] Compiling 22 source files to <https://builds.apache.org/job/dir-shared-ubuntu-deploy/org.apache.directory.api$api-integ/ws/target/test-classes>
[INFO] 
[INFO] --- maven-surefire-plugin:2.15:test (default-test) @ api-integ ---
[INFO] Surefire report directory: <https://builds.apache.org/job/dir-shared-ubuntu-deploy/org.apache.directory.api$api-integ/ws/target/surefire-reports>

-------------------------------------------------------
 T E S T S
-------------------------------------------------------
Running org.apache.directory.api.ldap.subtree.SubtreeSpecificationParserTest
SLF4J: The requested version 1.6.99 by your slf4j binding is not compatible with [1.5.5, 1.5.6,
1.5.7, 1.5.8, 1.5.9, 1.5.10, 1.5.11]
SLF4J: See http://www.slf4j.org/codes.html#version_mismatch for further details.
Tests run: 15, Failures: 0, Errors: 0, Skipped: 0, Time elapsed: 1.154 sec - in org.apache.directory.api.ldap.subtree.SubtreeSpecificationParserTest
Running org.apache.directory.api.ldap.schema.syntaxCheckers.ACIItemSyntaxCheckerTest
Tests run: 17, Failures: 0, Errors: 0, Skipped: 0, Time elapsed: 0.476 sec - in org.apache.directory.api.ldap.schema.syntaxCheckers.ACIItemSyntaxCheckerTest
Running org.apache.directory.api.ldap.schema.syntaxCheckers.SubtreeSpecificationSyntaxCheckerTest
Tests run: 18, Failures: 0, Errors: 0, Skipped: 0, Time elapsed: 0.35 sec - in org.apache.directory.api.ldap.schema.syntaxCheckers.SubtreeSpecificationSyntaxCheckerTest
Running org.apache.directory.api.ldap.codec.api.StandaloneLdapCodecServiceTest
Tests run: 2, Failures: 0, Errors: 0, Skipped: 0, Time elapsed: 0.056 sec - in org.apache.directory.api.ldap.codec.api.StandaloneLdapCodecServiceTest
Running org.apache.directory.api.ldap.codec.api.DefaultLdapCodecServiceTest
Tests run: 1, Failures: 0, Errors: 0, Skipped: 0, Time elapsed: 0 sec - in org.apache.directory.api.ldap.codec.api.DefaultLdapCodecServiceTest
Running org.apache.directory.api.ldap.model.name.SchemaAwareAvaSerializationTest
[03:16:12] ERROR [org.apache.directory.api.ldap.model.name.Ava] - Cannot serialize an wrong
ATAV, the upValue should not be null
[03:16:12] ERROR [org.apache.directory.api.ldap.model.name.Ava] - Cannot serialize an wrong
ATAV, the upValue should not be null
[03:16:12] ERROR [org.apache.directory.api.ldap.model.name.Ava] - Cannot serialize an wrong
ATAV, the upValue should not be null
[03:16:12] ERROR [org.apache.directory.api.ldap.model.name.Ava] - Cannot serialize an wrong
ATAV, the upName should not be null or empty
[03:16:12] ERROR [org.apache.directory.api.ldap.model.name.Ava] - Cannot serialize an wrong
ATAV, the upName should not be null or empty
[03:16:12] ERROR [org.apache.directory.api.ldap.model.name.Ava] - Cannot serialize an wrong
ATAV, the upName should not be null or empty
[03:16:12] ERROR [org.apache.directory.api.ldap.model.name.Ava] - Cannot serialize an wrong
ATAV, the upName should not be null or empty
[03:16:12] ERROR [org.apache.directory.api.ldap.model.name.Ava] - Cannot serialize an wrong
ATAV, the upValue should not be null
Tests run: 22, Failures: 0, Errors: 0, Skipped: 4, Time elapsed: 0.31 sec - in org.apache.directory.api.ldap.model.name.SchemaAwareAvaSerializationTest
Running org.apache.directory.api.ldap.model.name.AvaTest
[03:16:12] ERROR [org.apache.directory.api.ldap.model.name.Ava] - ERR_04188 The type cannot
be empty or null
[03:16:12] ERROR [org.apache.directory.api.ldap.model.name.Ava] - ERR_04188 The type cannot
be empty or null
[03:16:12] ERROR [org.apache.directory.api.ldap.model.name.Ava] - ERR_04188 The type cannot
be empty or null
Tests run: 15, Failures: 0, Errors: 0, Skipped: 0, Time elapsed: 0.314 sec - in org.apache.directory.api.ldap.model.name.AvaTest
Running org.apache.directory.api.ldap.model.name.DnTest
[03:16:12] ERROR [org.apache.directory.api.ldap.model.name.Dn] - ERR_04206 The posn(4) should
be in the range [0, 3]
Tests run: 143, Failures: 0, Errors: 0, Skipped: 0, Time elapsed: 0.334 sec - in org.apache.directory.api.ldap.model.name.DnTest
Running org.apache.directory.api.ldap.model.name.MultiThreadedTest
Tests run: 4, Failures: 0, Errors: 0, Skipped: 0, Time elapsed: 5.735 sec - in org.apache.directory.api.ldap.model.name.MultiThreadedTest
Running org.apache.directory.api.ldap.model.name.SchemaAwareRdnTest
Tests run: 74, Failures: 0, Errors: 0, Skipped: 0, Time elapsed: 0.329 sec - in org.apache.directory.api.ldap.model.name.SchemaAwareRdnTest
Running org.apache.directory.api.ldap.model.name.RdnTest
Tests run: 3, Failures: 0, Errors: 0, Skipped: 0, Time elapsed: 0.252 sec - in org.apache.directory.api.ldap.model.name.RdnTest
Running org.apache.directory.api.ldap.model.name.SchemaAwareDnSerializationTest
Tests run: 8, Failures: 0, Errors: 0, Skipped: 1, Time elapsed: 0.255 sec - in org.apache.directory.api.ldap.model.name.SchemaAwareDnSerializationTest
Running org.apache.directory.api.ldap.model.name.SchemaAwareRdnSerializationTest
Tests run: 8, Failures: 0, Errors: 0, Skipped: 2, Time elapsed: 0.26 sec - in org.apache.directory.api.ldap.model.name.SchemaAwareRdnSerializationTest
Running org.apache.directory.api.ldap.aci.ACIItemParserTest
[03:16:20] ERROR [org.apache.directory.api.ldap.model.name.Dn] - ERR_04268_OID_NOT_FOUND OID
'x' not found in oid to schema name map!
[03:16:20] ERROR [org.apache.directory.api.ldap.model.name.Dn] - ERR_04268_OID_NOT_FOUND OID
'x' not found in oid to schema name map!
[03:16:20] ERROR [org.apache.directory.api.ldap.model.name.Dn] - ERR_04268_OID_NOT_FOUND OID
'1.2' not found in oid to schema name map!
Tests run: 24, Failures: 0, Errors: 0, Skipped: 0, Time elapsed: 0.334 sec - in org.apache.directory.api.ldap.aci.ACIItemParserTest
Running org.apache.directory.api.ldap.aci.ACIItemChekerTest
Tests run: 13, Failures: 0, Errors: 0, Skipped: 0, Time elapsed: 0.264 sec - in org.apache.directory.api.ldap.aci.ACIItemChekerTest
Running org.apache.directory.api.ldap.entry.SchemaAwareValueSerializationTest
Tests run: 12, Failures: 0, Errors: 0, Skipped: 0, Time elapsed: 0.21 sec - in org.apache.directory.api.ldap.entry.SchemaAwareValueSerializationTest
Running org.apache.directory.api.ldap.entry.SchemaAwareAttributeTest
[03:16:20] ERROR [org.apache.directory.api.ldap.model.entry.DefaultAttribute] - ERR_04130
The value is expected to be a byte[]
[03:16:20] ERROR [org.apache.directory.api.ldap.model.entry.DefaultAttribute] - ERR_04451
The value must be a String, as its AttributeType is H/R
[03:16:20] ERROR [org.apache.directory.api.ldap.model.entry.DefaultAttribute] - ERR_04487_ATTRIBUTE_IS_SINGLE_VALUED
The attribute 'dc' is single valued, we cant add no more values into it
[03:16:20] ERROR [org.apache.directory.api.ldap.model.entry.DefaultAttribute] - ERR_04487_ATTRIBUTE_IS_SINGLE_VALUED
The attribute 'c' is single valued, we cant add no more values into it
[03:16:20] ERROR [org.apache.directory.api.ldap.model.entry.DefaultAttribute] - ERR_04451
The value must be a String, as its AttributeType is H/R
[03:16:20] ERROR [org.apache.directory.api.ldap.model.entry.DefaultAttribute] - ERR_04451
The value must be a String, as its AttributeType is H/R
[03:16:20] ERROR [org.apache.directory.api.ldap.model.entry.DefaultAttribute] - ERR_04451
The value must be a String, as its AttributeType is H/R
[03:16:20] ERROR [org.apache.directory.api.ldap.model.entry.DefaultAttribute] - ERR_04451
The value must be a String, as its AttributeType is H/R
[03:16:20] ERROR [org.apache.directory.api.ldap.model.entry.DefaultAttribute] - ERR_04452
The value must be a byte[], as its AttributeType is not H/R
[03:16:20] ERROR [org.apache.directory.api.ldap.model.entry.DefaultAttribute] - ERR_04452
The value must be a byte[], as its AttributeType is not H/R
[03:16:20] ERROR [org.apache.directory.api.ldap.model.entry.DefaultAttribute] - ERR_04451
The value must be a String, as its AttributeType is H/R
[03:16:20] ERROR [org.apache.directory.api.ldap.model.entry.DefaultAttribute] - ERR_04451
The value must be a String, as its AttributeType is H/R
[03:16:20] ERROR [org.apache.directory.api.ldap.model.entry.DefaultAttribute] - ERR_04452
The value must be a byte[], as its AttributeType is not H/R
[03:16:20] ERROR [org.apache.directory.api.ldap.model.entry.DefaultAttribute] - ERR_04487_ATTRIBUTE_IS_SINGLE_VALUED
The attribute 'dc' is single valued, we cant add no more values into it
[03:16:20] ERROR [org.apache.directory.api.ldap.model.entry.DefaultAttribute] - ERR_04487_ATTRIBUTE_IS_SINGLE_VALUED
The attribute 'dc' is single valued, we cant add no more values into it
[03:16:20] ERROR [org.apache.directory.api.ldap.model.entry.DefaultAttribute] - ERR_04487_ATTRIBUTE_IS_SINGLE_VALUED
The attribute 'dc' is single valued, we cant add no more values into it
[03:16:20] ERROR [org.apache.directory.api.ldap.model.entry.DefaultAttribute] - ERR_04487_ATTRIBUTE_IS_SINGLE_VALUED
The attribute 'c' is single valued, we cant add no more values into it
[03:16:20] ERROR [org.apache.directory.api.ldap.model.entry.DefaultAttribute] - ERR_04452
The value must be a byte[], as its AttributeType is not H/R
[03:16:20] ERROR [org.apache.directory.api.ldap.model.entry.DefaultAttribute] - ERR_04451
The value must be a String, as its AttributeType is H/R
[03:16:20] ERROR [org.apache.directory.api.ldap.model.entry.DefaultAttribute] - ERR_04452
The value must be a byte[], as its AttributeType is not H/R
[03:16:20] ERROR [org.apache.directory.api.ldap.model.entry.DefaultAttribute] - ERR_04131
The value is expected to be a String
Tests run: 53, Failures: 0, Errors: 0, Skipped: 0, Time elapsed: 0.226 sec - in org.apache.directory.api.ldap.entry.SchemaAwareAttributeTest
Running org.apache.directory.api.ldap.entry.SchemaAwareEntryTest
[03:16:21] ERROR [org.apache.directory.api.ldap.model.entry.DefaultEntry] - ERR_04457_NULL_ATTRIBUTE_ID
The ID should not be null or empty
[03:16:21] ERROR [org.apache.directory.api.ldap.model.entry.DefaultEntry] - ERR_04133 The
attributeType ID should not be null or empty
[03:16:21] ERROR [org.apache.directory.api.ldap.model.entry.DefaultEntry] - ERR_04133 The
attributeType ID should not be null or empty
[03:16:21] ERROR [org.apache.directory.api.ldap.model.entry.DefaultEntry] - ERR_04134 An exception
has been raised while looking for attribute id 'null'
[03:16:21] ERROR [org.apache.directory.api.ldap.model.entry.DefaultEntry] - ERR_04133 The
attributeType ID should not be null or empty
[03:16:21] ERROR [org.apache.directory.api.ldap.model.entry.DefaultEntry] - ERR_04134 An exception
has been raised while looking for attribute id 'null'
[03:16:21] ERROR [org.apache.directory.api.ldap.model.entry.DefaultAttribute] - ERR_04486_VALUE_ALREADY_EXISTS
The value 'top' already exists in the attribute (null)
[03:16:21] ERROR [org.apache.directory.api.ldap.model.entry.DefaultEntry] - ERR_04133 The
attributeType ID should not be null or empty
[03:16:21] ERROR [org.apache.directory.api.ldap.model.entry.DefaultEntry] - ERR_04134 An exception
has been raised while looking for attribute id '  '
[03:16:21] ERROR [org.apache.directory.api.ldap.model.entry.DefaultAttribute] - ERR_04486_VALUE_ALREADY_EXISTS
The value '0x61 0x62 ' already exists in the attribute (null)
[03:16:21] ERROR [org.apache.directory.api.ldap.model.entry.DefaultEntry] - ERR_04457_NULL_ATTRIBUTE_ID
The ID should not be null or empty
[03:16:21] ERROR [org.apache.directory.api.ldap.model.entry.DefaultEntry] - ERR_04133 The
attributeType ID should not be null or empty
[03:16:21] ERROR [org.apache.directory.api.ldap.model.entry.DefaultAttribute] - ERR_04486_VALUE_ALREADY_EXISTS
The value 'test' already exists in the attribute (null)
[03:16:21] ERROR [org.apache.directory.api.ldap.model.entry.DefaultEntry] - ERR_04457_NULL_ATTRIBUTE_ID
The ID should not be null or empty
[03:16:21] ERROR [org.apache.directory.api.ldap.model.entry.DefaultEntry] - ERR_04133 The
attributeType ID should not be null or empty
[03:16:21] ERROR [org.apache.directory.api.ldap.model.entry.DefaultAttribute] - ERR_04486_VALUE_ALREADY_EXISTS
The value '0x61 0x62 ' already exists in the attribute (null)
Tests run: 37, Failures: 0, Errors: 0, Skipped: 0, Time elapsed: 0.262 sec - in org.apache.directory.api.ldap.entry.SchemaAwareEntryTest
Running org.apache.directory.api.ldap.entry.SchemaAwareAttributeSerializationTest
Tests run: 6, Failures: 0, Errors: 0, Skipped: 0, Time elapsed: 0.258 sec - in org.apache.directory.api.ldap.entry.SchemaAwareAttributeSerializationTest
Running org.apache.directory.api.ldap.entry.SchemaAwareModificationSerializationTest
Tests run: 5, Failures: 0, Errors: 0, Skipped: 0, Time elapsed: 0.202 sec - in org.apache.directory.api.ldap.entry.SchemaAwareModificationSerializationTest
Running org.apache.directory.api.ldap.entry.SchemaAwareEntrySerializationTest
[03:16:21] ERROR [org.apache.directory.api.ldap.model.entry.AbstractValue] - The 'objectClass'
AttributeType and values must both be String or binary
[03:16:21] ERROR [org.apache.directory.api.ldap.model.ldif.LdifAttributesReader] - ERR_12008_CANNOT_PARSE_LDIF_BUFFER
Cannot parse the ldif buffer : ERR_12057_BAD_ATTRIBUTE Bad attribute
Tests run: 4, Failures: 0, Errors: 1, Skipped: 0, Time elapsed: 0.211 sec <<< FAILURE!
- in org.apache.directory.api.ldap.entry.SchemaAwareEntrySerializationTest
testEntryNoDnSerialization(org.apache.directory.api.ldap.entry.SchemaAwareEntrySerializationTest)
 Time elapsed: 0.009 sec  <<< ERROR!
org.apache.directory.api.ldap.model.ldif.LdapLdifException: ERR_12009_ERROR_PARSING_LDIF_BUFFER
Error while parsing the ldif buffer
	at org.apache.directory.api.ldap.model.entry.AbstractValue.apply(AbstractValue.java:157)
	at org.apache.directory.api.ldap.model.entry.BinaryValue.<init>(BinaryValue.java:111)
	at org.apache.directory.api.ldap.model.entry.DefaultAttribute.createBinaryValue(DefaultAttribute.java:107)
	at org.apache.directory.api.ldap.model.entry.DefaultAttribute.add(DefaultAttribute.java:1152)
	at org.apache.directory.api.ldap.model.entry.DefaultAttribute.<init>(DefaultAttribute.java:300)
	at org.apache.directory.api.ldap.model.entry.DefaultEntry.put(DefaultEntry.java:1696)
	at org.apache.directory.api.ldap.model.ldif.LdifAttributesReader.parseEntryAttribute(LdifAttributesReader.java:272)
	at org.apache.directory.api.ldap.model.ldif.LdifAttributesReader.parseEntry(LdifAttributesReader.java:353)
	at org.apache.directory.api.ldap.model.ldif.LdifAttributesReader.parseEntry(LdifAttributesReader.java:581)
	at org.apache.directory.api.ldap.model.entry.DefaultEntry.createEntry(DefaultEntry.java:391)
	at org.apache.directory.api.ldap.model.entry.DefaultEntry.<init>(DefaultEntry.java:254)
	at org.apache.directory.api.ldap.model.entry.DefaultEntry.<init>(DefaultEntry.java:241)
	at org.apache.directory.api.ldap.entry.SchemaAwareEntrySerializationTest.testEntryNoDnSerialization(SchemaAwareEntrySerializationTest.java:99)


Results :

Tests in error: 
  SchemaAwareEntrySerializationTest.testEntryNoDnSerialization:99 ? LdapLdif ERR...

Tests run: 484, Failures: 0, Errors: 1, Skipped: 7

[ERROR] There are test failures.

Please refer to <https://builds.apache.org/job/dir-shared-ubuntu-deploy/org.apache.directory.api$api-integ/ws/target/surefire-reports>
for the individual test results.
[JENKINS] Recording test results
[INFO] 
[INFO] --- maven-jar-plugin:2.4:jar (default-jar) @ api-integ ---
[INFO] Building jar: <https://builds.apache.org/job/dir-shared-ubuntu-deploy/org.apache.directory.api$api-integ/ws/target/api-integ-1.0.0-M22-SNAPSHOT.jar>
[INFO] 
[INFO] --- maven-site-plugin:3.3:attach-descriptor (attach-descriptor) @ api-integ ---
[INFO] 
[INFO] --- tools-maven-plugin:1.4:verify-legal-files (verify-legal-files) @ api-integ ---
[INFO] Checking legal files in: api-integ-1.0.0-M22-SNAPSHOT.jar
[INFO] 
[INFO] --- maven-source-plugin:2.2.1:jar-no-fork (attach-sources) @ api-integ ---
[INFO] Building jar: <https://builds.apache.org/job/dir-shared-ubuntu-deploy/org.apache.directory.api$api-integ/ws/target/api-integ-1.0.0-M22-SNAPSHOT-sources.jar>
[INFO] 
[INFO] --- maven-install-plugin:2.4:install (default-install) @ api-integ ---
[INFO] Installing <https://builds.apache.org/job/dir-shared-ubuntu-deploy/org.apache.directory.api$api-integ/ws/target/api-integ-1.0.0-M22-SNAPSHOT.jar>
to /home/jenkins/jenkins-slave/maven-repositories/0/org/apache/directory/api/api-integ/1.0.0-M22-SNAPSHOT/api-integ-1.0.0-M22-SNAPSHOT.jar
[INFO] Installing <https://builds.apache.org/job/dir-shared-ubuntu-deploy/org.apache.directory.api$api-integ/ws/pom.xml>
to /home/jenkins/jenkins-slave/maven-repositories/0/org/apache/directory/api/api-integ/1.0.0-M22-SNAPSHOT/api-integ-1.0.0-M22-SNAPSHOT.pom
[INFO] Installing <https://builds.apache.org/job/dir-shared-ubuntu-deploy/org.apache.directory.api$api-integ/ws/target/api-integ-1.0.0-M22-SNAPSHOT-sources.jar>
to /home/jenkins/jenkins-slave/maven-repositories/0/org/apache/directory/api/api-integ/1.0.0-M22-SNAPSHOT/api-integ-1.0.0-M22-SNAPSHOT-sources.jar
[WARNING] Failed to getClass for org.apache.maven.plugin.source.SourceJarMojo
[INFO] 
[INFO] --- maven-source-plugin:2.2.1:jar (default-cli) @ api-integ ---
[WARNING] Artifact org.apache.directory.api:api-integ:java-source:sources:1.0.0-M22-SNAPSHOT
already attached to project, ignoring duplicate
[INFO] 
[INFO] --- maven-remote-resources-plugin:1.2.1:process (default) @ api-integ ---
[INFO] 
[INFO] --- maven-resources-plugin:2.6:resources (default-resources) @ api-integ ---
[INFO] Using 'UTF-8' encoding to copy filtered resources.
[INFO] skip non existing resourceDirectory <https://builds.apache.org/job/dir-shared-ubuntu-deploy/org.apache.directory.api$api-integ/ws/src/main/resources>
[INFO] Copying 3 resources
[INFO] Copying 3 resources
[INFO] 
[INFO] --- maven-compiler-plugin:3.1:compile (default-compile) @ api-integ ---
[INFO] No sources to compile
[INFO] 
[INFO] --- maven-resources-plugin:2.6:testResources (default-testResources) @ api-integ ---
[INFO] Using 'UTF-8' encoding to copy filtered resources.
[INFO] Copying 1 resource
[INFO] Copying 3 resources
[INFO] Copying 3 resources
[INFO] 
[INFO] --- maven-dependency-plugin:2.8:copy (copy) @ api-integ ---
[INFO] Configured Artifact: org.apache.directory.api:api-ldap-extras-codec:1.0.0-M22-SNAPSHOT:jar
[INFO] org.apache.directory.api:api-ldap-extras-codec:1.0.0-M22-SNAPSHOT:jar already exists
in <https://builds.apache.org/job/dir-shared-ubuntu-deploy/org.apache.directory.api$api-integ/ws/target/pluginDirectory>
[INFO] 
[INFO] --- maven-compiler-plugin:3.1:testCompile (default-testCompile) @ api-integ ---
[INFO] Nothing to compile - all classes are up to date
[INFO] 
[INFO] --- maven-surefire-plugin:2.15:test (default-test) @ api-integ ---
[INFO] Skipping execution of surefire because it has already been run for this configuration
[JENKINS] Recording test results
[INFO] 
[INFO] --- maven-jar-plugin:2.4:jar (default-jar) @ api-integ ---
[INFO] Building jar: <https://builds.apache.org/job/dir-shared-ubuntu-deploy/org.apache.directory.api$api-integ/ws/target/api-integ-1.0.0-M22-SNAPSHOT.jar>
[INFO] 
[INFO] --- maven-site-plugin:3.3:attach-descriptor (attach-descriptor) @ api-integ ---
[INFO] 
[INFO] --- tools-maven-plugin:1.4:verify-legal-files (verify-legal-files) @ api-integ ---
[INFO] Checking legal files in: api-integ-1.0.0-M22-SNAPSHOT.jar
[INFO] Checking legal files in: api-integ-1.0.0-M22-SNAPSHOT-sources.jar
[INFO] 
[INFO] --- maven-source-plugin:2.2.1:jar-no-fork (attach-sources) @ api-integ ---
[INFO] Building jar: <https://builds.apache.org/job/dir-shared-ubuntu-deploy/org.apache.directory.api$api-integ/ws/target/api-integ-1.0.0-M22-SNAPSHOT-sources.jar>
[WARNING] Artifact org.apache.directory.api:api-integ:java-source:sources:1.0.0-M22-SNAPSHOT
already attached to project, ignoring duplicate
[INFO] 
[INFO] --- maven-install-plugin:2.4:install (default-install) @ api-integ ---
[INFO] Installing <https://builds.apache.org/job/dir-shared-ubuntu-deploy/org.apache.directory.api$api-integ/ws/target/api-integ-1.0.0-M22-SNAPSHOT.jar>
to /home/jenkins/jenkins-slave/maven-repositories/0/org/apache/directory/api/api-integ/1.0.0-M22-SNAPSHOT/api-integ-1.0.0-M22-SNAPSHOT.jar
[INFO] Installing <https://builds.apache.org/job/dir-shared-ubuntu-deploy/org.apache.directory.api$api-integ/ws/pom.xml>
to /home/jenkins/jenkins-slave/maven-repositories/0/org/apache/directory/api/api-integ/1.0.0-M22-SNAPSHOT/api-integ-1.0.0-M22-SNAPSHOT.pom
[INFO] Installing <https://builds.apache.org/job/dir-shared-ubuntu-deploy/org.apache.directory.api$api-integ/ws/target/api-integ-1.0.0-M22-SNAPSHOT-sources.jar>
to /home/jenkins/jenkins-slave/maven-repositories/0/org/apache/directory/api/api-integ/1.0.0-M22-SNAPSHOT/api-integ-1.0.0-M22-SNAPSHOT-sources.jar
[INFO] 
[INFO] --- maven-deploy-plugin:2.7:deploy (default-deploy) @ api-integ ---
Downloading: https://repository.apache.org/content/repositories/snapshots/org/apache/directory/api/api-integ/1.0.0-M22-SNAPSHOT/maven-metadata.xml
Downloaded: https://repository.apache.org/content/repositories/snapshots/org/apache/directory/api/api-integ/1.0.0-M22-SNAPSHOT/maven-metadata.xml
(1013 B at 0.1 KB/sec)
Uploading: https://repository.apache.org/content/repositories/snapshots/org/apache/directory/api/api-integ/1.0.0-M22-SNAPSHOT/api-integ-1.0.0-M22-20140317.031639-10.jar
Uploaded: https://repository.apache.org/content/repositories/snapshots/org/apache/directory/api/api-integ/1.0.0-M22-SNAPSHOT/api-integ-1.0.0-M22-20140317.031639-10.jar
(8 KB at 20.1 KB/sec)
Uploading: https://repository.apache.org/content/repositories/snapshots/org/apache/directory/api/api-integ/1.0.0-M22-SNAPSHOT/api-integ-1.0.0-M22-20140317.031639-10.pom

Mime
View raw message