directory-notifications mailing list archives

Site index · List index
Message view « Date » · « Thread »
Top « Date » · « Thread »
From Apache Jenkins Server <jenk...@builds.apache.org>
Subject Build failed in Jenkins: dir-apacheds-ubuntu-deploy #1259
Date Wed, 12 Feb 2014 04:33:28 GMT
See <https://builds.apache.org/job/dir-apacheds-ubuntu-deploy/1259/>

------------------------------------------
[...truncated 5607 lines...]
[INFO] 
[INFO] --- maven-clean-plugin:2.4.1:clean (default-clean) @ apacheds-core-integ ---
[INFO] Deleting <https://builds.apache.org/job/dir-apacheds-ubuntu-deploy/ws/trunk/core-integ/target>
[INFO] 
[INFO] --- maven-remote-resources-plugin:1.2.1:process (default) @ apacheds-core-integ ---
[INFO] 
[INFO] --- maven-resources-plugin:2.6:resources (default-resources) @ apacheds-core-integ
---
[INFO] Using 'UTF-8' encoding to copy filtered resources.
[INFO] Copying 0 resource
[INFO] Copying 3 resources
[INFO] 
[INFO] --- maven-compiler-plugin:3.1:compile (default-compile) @ apacheds-core-integ ---
[INFO] Changes detected - recompiling the module!
[INFO] Compiling 1 source file to <https://builds.apache.org/job/dir-apacheds-ubuntu-deploy/ws/trunk/core-integ/target/classes>
[INFO] 
[INFO] --- maven-resources-plugin:2.6:testResources (default-testResources) @ apacheds-core-integ
---
[INFO] Using 'UTF-8' encoding to copy filtered resources.
[INFO] Copying 9 resources
[INFO] Copying 3 resources
[INFO] 
[INFO] --- maven-dependency-plugin:2.8:copy (copy) @ apacheds-core-integ ---
[INFO] Configured Artifact: org.apache.directory.api:api-ldap-extras-codec:1.0.0-M21-SNAPSHOT:jar
[INFO] Copying api-ldap-extras-codec-1.0.0-M21-SNAPSHOT.jar to <https://builds.apache.org/job/dir-apacheds-ubuntu-deploy/ws/trunk/core-integ/target/pluginDirectory/api-ldap-extras-codec-1.0.0-M21-20140212.033130-147.jar>
[INFO] 
[INFO] --- maven-compiler-plugin:3.1:testCompile (default-testCompile) @ apacheds-core-integ
---
[INFO] Changes detected - recompiling the module!
[INFO] Compiling 105 source files to <https://builds.apache.org/job/dir-apacheds-ubuntu-deploy/ws/trunk/core-integ/target/test-classes>
[WARNING] <https://builds.apache.org/job/dir-apacheds-ubuntu-deploy/ws/trunk/core-integ/src/test/java/org/apache/directory/server/core/operations/search/SearchIT.java>:
<https://builds.apache.org/job/dir-apacheds-ubuntu-deploy/ws/trunk/core-integ/src/test/java/org/apache/directory/server/core/operations/search/SearchIT.java>
uses unchecked or unsafe operations.
[WARNING] <https://builds.apache.org/job/dir-apacheds-ubuntu-deploy/ws/trunk/core-integ/src/test/java/org/apache/directory/server/core/operations/search/SearchIT.java>:
Recompile with -Xlint:unchecked for details.
[INFO] 
[INFO] --- maven-surefire-plugin:2.15:test (default-test) @ apacheds-core-integ ---
[INFO] Surefire report directory: <https://builds.apache.org/job/dir-apacheds-ubuntu-deploy/ws/trunk/core-integ/target/surefire-reports>

-------------------------------------------------------
 T E S T S
-------------------------------------------------------
Running org.apache.directory.server.core.subtree.BadSubentryServiceIT
Tests run: 1, Failures: 0, Errors: 0, Skipped: 0, Time elapsed: 29.315 sec - in org.apache.directory.server.core.subtree.BadSubentryServiceIT
Running org.apache.directory.server.core.subtree.SubentryServiceIT
Tests run: 17, Failures: 0, Errors: 0, Skipped: 16, Time elapsed: 32.29 sec - in org.apache.directory.server.core.subtree.SubentryServiceIT
Running org.apache.directory.server.core.subtree.SubentryServiceEntryModificationHandlingIT
Tests run: 1, Failures: 0, Errors: 0, Skipped: 0, Time elapsed: 21.53 sec - in org.apache.directory.server.core.subtree.SubentryServiceEntryModificationHandlingIT
Running org.apache.directory.server.core.subtree.SubentryServiceObjectClassChangeHandlingIT
Tests run: 1, Failures: 0, Errors: 0, Skipped: 0, Time elapsed: 14.859 sec - in org.apache.directory.server.core.subtree.SubentryServiceObjectClassChangeHandlingIT
Running org.apache.directory.server.core.configuration.PartitionConfigurationIT
Tests run: 1, Failures: 0, Errors: 0, Skipped: 0, Time elapsed: 16.059 sec - in org.apache.directory.server.core.configuration.PartitionConfigurationIT
Running org.apache.directory.server.core.sp.LdapClassLoaderIT
Tests run: 2, Failures: 0, Errors: 0, Skipped: 0, Time elapsed: 13.089 sec - in org.apache.directory.server.core.sp.LdapClassLoaderIT
Running org.apache.directory.server.core.changelog.DefaultChangeLogIT
Tests run: 7, Failures: 0, Errors: 0, Skipped: 0, Time elapsed: 41.5 sec - in org.apache.directory.server.core.changelog.DefaultChangeLogIT
Running org.apache.directory.server.core.schema.MetaNormalizerHandlerIT
Tests run: 20, Failures: 0, Errors: 0, Skipped: 12, Time elapsed: 10.232 sec - in org.apache.directory.server.core.schema.MetaNormalizerHandlerIT
Running org.apache.directory.server.core.schema.MetaSchemaHandlerIT
Tests run: 29, Failures: 0, Errors: 0, Skipped: 16, Time elapsed: 13.258 sec - in org.apache.directory.server.core.schema.MetaSchemaHandlerIT
Running org.apache.directory.server.core.schema.MetaComparatorHandlerIT
Tests run: 20, Failures: 0, Errors: 0, Skipped: 12, Time elapsed: 12.132 sec - in org.apache.directory.server.core.schema.MetaComparatorHandlerIT
Running org.apache.directory.server.core.schema.MetaObjectClassHandlerIT
Tests run: 27, Failures: 0, Errors: 0, Skipped: 12, Time elapsed: 16.716 sec - in org.apache.directory.server.core.schema.MetaObjectClassHandlerIT
Running org.apache.directory.server.core.schema.MetaMatchingRuleHandlerIT
Tests run: 14, Failures: 0, Errors: 0, Skipped: 9, Time elapsed: 9.917 sec - in org.apache.directory.server.core.schema.MetaMatchingRuleHandlerIT
Running org.apache.directory.server.core.schema.SchemaServiceIT
Tests run: 23, Failures: 0, Errors: 0, Skipped: 0, Time elapsed: 19.568 sec - in org.apache.directory.server.core.schema.SchemaServiceIT
Running org.apache.directory.server.core.schema.MetaAttributeTypeHandlerIT
Tests run: 19, Failures: 0, Errors: 0, Skipped: 11, Time elapsed: 9.709 sec - in org.apache.directory.server.core.schema.MetaAttributeTypeHandlerIT
Running org.apache.directory.server.core.schema.MetaSyntaxCheckerHandlerIT
Tests run: 20, Failures: 0, Errors: 0, Skipped: 12, Time elapsed: 7.517 sec - in org.apache.directory.server.core.schema.MetaSyntaxCheckerHandlerIT
Running org.apache.directory.server.core.schema.MetaSyntaxHandlerIT
Tests run: 18, Failures: 0, Errors: 0, Skipped: 12, Time elapsed: 7.981 sec - in org.apache.directory.server.core.schema.MetaSyntaxHandlerIT
Running org.apache.directory.server.core.schema.SubschemaSubentryIT
Tests run: 17, Failures: 0, Errors: 0, Skipped: 1, Time elapsed: 31.465 sec - in org.apache.directory.server.core.schema.SubschemaSubentryIT
Running org.apache.directory.server.core.schema.SchemaPersistenceIT
Tests run: 2, Failures: 0, Errors: 0, Skipped: 0, Time elapsed: 13.131 sec - in org.apache.directory.server.core.schema.SchemaPersistenceIT
Running org.apache.directory.server.core.schema.ObjectClassCreateIT
Tests run: 4, Failures: 0, Errors: 0, Skipped: 0, Time elapsed: 7.006 sec - in org.apache.directory.server.core.schema.ObjectClassCreateIT
Running org.apache.directory.server.core.schema.PartitionSchemaLoaderIT
Tests run: 1, Failures: 0, Errors: 0, Skipped: 0, Time elapsed: 0.392 sec - in org.apache.directory.server.core.schema.PartitionSchemaLoaderIT
Running org.apache.directory.server.core.trigger.TriggerInterceptorIT
Tests run: 1, Failures: 0, Errors: 0, Skipped: 1, Time elapsed: 0 sec - in org.apache.directory.server.core.trigger.TriggerInterceptorIT
Running org.apache.directory.server.core.trigger.SubentryServiceForTriggersIT
Tests run: 1, Failures: 0, Errors: 0, Skipped: 1, Time elapsed: 0 sec - in org.apache.directory.server.core.trigger.SubentryServiceForTriggersIT
Running org.apache.directory.server.core.event.EventServiceIT
Tests run: 2, Failures: 0, Errors: 0, Skipped: 0, Time elapsed: 15.307 sec - in org.apache.directory.server.core.event.EventServiceIT
Running org.apache.directory.server.core.authn.SimpleAuthenticationIT
Tests run: 12, Failures: 0, Errors: 0, Skipped: 0, Time elapsed: 16.361 sec - in org.apache.directory.server.core.authn.SimpleAuthenticationIT
Running org.apache.directory.server.core.exception.ExceptionServiceIT
Tests run: 19, Failures: 0, Errors: 0, Skipped: 0, Time elapsed: 16.848 sec - in org.apache.directory.server.core.exception.ExceptionServiceIT
Running org.apache.directory.server.core.operations.modify.ModifyMVAttributeIT
Tests run: 2, Failures: 0, Errors: 0, Skipped: 2, Time elapsed: 6.603 sec - in org.apache.directory.server.core.operations.modify.ModifyMVAttributeIT
Running org.apache.directory.server.core.operations.modify.ModifyDelIT
Tests run: 13, Failures: 0, Errors: 0, Skipped: 0, Time elapsed: 80.421 sec - in org.apache.directory.server.core.operations.modify.ModifyDelIT
Running org.apache.directory.server.core.operations.modify.ModifyAddIT
Tests run: 18, Failures: 0, Errors: 0, Skipped: 0, Time elapsed: 92.851 sec - in org.apache.directory.server.core.operations.modify.ModifyAddIT
Running org.apache.directory.server.core.operations.modify.ModifyMultipleChangesIT
Tests run: 1, Failures: 0, Errors: 0, Skipped: 0, Time elapsed: 13.234 sec - in org.apache.directory.server.core.operations.modify.ModifyMultipleChangesIT
Running org.apache.directory.server.core.operations.rename.RenameIT
Tests run: 1, Failures: 0, Errors: 0, Skipped: 0, Time elapsed: 13.979 sec - in org.apache.directory.server.core.operations.rename.RenameIT
Running org.apache.directory.server.core.operations.exists.ExistsIT
Tests run: 2, Failures: 0, Errors: 0, Skipped: 0, Time elapsed: 9.25 sec - in org.apache.directory.server.core.operations.exists.ExistsIT
Running org.apache.directory.server.core.operations.lookup.LookupIT
Tests run: 8, Failures: 0, Errors: 0, Skipped: 0, Time elapsed: 10.332 sec - in org.apache.directory.server.core.operations.lookup.LookupIT
Running org.apache.directory.server.core.operations.bind.SimpleBindIT
Tests run: 9, Failures: 0, Errors: 0, Skipped: 0, Time elapsed: 9.223 sec - in org.apache.directory.server.core.operations.bind.SimpleBindIT
Running org.apache.directory.server.core.operations.add.AddIT
Tests run: 2, Failures: 0, Errors: 0, Skipped: 0, Time elapsed: 21.812 sec - in org.apache.directory.server.core.operations.add.AddIT
Running org.apache.directory.server.core.operations.add.DIRSERVER783IT
Tests run: 1, Failures: 0, Errors: 0, Skipped: 0, Time elapsed: 14.316 sec - in org.apache.directory.server.core.operations.add.DIRSERVER783IT
Running org.apache.directory.server.core.operations.add.PasswordHashingInterceptorTest
Killed

Results :

Tests run: 336, Failures: 0, Errors: 0, Skipped: 117

[JENKINS] Recording test results
[JENKINS] Archiving disabled
[INFO] ------------------------------------------------------------------------
[INFO] Reactor Summary:
[INFO] 
[INFO] ApacheDS .......................................... SUCCESS [26.529s]
[INFO] ApacheDS I18n ..................................... SUCCESS [7.704s]
[INFO] ApacheDS Core Constants ........................... SUCCESS [5.558s]
[INFO] ApacheDS Core API ................................. SUCCESS [30.508s]
[INFO] ApacheDS Core Shared .............................. SUCCESS [9.688s]
[INFO] ApacheDS Interceptors ............................. SUCCESS [4.333s]
[INFO] ApacheDS AdministrativePoint Interceptor .......... SUCCESS [8.038s]
[INFO] ApacheDS Authentication Interceptor ............... SUCCESS [12.020s]
[INFO] ApacheDS Authorization Interceptor ................ SUCCESS [11.578s]
[INFO] ApacheDS ChangeLog Interceptor .................... SUCCESS [9.581s]
[INFO] ApacheDS Collective Attribute Interceptor ......... SUCCESS [7.283s]
[INFO] ApacheDS Event Interceptor ........................ SUCCESS [7.177s]
[INFO] ApacheDS Exception Interceptor .................... SUCCESS [7.043s]
[INFO] ApacheDS Journal Interceptor ...................... SUCCESS [6.581s]
[INFO] ApacheDS Normalization Interceptor ................ SUCCESS [8.963s]
[INFO] ApacheDS Operational Attribute Interceptor ........ SUCCESS [6.662s]
[INFO] ApacheDS Referral Interceptor ..................... SUCCESS [6.753s]
[INFO] ApacheDS Schema Interceptor ....................... SUCCESS [9.694s]
[INFO] ApacheDS Subtree Interceptor ...................... SUCCESS [10.272s]
[INFO] ApacheDS Triggers Interceptor ..................... SUCCESS [7.541s]
[INFO] ApacheDS Core ..................................... SUCCESS [10.022s]
[INFO] ApacheDS Core AVL ................................. SUCCESS [11.858s]
[INFO] ApacheDS Generalized (X) DBM Partition ............ SUCCESS [17.248s]
[INFO] ApacheDS LDIF Partition ........................... SUCCESS [16.202s]
[INFO] ApacheDS JDBM Partition ........................... SUCCESS [1:05.214s]
[INFO] ApacheDS Mavibot Partition ........................ SUCCESS [19.381s]
[INFO] ApacheDS Core Annotations ......................... SUCCESS [1:23.619s]
[INFO] ApacheDS Core JNDI ................................ SUCCESS [10.798s]
[INFO] ApacheDS Protocol Kerberos Codec .................. SUCCESS [28.624s]
[INFO] ApacheDS Interceptors for Kerberos ................ SUCCESS [7.623s]
[INFO] ApacheDS Protocol Dhcp ............................ SUCCESS [10.783s]
[INFO] ApacheDS Protocol Shared .......................... SUCCESS [7.166s]
[INFO] ApacheDS Protocol Dns ............................. SUCCESS [9.749s]
[INFO] ApacheDS Protocol Kerberos ........................ SUCCESS [11.514s]
[INFO] ApacheDS Protocol Ldap ............................ SUCCESS [3:37.239s]
[INFO] ApacheDS Protocol Ntp ............................. SUCCESS [8.085s]
[INFO] Apacheds Server Annotations ....................... SUCCESS [1:10.715s]
[INFO] ApacheDS Server Config ............................ SUCCESS [18.261s]
[INFO] ApacheDS Server JNDI .............................. SUCCESS [8.866s]
[INFO] ApacheDS Test Framework ........................... SUCCESS [2:24.459s]
[INFO] ApacheDS All ...................................... SUCCESS [12.072s]
[INFO] ApacheDS Logger Interceptor ....................... SUCCESS [5.819s]
[INFO] ApacheDS Password Hashing Interceptor ............. SUCCESS [6.464s]
[INFO] ApacheDS Core Integration ......................... FAILURE [11:30.275s]
[INFO] ApacheDS Protocol Kerberos Test ................... SKIPPED
[INFO] ApacheDS Server Integration ....................... SKIPPED
[INFO] ApacheDS DirectoryService-WebApp bridge ........... SKIPPED
[INFO] ApacheDS Jetty HTTP Server Integration ............ SKIPPED
[INFO] ApacheDS Service Builder .......................... SKIPPED
[INFO] Apache Directory LDAP Client API test ............. SKIPPED
[INFO] kerberos-client ................................... SKIPPED
[INFO] ApacheDS Service .................................. SKIPPED
[INFO] ApacheDS Wrapper .................................. SKIPPED
[INFO] ApacheDS Installers Maven Plugin .................. SKIPPED
[INFO] ApacheDS Installers ............................... SKIPPED
[INFO] ------------------------------------------------------------------------
[INFO] BUILD FAILURE
[INFO] ------------------------------------------------------------------------
[INFO] Total time: 30:01.632s
[INFO] Finished at: Wed Feb 12 04:32:42 UTC 2014
[INFO] Final Memory: 53M/259M
[INFO] ------------------------------------------------------------------------
[JENKINS] Archiving disabled
[JENKINS] Archiving disabled
[JENKINS] Archiving disabled
[JENKINS] Archiving disabled
[JENKINS] Archiving disabled
[JENKINS] Archiving disabled
[JENKINS] Archiving disabled
[JENKINS] Archiving disabled
[JENKINS] Archiving disabled
[JENKINS] Archiving disabled
[JENKINS] Archiving disabled
[JENKINS] Archiving disabled
[JENKINS] Archiving disabled
[JENKINS] Archiving disabled
[JENKINS] Archiving disabled
[JENKINS] Archiving disabled
[JENKINS] Archiving disabled
[JENKINS] Archiving disabled
[JENKINS] Archiving disabled
[JENKINS] Archiving disabled
[JENKINS] Archiving disabled
[JENKINS] Archiving disabled
[JENKINS] Archiving disabled
[JENKINS] Archiving disabled
[JENKINS] Archiving disabled
[JENKINS] Archiving disabled
[JENKINS] Archiving disabled
[JENKINS] Archiving disabled
[JENKINS] Archiving disabled
[JENKINS] Archiving disabled
[JENKINS] Archiving disabled
[JENKINS] Archiving disabled
[JENKINS] Archiving disabled
[JENKINS] Archiving disabled
[JENKINS] Archiving disabled
[JENKINS] Archiving disabled
[JENKINS] Archiving disabled
[JENKINS] Archiving disabled
[JENKINS] Archiving disabled
[JENKINS] Archiving disabled
[JENKINS] Archiving disabled
[JENKINS] Archiving disabled
[JENKINS] Archiving disabled
[JENKINS] Archiving disabled
[JENKINS] Archiving disabled
[JENKINS] Archiving disabled
[JENKINS] Archiving disabled
[JENKINS] Archiving disabled
[JENKINS] Archiving disabled
[JENKINS] Archiving disabled
[JENKINS] Archiving disabled
[JENKINS] Archiving disabled
[JENKINS] Archiving disabled
[JENKINS] Archiving disabled
[JENKINS] Archiving disabled
Waiting for Jenkins to finish collecting data
[ERROR] Failed to execute goal org.apache.maven.plugins:maven-surefire-plugin:2.15:test (default-test)
on project apacheds-core-integ: Execution default-test of goal org.apache.maven.plugins:maven-surefire-plugin:2.15:test
failed: The forked VM terminated without saying properly goodbye. VM crash or System.exit
called ?
[ERROR] Command was/bin/sh -c cd <https://builds.apache.org/job/dir-apacheds-ubuntu-deploy/ws/trunk/core-integ>
&& /home/jenkins/tools/java/jdk1.7.0_25-32/jre/bin/java -Xmx1024m -jar <https://builds.apache.org/job/dir-apacheds-ubuntu-deploy/ws/trunk/core-integ/target/surefire/surefirebooter8639908362848366286.jar>
<https://builds.apache.org/job/dir-apacheds-ubuntu-deploy/ws/trunk/core-integ/target/surefire/surefire5751720583363627510tmp>
<https://builds.apache.org/job/dir-apacheds-ubuntu-deploy/ws/trunk/core-integ/target/surefire/surefire_252514800782312665844tmp>
[ERROR] -> [Help 1]
[ERROR] 
[ERROR] To see the full stack trace of the errors, re-run Maven with the -e switch.
[ERROR] Re-run Maven using the -X switch to enable full debug logging.
[ERROR] 
[ERROR] For more information about the errors and possible solutions, please read the following
articles:
[ERROR] [Help 1] http://cwiki.apache.org/confluence/display/MAVEN/PluginExecutionException
[ERROR] 
[ERROR] After correcting the problems, you can resume the build with the command
[ERROR]   mvn <goals> -rf :apacheds-core-integ
channel stopped

Mime
View raw message