directory-notifications mailing list archives

Site index · List index
Message view « Date » · « Thread »
Top « Date » · « Thread »
From Apache Jenkins Server <jenk...@builds.apache.org>
Subject Build failed in Jenkins: dir-apacheds-ubuntu-deploy #1226
Date Tue, 07 Jan 2014 04:25:03 GMT
See <https://builds.apache.org/job/dir-apacheds-ubuntu-deploy/1226/changes>

Changes:

[kayyagari] o added a cache for holding <entryUUID, Dn> pairs
o fixed an issue with the wrong ancestor Dn calculation, updated tests

------------------------------------------
[...truncated 8975 lines...]
	at java.util.concurrent.FutureTask$Sync.innerRun(FutureTask.java:334)
	at java.util.concurrent.FutureTask.run(FutureTask.java:166)
	at java.util.concurrent.ThreadPoolExecutor.runWorker(ThreadPoolExecutor.java:1145)
	at java.util.concurrent.ThreadPoolExecutor$Worker.run(ThreadPoolExecutor.java:615)
	at java.lang.Thread.run(Thread.java:724)
Caused by: org.xmlpull.v1.XmlPullParserException: unexpected type (position:END_DOCUMENT null@3:1
in java.io.InputStreamReader@1f9f47c) 
	at org.kxml2.io.KXmlParser.exception(Unknown Source)
	at org.kxml2.io.KXmlParser.nextTag(Unknown Source)
	at org.apache.felix.bundlerepository.impl.PullParser.parseRepository(PullParser.java:43)
	at org.apache.felix.bundlerepository.impl.DataModelHelperImpl.repository(DataModelHelperImpl.java:147)
	at org.apache.felix.bundlerepository.impl.DataModelHelperImpl.repository(DataModelHelperImpl.java:118)
	at org.apache.felix.obrplugin.ObrUpdate.parseRepositoryXml(ObrUpdate.java:316)
	... 34 more
[INFO] 
[INFO] --- maven-deploy-plugin:2.7:deploy (default-deploy) @ apacheds-interceptors-hash ---
Downloading: https://repository.apache.org/content/repositories/snapshots/org/apache/directory/server/apacheds-interceptors-hash/2.0.0-M16-SNAPSHOT/maven-metadata.xml
Downloaded: https://repository.apache.org/content/repositories/snapshots/org/apache/directory/server/apacheds-interceptors-hash/2.0.0-M16-SNAPSHOT/maven-metadata.xml
(2 KB at 3.1 KB/sec)
Uploading: https://repository.apache.org/content/repositories/snapshots/org/apache/directory/server/apacheds-interceptors-hash/2.0.0-M16-SNAPSHOT/apacheds-interceptors-hash-2.0.0-M16-20140107.042050-82.jar
Uploaded: https://repository.apache.org/content/repositories/snapshots/org/apache/directory/server/apacheds-interceptors-hash/2.0.0-M16-SNAPSHOT/apacheds-interceptors-hash-2.0.0-M16-20140107.042050-82.jar
(16 KB at 44.4 KB/sec)
Uploading: https://repository.apache.org/content/repositories/snapshots/org/apache/directory/server/apacheds-interceptors-hash/2.0.0-M16-SNAPSHOT/apacheds-interceptors-hash-2.0.0-M16-20140107.042050-82.pom
Uploaded: https://repository.apache.org/content/repositories/snapshots/org/apache/directory/server/apacheds-interceptors-hash/2.0.0-M16-SNAPSHOT/apacheds-interceptors-hash-2.0.0-M16-20140107.042050-82.pom
(7 KB at 15.7 KB/sec)
Downloading: https://repository.apache.org/content/repositories/snapshots/org/apache/directory/server/apacheds-interceptors-hash/maven-metadata.xml
Downloaded: https://repository.apache.org/content/repositories/snapshots/org/apache/directory/server/apacheds-interceptors-hash/maven-metadata.xml
(381 B at 1.0 KB/sec)
Uploading: https://repository.apache.org/content/repositories/snapshots/org/apache/directory/server/apacheds-interceptors-hash/2.0.0-M16-SNAPSHOT/maven-metadata.xml
Uploaded: https://repository.apache.org/content/repositories/snapshots/org/apache/directory/server/apacheds-interceptors-hash/2.0.0-M16-SNAPSHOT/maven-metadata.xml
(2 KB at 3.1 KB/sec)
Uploading: https://repository.apache.org/content/repositories/snapshots/org/apache/directory/server/apacheds-interceptors-hash/maven-metadata.xml
Uploaded: https://repository.apache.org/content/repositories/snapshots/org/apache/directory/server/apacheds-interceptors-hash/maven-metadata.xml
(381 B at 1.0 KB/sec)
Uploading: https://repository.apache.org/content/repositories/snapshots/org/apache/directory/server/apacheds-interceptors-hash/2.0.0-M16-SNAPSHOT/apacheds-interceptors-hash-2.0.0-M16-20140107.042050-82-sources.jar
Uploaded: https://repository.apache.org/content/repositories/snapshots/org/apache/directory/server/apacheds-interceptors-hash/2.0.0-M16-SNAPSHOT/apacheds-interceptors-hash-2.0.0-M16-20140107.042050-82-sources.jar
(20 KB at 47.0 KB/sec)
Uploading: https://repository.apache.org/content/repositories/snapshots/org/apache/directory/server/apacheds-interceptors-hash/2.0.0-M16-SNAPSHOT/maven-metadata.xml
Uploaded: https://repository.apache.org/content/repositories/snapshots/org/apache/directory/server/apacheds-interceptors-hash/2.0.0-M16-SNAPSHOT/maven-metadata.xml
(2 KB at 2.9 KB/sec)
[INFO] 
[INFO] --- maven-bundle-plugin:2.3.7:deploy (default-deploy) @ apacheds-interceptors-hash
---
[INFO] Remote OBR update disabled (enable with -DremoteOBR)
[JENKINS] Archiving disabled
[INFO]                                                                         
[INFO] ------------------------------------------------------------------------
[INFO] Building ApacheDS Core Integration 2.0.0-M16-SNAPSHOT
[INFO] ------------------------------------------------------------------------
[INFO] 
[INFO] --- maven-clean-plugin:2.4.1:clean (default-clean) @ apacheds-core-integ ---
[INFO] 
[INFO] --- maven-remote-resources-plugin:1.2.1:process (default) @ apacheds-core-integ ---
[INFO] 
[INFO] --- maven-resources-plugin:2.6:resources (default-resources) @ apacheds-core-integ
---
[INFO] Using 'UTF-8' encoding to copy filtered resources.
[INFO] Copying 0 resource
[INFO] Copying 3 resources
[INFO] 
[INFO] --- maven-compiler-plugin:3.1:compile (default-compile) @ apacheds-core-integ ---
[INFO] Changes detected - recompiling the module!
[INFO] Compiling 1 source file to <https://builds.apache.org/job/dir-apacheds-ubuntu-deploy/ws/trunk/core-integ/target/classes>
[INFO] 
[INFO] --- maven-resources-plugin:2.6:testResources (default-testResources) @ apacheds-core-integ
---
[INFO] Using 'UTF-8' encoding to copy filtered resources.
[INFO] Copying 9 resources
[INFO] Copying 3 resources
[INFO] 
[INFO] --- maven-dependency-plugin:2.8:copy (copy) @ apacheds-core-integ ---
[INFO] Configured Artifact: org.apache.directory.api:api-ldap-extras-codec:1.0.0-M21-SNAPSHOT:jar
[INFO] Copying api-ldap-extras-codec-1.0.0-M21-SNAPSHOT.jar to <https://builds.apache.org/job/dir-apacheds-ubuntu-deploy/ws/trunk/core-integ/target/pluginDirectory/api-ldap-extras-codec-1.0.0-M21-20140107.030907-114.jar>
[INFO] 
[INFO] --- maven-compiler-plugin:3.1:testCompile (default-testCompile) @ apacheds-core-integ
---
[INFO] Changes detected - recompiling the module!
[INFO] Compiling 105 source files to <https://builds.apache.org/job/dir-apacheds-ubuntu-deploy/ws/trunk/core-integ/target/test-classes>
[WARNING] <https://builds.apache.org/job/dir-apacheds-ubuntu-deploy/ws/trunk/core-integ/src/test/java/org/apache/directory/server/core/operations/search/SearchIT.java>:
<https://builds.apache.org/job/dir-apacheds-ubuntu-deploy/ws/trunk/core-integ/src/test/java/org/apache/directory/server/core/operations/search/SearchIT.java>
uses unchecked or unsafe operations.
[WARNING] <https://builds.apache.org/job/dir-apacheds-ubuntu-deploy/ws/trunk/core-integ/src/test/java/org/apache/directory/server/core/operations/search/SearchIT.java>:
Recompile with -Xlint:unchecked for details.
[INFO] 
[INFO] --- maven-surefire-plugin:2.15:test (default-test) @ apacheds-core-integ ---
[INFO] Surefire report directory: <https://builds.apache.org/job/dir-apacheds-ubuntu-deploy/ws/trunk/core-integ/target/surefire-reports>

-------------------------------------------------------
 T E S T S
-------------------------------------------------------
Running org.apache.directory.server.core.subtree.BadSubentryServiceIT
Tests run: 1, Failures: 0, Errors: 0, Skipped: 0, Time elapsed: 17.798 sec - in org.apache.directory.server.core.subtree.BadSubentryServiceIT
Running org.apache.directory.server.core.subtree.SubentryServiceIT
Tests run: 17, Failures: 0, Errors: 0, Skipped: 16, Time elapsed: 17.855 sec - in org.apache.directory.server.core.subtree.SubentryServiceIT
Running org.apache.directory.server.core.subtree.SubentryServiceEntryModificationHandlingIT
Tests run: 1, Failures: 0, Errors: 0, Skipped: 0, Time elapsed: 9.817 sec - in org.apache.directory.server.core.subtree.SubentryServiceEntryModificationHandlingIT
Running org.apache.directory.server.core.subtree.SubentryServiceObjectClassChangeHandlingIT
Tests run: 1, Failures: 0, Errors: 0, Skipped: 0, Time elapsed: 10.623 sec - in org.apache.directory.server.core.subtree.SubentryServiceObjectClassChangeHandlingIT
Running org.apache.directory.server.core.configuration.PartitionConfigurationIT
Tests run: 1, Failures: 0, Errors: 0, Skipped: 0, Time elapsed: 13.098 sec - in org.apache.directory.server.core.configuration.PartitionConfigurationIT
Running org.apache.directory.server.core.sp.LdapClassLoaderIT
Tests run: 2, Failures: 0, Errors: 0, Skipped: 0, Time elapsed: 10.287 sec - in org.apache.directory.server.core.sp.LdapClassLoaderIT
Running org.apache.directory.server.core.changelog.DefaultChangeLogIT
Tests run: 7, Failures: 0, Errors: 0, Skipped: 0, Time elapsed: 29.77 sec - in org.apache.directory.server.core.changelog.DefaultChangeLogIT
Running org.apache.directory.server.core.schema.MetaNormalizerHandlerIT
Tests run: 20, Failures: 0, Errors: 0, Skipped: 12, Time elapsed: 6.64 sec - in org.apache.directory.server.core.schema.MetaNormalizerHandlerIT
Running org.apache.directory.server.core.schema.MetaSchemaHandlerIT
Tests run: 29, Failures: 0, Errors: 0, Skipped: 16, Time elapsed: 8.162 sec - in org.apache.directory.server.core.schema.MetaSchemaHandlerIT
Running org.apache.directory.server.core.schema.MetaComparatorHandlerIT
Tests run: 20, Failures: 0, Errors: 0, Skipped: 12, Time elapsed: 9.781 sec - in org.apache.directory.server.core.schema.MetaComparatorHandlerIT
Running org.apache.directory.server.core.schema.MetaObjectClassHandlerIT
Tests run: 27, Failures: 0, Errors: 0, Skipped: 12, Time elapsed: 9.221 sec - in org.apache.directory.server.core.schema.MetaObjectClassHandlerIT
Running org.apache.directory.server.core.schema.MetaMatchingRuleHandlerIT
Tests run: 14, Failures: 0, Errors: 0, Skipped: 9, Time elapsed: 10.387 sec - in org.apache.directory.server.core.schema.MetaMatchingRuleHandlerIT
Running org.apache.directory.server.core.schema.SchemaServiceIT
Tests run: 23, Failures: 0, Errors: 0, Skipped: 0, Time elapsed: 15.636 sec - in org.apache.directory.server.core.schema.SchemaServiceIT
Running org.apache.directory.server.core.schema.MetaAttributeTypeHandlerIT
Tests run: 19, Failures: 0, Errors: 0, Skipped: 11, Time elapsed: 9.867 sec - in org.apache.directory.server.core.schema.MetaAttributeTypeHandlerIT
Running org.apache.directory.server.core.schema.MetaSyntaxCheckerHandlerIT
Tests run: 20, Failures: 0, Errors: 0, Skipped: 12, Time elapsed: 7.659 sec - in org.apache.directory.server.core.schema.MetaSyntaxCheckerHandlerIT
Running org.apache.directory.server.core.schema.MetaSyntaxHandlerIT
Tests run: 18, Failures: 0, Errors: 0, Skipped: 12, Time elapsed: 6.161 sec - in org.apache.directory.server.core.schema.MetaSyntaxHandlerIT
Running org.apache.directory.server.core.schema.SubschemaSubentryIT
Killed

Results :

Tests run: 220, Failures: 0, Errors: 0, Skipped: 112

[JENKINS] Recording test results
[JENKINS] Archiving disabled
[INFO] ------------------------------------------------------------------------
[INFO] Reactor Summary:
[INFO] 
[INFO] ApacheDS .......................................... SUCCESS [22.509s]
[INFO] ApacheDS I18n ..................................... SUCCESS [6.875s]
[INFO] ApacheDS Core Constants ........................... SUCCESS [4.054s]
[INFO] ApacheDS Core API ................................. SUCCESS [40.066s]
[INFO] ApacheDS Core Shared .............................. SUCCESS [9.901s]
[INFO] ApacheDS Interceptors ............................. SUCCESS [3.034s]
[INFO] ApacheDS AdministrativePoint Interceptor .......... SUCCESS [7.836s]
[INFO] ApacheDS Authentication Interceptor ............... SUCCESS [10.577s]
[INFO] ApacheDS Authorization Interceptor ................ SUCCESS [15.941s]
[INFO] ApacheDS ChangeLog Interceptor .................... SUCCESS [7.760s]
[INFO] ApacheDS Collective Attribute Interceptor ......... SUCCESS [5.111s]
[INFO] ApacheDS Event Interceptor ........................ SUCCESS [6.871s]
[INFO] ApacheDS Exception Interceptor .................... SUCCESS [7.183s]
[INFO] ApacheDS Journal Interceptor ...................... SUCCESS [6.061s]
[INFO] ApacheDS Normalization Interceptor ................ SUCCESS [8.990s]
[INFO] ApacheDS Operational Attribute Interceptor ........ SUCCESS [5.883s]
[INFO] ApacheDS Referral Interceptor ..................... SUCCESS [6.198s]
[INFO] ApacheDS Schema Interceptor ....................... SUCCESS [8.862s]
[INFO] ApacheDS Subtree Interceptor ...................... SUCCESS [9.352s]
[INFO] ApacheDS Triggers Interceptor ..................... SUCCESS [6.228s]
[INFO] ApacheDS Core ..................................... SUCCESS [9.869s]
[INFO] ApacheDS Core AVL ................................. SUCCESS [12.606s]
[INFO] ApacheDS Generalized (X) DBM Partition ............ SUCCESS [19.031s]
[INFO] ApacheDS LDIF Partition ........................... SUCCESS [24.870s]
[INFO] ApacheDS JDBM Partition ........................... SUCCESS [2:19.777s]
[INFO] ApacheDS Mavibot Partition ........................ SUCCESS [13.415s]
[INFO] ApacheDS Core Annotations ......................... SUCCESS [1:26.267s]
[INFO] ApacheDS Core JNDI ................................ SUCCESS [8.109s]
[INFO] ApacheDS Protocol Kerberos Codec .................. SUCCESS [23.174s]
[INFO] ApacheDS Interceptors for Kerberos ................ SUCCESS [10.052s]
[INFO] ApacheDS Protocol Dhcp ............................ SUCCESS [6.859s]
[INFO] ApacheDS Protocol Shared .......................... SUCCESS [6.870s]
[INFO] ApacheDS Protocol Dns ............................. SUCCESS [8.258s]
[INFO] ApacheDS Protocol Kerberos ........................ SUCCESS [9.638s]
[INFO] ApacheDS Protocol Ldap ............................ SUCCESS [3:47.583s]
[INFO] ApacheDS Protocol Ntp ............................. SUCCESS [7.611s]
[INFO] Apacheds Server Annotations ....................... SUCCESS [2:02.280s]
[INFO] ApacheDS Server Config ............................ SUCCESS [10.342s]
[INFO] ApacheDS Server JNDI .............................. SUCCESS [6.089s]
[INFO] ApacheDS Test Framework ........................... SUCCESS [1:17.460s]
[INFO] ApacheDS All ...................................... SUCCESS [9.918s]
[INFO] ApacheDS Logger Interceptor ....................... SUCCESS [5.611s]
[INFO] ApacheDS Password Hashing Interceptor ............. SUCCESS [5.719s]
[INFO] ApacheDS Core Integration ......................... FAILURE [3:38.450s]
[INFO] ApacheDS Protocol Kerberos Test ................... SKIPPED
[INFO] ApacheDS Server Integration ....................... SKIPPED
[INFO] ApacheDS DirectoryService-WebApp bridge ........... SKIPPED
[INFO] ApacheDS Jetty HTTP Server Integration ............ SKIPPED
[INFO] ApacheDS Service Builder .......................... SKIPPED
[INFO] Apache Directory LDAP Client API test ............. SKIPPED
[INFO] kerberos-client ................................... SKIPPED
[INFO] ApacheDS Service .................................. SKIPPED
[INFO] ApacheDS Wrapper .................................. SKIPPED
[INFO] ApacheDS Installers Maven Plugin .................. SKIPPED
[INFO] ApacheDS Installers ............................... SKIPPED
[INFO] ------------------------------------------------------------------------
[INFO] BUILD FAILURE
[INFO] ------------------------------------------------------------------------
[INFO] Total time: 22:08.451s
[INFO] Finished at: Tue Jan 07 04:24:33 UTC 2014
[INFO] Final Memory: 60M/237M
[INFO] ------------------------------------------------------------------------
[JENKINS] Archiving disabled
[JENKINS] Archiving disabled
[JENKINS] Archiving disabled
[JENKINS] Archiving disabled
[JENKINS] Archiving disabled
[JENKINS] Archiving disabled
[JENKINS] Archiving disabled
[JENKINS] Archiving disabled
[JENKINS] Archiving disabled
[JENKINS] Archiving disabled
[JENKINS] Archiving disabled
[JENKINS] Archiving disabled
[JENKINS] Archiving disabled
[JENKINS] Archiving disabled
[JENKINS] Archiving disabled
[JENKINS] Archiving disabled
[JENKINS] Archiving disabled
[JENKINS] Archiving disabled
[JENKINS] Archiving disabled
[JENKINS] Archiving disabled
[JENKINS] Archiving disabled
[JENKINS] Archiving disabled
[JENKINS] Archiving disabled
[JENKINS] Archiving disabled
[JENKINS] Archiving disabled
[JENKINS] Archiving disabled
[JENKINS] Archiving disabled
[JENKINS] Archiving disabled
[JENKINS] Archiving disabled
[JENKINS] Archiving disabled
[JENKINS] Archiving disabled
[JENKINS] Archiving disabled
[JENKINS] Archiving disabled
[JENKINS] Archiving disabled
[JENKINS] Archiving disabled
[JENKINS] Archiving disabled
[JENKINS] Archiving disabled
[JENKINS] Archiving disabled
[JENKINS] Archiving disabled
[JENKINS] Archiving disabled
[JENKINS] Archiving disabled
[JENKINS] Archiving disabled
[JENKINS] Archiving disabled
[JENKINS] Archiving disabled
[JENKINS] Archiving disabled
[JENKINS] Archiving disabled
[JENKINS] Archiving disabled
[JENKINS] Archiving disabled
[JENKINS] Archiving disabled
[JENKINS] Archiving disabled
[JENKINS] Archiving disabled
[JENKINS] Archiving disabled
[JENKINS] Archiving disabled
[JENKINS] Archiving disabled
[JENKINS] Archiving disabled
Waiting for Jenkins to finish collecting data[ERROR] Failed to execute goal org.apache.maven.plugins:maven-surefire-plugin:2.15:test
(default-test) on project apacheds-core-integ: Execution default-test of goal org.apache.maven.plugins:maven-surefire-plugin:2.15:test
failed: The forked VM terminated without saying properly goodbye. VM crash or System.exit
called ?
[ERROR] Command was/bin/sh -c cd <https://builds.apache.org/job/dir-apacheds-ubuntu-deploy/ws/trunk/core-integ>
&& /home/jenkins/tools/java/jdk1.7.0_25-32/jre/bin/java -Xmx1024m -jar <https://builds.apache.org/job/dir-apacheds-ubuntu-deploy/ws/trunk/core-integ/target/surefire/surefirebooter4292403511786600642.jar>
<https://builds.apache.org/job/dir-apacheds-ubuntu-deploy/ws/trunk/core-integ/target/surefire/surefire5490500556638132635tmp>
<https://builds.apache.org/job/dir-apacheds-ubuntu-deploy/ws/trunk/core-integ/target/surefire/surefire_25748347831709436623tmp>
[ERROR] -> [Help 1]
[ERROR] 
[ERROR] To see the full stack trace of the errors, re-run Maven with the -e switch.
[ERROR] Re-run Maven using the -X switch to enable full debug logging.
[ERROR] 
[ERROR] For more information about the errors and possible solutions, please read the following
articles:
[ERROR] [Help 1] http://cwiki.apache.org/confluence/display/MAVEN/PluginExecutionException
[ERROR] 
[ERROR] After correcting the problems, you can resume the build with the command
[ERROR]   mvn <goals> -rf :apacheds-core-integ

channel stopped

Mime
View raw message