directory-notifications mailing list archives

Site index · List index
Message view « Date » · « Thread »
Top « Date » · « Thread »
From Apache Jenkins Server <jenk...@builds.apache.org>
Subject Build failed in Jenkins: dir-apacheds-win #554
Date Tue, 05 Nov 2013 14:43:47 GMT
See <https://builds.apache.org/job/dir-apacheds-win/554/changes>

Changes:

[elecharny] o Removed the third parameter of the Index interface.
o Reflected the change o, the JDBM/AVL/Mavibot idexes

------------------------------------------
[...truncated 3263 lines...]
Tests run: 8, Failures: 0, Errors: 0, Skipped: 0, Time elapsed: 6.667 sec - in org.apache.directory.server.core.jndi.RootDSEJndiIT
Running org.apache.directory.server.core.jndi.SimpleBindJndiIT
Tests run: 9, Failures: 0, Errors: 0, Skipped: 0, Time elapsed: 6.396 sec - in org.apache.directory.server.core.jndi.SimpleBindJndiIT
Running org.apache.directory.server.core.jndi.UniqueMemberIT
Tests run: 8, Failures: 0, Errors: 0, Skipped: 0, Time elapsed: 9.321 sec - in org.apache.directory.server.core.jndi.UniqueMemberIT
Running org.apache.directory.server.core.normalization.NormalizationServiceIT
Tests run: 1, Failures: 0, Errors: 0, Skipped: 0, Time elapsed: 8.001 sec - in org.apache.directory.server.core.normalization.NormalizationServiceIT
Running org.apache.directory.server.core.operational.OperationalAttributeServiceIT
Tests run: 12, Failures: 0, Errors: 0, Skipped: 0, Time elapsed: 22.275 sec - in org.apache.directory.server.core.operational.OperationalAttributeServiceIT
Running org.apache.directory.server.core.operations.add.AddIT
Tests run: 2, Failures: 0, Errors: 0, Skipped: 0, Time elapsed: 10.641 sec - in org.apache.directory.server.core.operations.add.AddIT
Running org.apache.directory.server.core.operations.add.ConcurrentAddSearchIT
Tests run: 1, Failures: 0, Errors: 0, Skipped: 1, Time elapsed: 7.966 sec - in org.apache.directory.server.core.operations.add.ConcurrentAddSearchIT
Running org.apache.directory.server.core.operations.add.DIRSERVER169IT
Tests run: 4, Failures: 0, Errors: 0, Skipped: 0, Time elapsed: 8.71 sec - in org.apache.directory.server.core.operations.add.DIRSERVER169IT
Running org.apache.directory.server.core.operations.add.DIRSERVER783IT
Tests run: 1, Failures: 0, Errors: 0, Skipped: 0, Time elapsed: 9.593 sec - in org.apache.directory.server.core.operations.add.DIRSERVER783IT
Running org.apache.directory.server.core.operations.add.PasswordHashingInterceptorTest
Tests run: 1, Failures: 0, Errors: 0, Skipped: 0, Time elapsed: 40.732 sec - in org.apache.directory.server.core.operations.add.PasswordHashingInterceptorTest
Running org.apache.directory.server.core.operations.bind.SimpleBindIT
Tests run: 9, Failures: 0, Errors: 0, Skipped: 0, Time elapsed: 6.476 sec - in org.apache.directory.server.core.operations.bind.SimpleBindIT
Running org.apache.directory.server.core.operations.compare.CompareDirserver1139IT
Tests run: 1, Failures: 0, Errors: 0, Skipped: 0, Time elapsed: 7.932 sec - in org.apache.directory.server.core.operations.compare.CompareDirserver1139IT
Running org.apache.directory.server.core.operations.exists.ExistsIT
Tests run: 2, Failures: 0, Errors: 0, Skipped: 0, Time elapsed: 6.598 sec - in org.apache.directory.server.core.operations.exists.ExistsIT
Running org.apache.directory.server.core.operations.getRootDse.GetRootDseIT
Tests run: 11, Failures: 0, Errors: 0, Skipped: 0, Time elapsed: 6.533 sec - in org.apache.directory.server.core.operations.getRootDse.GetRootDseIT
Running org.apache.directory.server.core.operations.lookup.LookupIT
Tests run: 8, Failures: 0, Errors: 0, Skipped: 0, Time elapsed: 8.696 sec - in org.apache.directory.server.core.operations.lookup.LookupIT
Running org.apache.directory.server.core.operations.modify.ModifyAddIT
Tests run: 18, Failures: 0, Errors: 0, Skipped: 0, Time elapsed: 48.407 sec - in org.apache.directory.server.core.operations.modify.ModifyAddIT
Running org.apache.directory.server.core.operations.modify.ModifyDelIT
Tests run: 13, Failures: 0, Errors: 0, Skipped: 0, Time elapsed: 51.328 sec - in org.apache.directory.server.core.operations.modify.ModifyDelIT
Running org.apache.directory.server.core.operations.modify.ModifyMultipleChangesIT
Tests run: 1, Failures: 0, Errors: 0, Skipped: 0, Time elapsed: 11.398 sec - in org.apache.directory.server.core.operations.modify.ModifyMultipleChangesIT
Running org.apache.directory.server.core.operations.modify.ModifyMVAttributeIT
Tests run: 2, Failures: 0, Errors: 0, Skipped: 2, Time elapsed: 7.317 sec - in org.apache.directory.server.core.operations.modify.ModifyMVAttributeIT
Running org.apache.directory.server.core.operations.move.MoveIT
Tests run: 2, Failures: 0, Errors: 0, Skipped: 0, Time elapsed: 9.928 sec - in org.apache.directory.server.core.operations.move.MoveIT
Running org.apache.directory.server.core.operations.rename.RenameIT
Tests run: 1, Failures: 0, Errors: 0, Skipped: 0, Time elapsed: 9.02 sec - in org.apache.directory.server.core.operations.rename.RenameIT
Running org.apache.directory.server.core.operations.search.AliasSearchIT
Tests run: 16, Failures: 0, Errors: 0, Skipped: 8, Time elapsed: 14.356 sec - in org.apache.directory.server.core.operations.search.AliasSearchIT
Running org.apache.directory.server.core.operations.search.DIRSERVER759IT
Tests run: 1, Failures: 0, Errors: 0, Skipped: 0, Time elapsed: 8.598 sec - in org.apache.directory.server.core.operations.search.DIRSERVER759IT
Running org.apache.directory.server.core.operations.search.SearchBinaryIT
Tests run: 2, Failures: 0, Errors: 0, Skipped: 1, Time elapsed: 9.456 sec - in org.apache.directory.server.core.operations.search.SearchBinaryIT
Running org.apache.directory.server.core.operations.search.SearchIT
Tests run: 51, Failures: 0, Errors: 0, Skipped: 1, Time elapsed: 13.037 sec - in org.apache.directory.server.core.operations.search.SearchIT
Running org.apache.directory.server.core.operations.search.SearchWithIndicesIT
Tests run: 3, Failures: 0, Errors: 0, Skipped: 0, Time elapsed: 13.968 sec - in org.apache.directory.server.core.operations.search.SearchWithIndicesIT
Running org.apache.directory.server.core.partition.PartitionIT
Tests run: 1, Failures: 0, Errors: 0, Skipped: 0, Time elapsed: 11.889 sec - in org.apache.directory.server.core.partition.PartitionIT
Running org.apache.directory.server.core.schema.MetaAttributeTypeHandlerIT
Tests run: 19, Failures: 0, Errors: 0, Skipped: 11, Time elapsed: 7.896 sec - in org.apache.directory.server.core.schema.MetaAttributeTypeHandlerIT
Running org.apache.directory.server.core.schema.MetaComparatorHandlerIT
Tests run: 20, Failures: 0, Errors: 0, Skipped: 12, Time elapsed: 6.895 sec - in org.apache.directory.server.core.schema.MetaComparatorHandlerIT
Running org.apache.directory.server.core.schema.MetaMatchingRuleHandlerIT
Tests run: 14, Failures: 0, Errors: 0, Skipped: 9, Time elapsed: 6.812 sec - in org.apache.directory.server.core.schema.MetaMatchingRuleHandlerIT
Running org.apache.directory.server.core.schema.MetaNormalizerHandlerIT
Tests run: 20, Failures: 0, Errors: 0, Skipped: 12, Time elapsed: 7.014 sec - in org.apache.directory.server.core.schema.MetaNormalizerHandlerIT
Running org.apache.directory.server.core.schema.MetaObjectClassHandlerIT
Tests run: 27, Failures: 0, Errors: 0, Skipped: 12, Time elapsed: 10.786 sec - in org.apache.directory.server.core.schema.MetaObjectClassHandlerIT
Running org.apache.directory.server.core.schema.MetaSchemaHandlerIT
Tests run: 29, Failures: 0, Errors: 0, Skipped: 16, Time elapsed: 8.749 sec - in org.apache.directory.server.core.schema.MetaSchemaHandlerIT
Running org.apache.directory.server.core.schema.MetaSyntaxCheckerHandlerIT
Tests run: 20, Failures: 0, Errors: 0, Skipped: 12, Time elapsed: 8.616 sec - in org.apache.directory.server.core.schema.MetaSyntaxCheckerHandlerIT
Running org.apache.directory.server.core.schema.MetaSyntaxHandlerIT
Tests run: 18, Failures: 0, Errors: 0, Skipped: 12, Time elapsed: 6.506 sec - in org.apache.directory.server.core.schema.MetaSyntaxHandlerIT
Running org.apache.directory.server.core.schema.ObjectClassCreateIT
Tests run: 4, Failures: 0, Errors: 0, Skipped: 0, Time elapsed: 7.524 sec - in org.apache.directory.server.core.schema.ObjectClassCreateIT
Running org.apache.directory.server.core.schema.PartitionSchemaLoaderIT
Tests run: 1, Failures: 0, Errors: 0, Skipped: 0, Time elapsed: 2.581 sec - in org.apache.directory.server.core.schema.PartitionSchemaLoaderIT
Running org.apache.directory.server.core.schema.SchemaPersistenceIT
Tests run: 2, Failures: 0, Errors: 0, Skipped: 0, Time elapsed: 12.386 sec - in org.apache.directory.server.core.schema.SchemaPersistenceIT
Running org.apache.directory.server.core.schema.SchemaServiceIT
Tests run: 23, Failures: 0, Errors: 0, Skipped: 0, Time elapsed: 10.782 sec - in org.apache.directory.server.core.schema.SchemaServiceIT
Running org.apache.directory.server.core.schema.SubschemaSubentryIT
Tests run: 17, Failures: 0, Errors: 0, Skipped: 1, Time elapsed: 27.243 sec - in org.apache.directory.server.core.schema.SubschemaSubentryIT
Running org.apache.directory.server.core.sp.LdapClassLoaderIT
Tests run: 2, Failures: 0, Errors: 0, Skipped: 0, Time elapsed: 8.57 sec - in org.apache.directory.server.core.sp.LdapClassLoaderIT
Running org.apache.directory.server.core.subtree.BadSubentryServiceIT
Tests run: 1, Failures: 0, Errors: 0, Skipped: 0, Time elapsed: 24.383 sec - in org.apache.directory.server.core.subtree.BadSubentryServiceIT
Running org.apache.directory.server.core.subtree.SubentryServiceEntryModificationHandlingIT
Tests run: 1, Failures: 0, Errors: 0, Skipped: 0, Time elapsed: 8.759 sec - in org.apache.directory.server.core.subtree.SubentryServiceEntryModificationHandlingIT
Running org.apache.directory.server.core.subtree.SubentryServiceIT
Tests run: 17, Failures: 0, Errors: 0, Skipped: 16, Time elapsed: 12.538 sec - in org.apache.directory.server.core.subtree.SubentryServiceIT
Running org.apache.directory.server.core.subtree.SubentryServiceObjectClassChangeHandlingIT
Tests run: 1, Failures: 0, Errors: 0, Skipped: 0, Time elapsed: 9.4 sec - in org.apache.directory.server.core.subtree.SubentryServiceObjectClassChangeHandlingIT
Running org.apache.directory.server.core.trigger.SubentryServiceForTriggersIT
Tests run: 1, Failures: 0, Errors: 0, Skipped: 1, Time elapsed: 0.001 sec - in org.apache.directory.server.core.trigger.SubentryServiceForTriggersIT
Running org.apache.directory.server.core.trigger.TriggerInterceptorIT
Tests run: 1, Failures: 0, Errors: 0, Skipped: 1, Time elapsed: 0 sec - in org.apache.directory.server.core.trigger.TriggerInterceptorIT

Results :

Tests run: 689, Failures: 0, Errors: 0, Skipped: 132

[JENKINS] Recording test results
[INFO] 
[INFO] --- maven-bundle-plugin:2.3.7:bundle (default-bundle) @ apacheds-core-integ ---
[WARNING] Bundle org.apache.directory.server:apacheds-core-integ:bundle:2.0.0-M16-SNAPSHOT
: Split package org/apache/directory/server/core/integ
Use directive -split-package:=(merge-first|merge-last|error|first) on Export/Private Package
instruction to get rid of this warning
Package found in   [Jar:., Jar:apacheds-test-framework]
Reference from     F:\hudson\hudson-slave\workspace\dir-apacheds-win\trunk\test-framework\target\apacheds-test-framework-2.0.0-M16-SNAPSHOT.jar
Classpath          [Jar:., Jar:mina-core, Jar:apacheds-core, Jar:apacheds-interceptors-admin,
Jar:apacheds-interceptors-authz, Jar:apacheds-interceptors-changelog, Jar:apacheds-interceptors-collective,
Jar:apacheds-interceptors-event, Jar:apacheds-interceptors-exception, Jar:apacheds-interceptors-journal,
Jar:apacheds-interceptors-normalization, Jar:apacheds-interceptors-operational, Jar:apacheds-interceptors-referral,
Jar:apacheds-interceptors-schema, Jar:apacheds-interceptors-subtree, Jar:apacheds-interceptors-trigger,
Jar:api-ldap-extras-util, Jar:bcprov-jdk15, Jar:apacheds-core-annotations, Jar:apacheds-ldif-partition,
Jar:apacheds-jdbm-partition, Jar:apacheds-core-avl, Jar:apacheds-xdbm-partition, Jar:mavibot,
Jar:apacheds-mavibot-partition, Jar:apacheds-core-api, Jar:apacheds-core-constants, Jar:api-i18n,
Jar:api-ldap-extras-aci, Jar:ehcache-core, Jar:apacheds-core-jndi, Jar:apacheds-core-shared,
Jar:api-ldap-extras-codec-api, Jar:apacheds-interceptors-authn, Jar:commons-collections, Jar:apacheds-interceptors-hash,
Jar:api-ldap-extras-trigger, Jar:apacheds-i18n, Jar:apacheds-protocol-ldap, Jar:apacheds-protocol-shared,
Jar:apacheds-jdbm1, Jar:apacheds-kerberos-codec, Jar:api-asn1-ber, Jar:apacheds-server-annotations,
Jar:apacheds-protocol-kerberos, Jar:apacheds-test-framework, Jar:commons-io, Jar:commons-lang,
Jar:api-ldap-client-api, Jar:commons-pool, Jar:api-ldap-extras-codec, Jar:api-asn1-api, Jar:api-ldap-extras-sp,
Jar:api-ldap-codec-core, Jar:api-ldap-model, Jar:antlr, Jar:api-ldap-schema-data, Jar:api-util,
Jar:annotations, Jar:slf4j-api, Jar:log4j]
[INFO] 
[INFO] --- maven-site-plugin:3.3:attach-descriptor (attach-descriptor) @ apacheds-core-integ
---
[INFO] 
[INFO] --- maven-jar-plugin:2.4:test-jar (default) @ apacheds-core-integ ---
[INFO] Building jar: F:\hudson\hudson-slave\workspace\dir-apacheds-win\trunk\core-integ\target\apacheds-core-integ-2.0.0-M16-SNAPSHOT-tests.jar
[INFO] 
[INFO] --- tools-maven-plugin:1.4:verify-legal-files (verify-legal-files) @ apacheds-core-integ
---
[INFO] Checking legal files in: apacheds-core-integ-2.0.0-M16-SNAPSHOT.jar
[INFO] Checking legal files in: apacheds-core-integ-2.0.0-M16-SNAPSHOT-tests.jar
[INFO] 
[INFO] --- maven-install-plugin:2.4:install (default-install) @ apacheds-core-integ ---
[INFO] Installing F:\hudson\hudson-slave\workspace\dir-apacheds-win\trunk\core-integ\target\apacheds-core-integ-2.0.0-M16-SNAPSHOT.jar
to f:\hudson\hudson-slave\maven-repositories\0\org\apache\directory\server\apacheds-core-integ\2.0.0-M16-SNAPSHOT\apacheds-core-integ-2.0.0-M16-SNAPSHOT.jar
[INFO] Installing F:\hudson\hudson-slave\workspace\dir-apacheds-win\trunk\core-integ\pom.xml
to f:\hudson\hudson-slave\maven-repositories\0\org\apache\directory\server\apacheds-core-integ\2.0.0-M16-SNAPSHOT\apacheds-core-integ-2.0.0-M16-SNAPSHOT.pom
[INFO] Installing F:\hudson\hudson-slave\workspace\dir-apacheds-win\trunk\core-integ\target\apacheds-core-integ-2.0.0-M16-SNAPSHOT-tests.jar
to f:\hudson\hudson-slave\maven-repositories\0\org\apache\directory\server\apacheds-core-integ\2.0.0-M16-SNAPSHOT\apacheds-core-integ-2.0.0-M16-SNAPSHOT-tests.jar
[INFO] 
[INFO] --- maven-bundle-plugin:2.3.7:install (default-install) @ apacheds-core-integ ---
[INFO] Installing org/apache/directory/server/apacheds-core-integ/2.0.0-M16-SNAPSHOT/apacheds-core-integ-2.0.0-M16-SNAPSHOT.jar
[INFO] Writing OBR metadata
[INFO]                                                                         
[INFO] ------------------------------------------------------------------------
[INFO] Building ApacheDS Protocol Kerberos Test 2.0.0-M16-SNAPSHOT
[INFO] ------------------------------------------------------------------------
[INFO] 
[INFO] --- maven-clean-plugin:2.4.1:clean (default-clean) @ apacheds-kerberos-test ---
[INFO] Deleting F:\hudson\hudson-slave\workspace\dir-apacheds-win\trunk\kerberos-test\target
[INFO] 
[INFO] --- maven-remote-resources-plugin:1.2.1:process (default) @ apacheds-kerberos-test
---
[INFO] 
[INFO] --- maven-resources-plugin:2.6:resources (default-resources) @ apacheds-kerberos-test
---
[INFO] Using 'UTF-8' encoding to copy filtered resources.
[INFO] skip non existing resourceDirectory F:\hudson\hudson-slave\workspace\dir-apacheds-win\trunk\kerberos-test\src\main\resources
[INFO] Copying 3 resources
[INFO] 
[INFO] --- maven-compiler-plugin:3.1:compile (default-compile) @ apacheds-kerberos-test ---
[INFO] No sources to compile
[INFO] 
[INFO] --- maven-resources-plugin:2.6:testResources (default-testResources) @ apacheds-kerberos-test
---
[INFO] Using 'UTF-8' encoding to copy filtered resources.
[INFO] Copying 3 resources
[INFO] Copying 3 resources
[INFO] 
[INFO] --- maven-compiler-plugin:3.1:testCompile (default-testCompile) @ apacheds-kerberos-test
---
[INFO] Changes detected - recompiling the module!
[INFO] Compiling 5 source files to F:\hudson\hudson-slave\workspace\dir-apacheds-win\trunk\kerberos-test\target\test-classes
[WARNING] /F:/hudson/hudson-slave/workspace/dir-apacheds-win/trunk/kerberos-test/src/test/java/org/apache/directory/server/kerberos/kdc/SaslGssapiBindITest.java:
F:\hudson\hudson-slave\workspace\dir-apacheds-win\trunk\kerberos-test\src\test\java\org\apache\directory\server\kerberos\kdc\SaslGssapiBindITest.java
uses unchecked or unsafe operations.
[WARNING] /F:/hudson/hudson-slave/workspace/dir-apacheds-win/trunk/kerberos-test/src/test/java/org/apache/directory/server/kerberos/kdc/SaslGssapiBindITest.java:
Recompile with -Xlint:unchecked for details.
[INFO] 
[INFO] --- maven-surefire-plugin:2.15:test (default-test) @ apacheds-kerberos-test ---
[INFO] Surefire report directory: F:\hudson\hudson-slave\workspace\dir-apacheds-win\trunk\kerberos-test\target\surefire-reports

-------------------------------------------------------
 T E S T S
-------------------------------------------------------
Running org.apache.directory.server.kerberos.kdc.KerberosTcpITest
Tests run: 5, Failures: 0, Errors: 0, Skipped: 2, Time elapsed: 22.818 sec - in org.apache.directory.server.kerberos.kdc.KerberosTcpITest
Running org.apache.directory.server.kerberos.kdc.KerberosUdpITest
Tests run: 5, Failures: 0, Errors: 0, Skipped: 2, Time elapsed: 14.016 sec - in org.apache.directory.server.kerberos.kdc.KerberosUdpITest
Running org.apache.directory.server.kerberos.kdc.SaslGssapiBindITest
Tests run: 1, Failures: 0, Errors: 0, Skipped: 0, Time elapsed: 20.756 sec - in org.apache.directory.server.kerberos.kdc.SaslGssapiBindITest

Results :

Tests run: 11, Failures: 0, Errors: 0, Skipped: 4

[JENKINS] Recording test results
[INFO] 
[INFO] --- maven-jar-plugin:2.4:jar (default-jar) @ apacheds-kerberos-test ---
[INFO] Building jar: F:\hudson\hudson-slave\workspace\dir-apacheds-win\trunk\kerberos-test\target\apacheds-kerberos-test-2.0.0-M16-SNAPSHOT.jar
[INFO] 
[INFO] --- maven-site-plugin:3.3:attach-descriptor (attach-descriptor) @ apacheds-kerberos-test
---
[INFO] 
[INFO] --- maven-jar-plugin:2.4:test-jar (attach-tests) @ apacheds-kerberos-test ---
[INFO] Building jar: F:\hudson\hudson-slave\workspace\dir-apacheds-win\trunk\kerberos-test\target\apacheds-kerberos-test-2.0.0-M16-SNAPSHOT-tests.jar
[INFO] 
[INFO] --- tools-maven-plugin:1.4:verify-legal-files (verify-legal-files) @ apacheds-kerberos-test
---
[INFO] Checking legal files in: apacheds-kerberos-test-2.0.0-M16-SNAPSHOT.jar
[INFO] Checking legal files in: apacheds-kerberos-test-2.0.0-M16-SNAPSHOT-tests.jar
[WARNING] Failed to getClass for org.apache.maven.plugin.source.SourceJarMojo
[INFO] 
[INFO] --- maven-source-plugin:2.2.1:jar (attach-sources) @ apacheds-kerberos-test ---
[INFO] Building jar: F:\hudson\hudson-slave\workspace\dir-apacheds-win\trunk\kerberos-test\target\apacheds-kerberos-test-2.0.0-M16-SNAPSHOT-sources.jar
[INFO] 
[INFO] --- maven-install-plugin:2.4:install (default-install) @ apacheds-kerberos-test ---
[INFO] Installing F:\hudson\hudson-slave\workspace\dir-apacheds-win\trunk\kerberos-test\target\apacheds-kerberos-test-2.0.0-M16-SNAPSHOT.jar
to f:\hudson\hudson-slave\maven-repositories\0\org\apache\directory\server\apacheds-kerberos-test\2.0.0-M16-SNAPSHOT\apacheds-kerberos-test-2.0.0-M16-SNAPSHOT.jar
[INFO] Installing F:\hudson\hudson-slave\workspace\dir-apacheds-win\trunk\kerberos-test\pom.xml
to f:\hudson\hudson-slave\maven-repositories\0\org\apache\directory\server\apacheds-kerberos-test\2.0.0-M16-SNAPSHOT\apacheds-kerberos-test-2.0.0-M16-SNAPSHOT.pom
[INFO] Installing F:\hudson\hudson-slave\workspace\dir-apacheds-win\trunk\kerberos-test\target\apacheds-kerberos-test-2.0.0-M16-SNAPSHOT-tests.jar
to f:\hudson\hudson-slave\maven-repositories\0\org\apache\directory\server\apacheds-kerberos-test\2.0.0-M16-SNAPSHOT\apacheds-kerberos-test-2.0.0-M16-SNAPSHOT-tests.jar
[INFO] Installing F:\hudson\hudson-slave\workspace\dir-apacheds-win\trunk\kerberos-test\target\apacheds-kerberos-test-2.0.0-M16-SNAPSHOT-sources.jar
to f:\hudson\hudson-slave\maven-repositories\0\org\apache\directory\server\apacheds-kerberos-test\2.0.0-M16-SNAPSHOT\apacheds-kerberos-test-2.0.0-M16-SNAPSHOT-sources.jar
ERROR: Failed to parse POMs
hudson.remoting.ChannelClosedException: channel is already closed
	at hudson.remoting.Channel.send(Channel.java:516)
	at hudson.remoting.Request.call(Request.java:129)
	at hudson.remoting.Channel.call(Channel.java:714)
	at hudson.remoting.RemoteInvocationHandler.invoke(RemoteInvocationHandler.java:167)
	at com.sun.proxy.$Proxy45.isAlive(Unknown Source)
	at hudson.Launcher$RemoteLauncher$ProcImpl.isAlive(Launcher.java:930)
	at hudson.maven.ProcessCache$MavenProcess.call(ProcessCache.java:165)
	at hudson.maven.MavenModuleSetBuild$MavenModuleSetBuildExecution.doRun(MavenModuleSetBuild.java:823)
	at hudson.model.AbstractBuild$AbstractBuildExecution.run(AbstractBuild.java:562)
	at hudson.model.Run.execute(Run.java:1665)
	at hudson.maven.MavenModuleSetBuild.run(MavenModuleSetBuild.java:509)
	at hudson.model.ResourceController.execute(ResourceController.java:88)
	at hudson.model.Executor.run(Executor.java:230)
Caused by: java.net.SocketException: Socket closed
	at java.net.SocketInputStream.socketRead0(Native Method)
	at java.net.SocketInputStream.read(SocketInputStream.java:150)
	at java.net.SocketInputStream.read(SocketInputStream.java:121)
	at java.io.BufferedInputStream.fill(BufferedInputStream.java:235)
	at java.io.BufferedInputStream.read(BufferedInputStream.java:254)
	at hudson.remoting.FlightRecorderInputStream.read(FlightRecorderInputStream.java:77)
	at java.io.ObjectInputStream$PeekInputStream.peek(ObjectInputStream.java:2291)
	at java.io.ObjectInputStream$BlockDataInputStream.peek(ObjectInputStream.java:2584)
	at java.io.ObjectInputStream$BlockDataInputStream.peekByte(ObjectInputStream.java:2594)
	at java.io.ObjectInputStream.readObject0(ObjectInputStream.java:1316)
	at java.io.ObjectInputStream.readObject(ObjectInputStream.java:370)
	at hudson.remoting.Command.readFrom(Command.java:92)
	at hudson.remoting.ClassicCommandTransport.read(ClassicCommandTransport.java:71)
	at hudson.remoting.SynchronousCommandTransport$ReaderThread.run(SynchronousCommandTransport.java:48)
FATAL: channel is already closed
hudson.remoting.ChannelClosedException: channel is already closed
	at hudson.remoting.Channel.send(Channel.java:516)
	at hudson.remoting.Request.call(Request.java:129)
	at hudson.remoting.Channel.call(Channel.java:714)
	at hudson.Launcher$RemoteLauncher.kill(Launcher.java:887)
	at hudson.model.AbstractBuild$AbstractBuildExecution.run(AbstractBuild.java:585)
	at hudson.model.Run.execute(Run.java:1665)
	at hudson.maven.MavenModuleSetBuild.run(MavenModuleSetBuild.java:509)
	at hudson.model.ResourceController.execute(ResourceController.java:88)
	at hudson.model.Executor.run(Executor.java:230)
Caused by: java.net.SocketException: Socket closed
	at java.net.SocketInputStream.socketRead0(Native Method)
	at java.net.SocketInputStream.read(SocketInputStream.java:150)
	at java.net.SocketInputStream.read(SocketInputStream.java:121)
	at java.io.BufferedInputStream.fill(BufferedInputStream.java:235)
	at java.io.BufferedInputStream.read(BufferedInputStream.java:254)
	at hudson.remoting.FlightRecorderInputStream.read(FlightRecorderInputStream.java:77)
	at java.io.ObjectInputStream$PeekInputStream.peek(ObjectInputStream.java:2291)
	at java.io.ObjectInputStream$BlockDataInputStream.peek(ObjectInputStream.java:2584)
	at java.io.ObjectInputStream$BlockDataInputStream.peekByte(ObjectInputStream.java:2594)
	at java.io.ObjectInputStream.readObject0(ObjectInputStream.java:1316)
	at java.io.ObjectInputStream.readObject(ObjectInputStream.java:370)
	at hudson.remoting.Command.readFrom(Command.java:92)
	at hudson.remoting.ClassicCommandTransport.read(ClassicCommandTransport.java:71)
	at hudson.remoting.SynchronousCommandTransport$ReaderThread.run(SynchronousCommandTransport.java:48)

Mime
View raw message