directory-notifications mailing list archives

Site index · List index
Message view « Date » · « Thread »
Top « Date » · « Thread »
From Apache Jenkins Server <jenk...@builds.apache.org>
Subject Build failed in Jenkins: dir-shared-ubuntu-deploy » Apache Directory LDAP API Model #1188
Date Sat, 23 Nov 2013 06:31:51 GMT
See <https://builds.apache.org/job/dir-shared-ubuntu-deploy/org.apache.directory.api$api-ldap-model/1188/>

------------------------------------------
[...truncated 296 lines...]
Tests run: 4, Failures: 0, Errors: 0, Skipped: 0, Time elapsed: 0.002 sec - in org.apache.directory.api.ldap.model.schema.syntaxes.GuideSyntaxCheckerTest
Running org.apache.directory.api.ldap.model.schema.syntaxes.TelephoneNumberSyntaxCheckerTest
Tests run: 7, Failures: 0, Errors: 0, Skipped: 0, Time elapsed: 0.007 sec - in org.apache.directory.api.ldap.model.schema.syntaxes.TelephoneNumberSyntaxCheckerTest
Running org.apache.directory.api.ldap.model.schema.syntaxes.JpegSyntaxCheckerTest
Tests run: 4, Failures: 0, Errors: 0, Skipped: 0, Time elapsed: 0.001 sec - in org.apache.directory.api.ldap.model.schema.syntaxes.JpegSyntaxCheckerTest
Running org.apache.directory.api.ldap.model.schema.syntaxes.DataQualitySyntaxSyntaxCheckerTest
Tests run: 4, Failures: 0, Errors: 0, Skipped: 0, Time elapsed: 0.001 sec - in org.apache.directory.api.ldap.model.schema.syntaxes.DataQualitySyntaxSyntaxCheckerTest
Running org.apache.directory.api.ldap.model.schema.syntaxes.DitContentRuleDescriptionSyntaxCheckerTest
Tests run: 2, Failures: 0, Errors: 0, Skipped: 0, Time elapsed: 0.005 sec - in org.apache.directory.api.ldap.model.schema.syntaxes.DitContentRuleDescriptionSyntaxCheckerTest
Running org.apache.directory.api.ldap.model.schema.syntaxes.PostalAddressSyntaxCheckerTest
Tests run: 4, Failures: 0, Errors: 0, Skipped: 0, Time elapsed: 0.001 sec - in org.apache.directory.api.ldap.model.schema.syntaxes.PostalAddressSyntaxCheckerTest
Running org.apache.directory.api.ldap.model.schema.syntaxes.NameFormDescriptionSyntaxCheckerTest
Tests run: 2, Failures: 0, Errors: 0, Skipped: 0, Time elapsed: 0.003 sec - in org.apache.directory.api.ldap.model.schema.syntaxes.NameFormDescriptionSyntaxCheckerTest
Running org.apache.directory.api.ldap.model.schema.syntaxes.MhsOrAddressSyntaxCheckerTest
Tests run: 4, Failures: 0, Errors: 0, Skipped: 0, Time elapsed: 0.001 sec - in org.apache.directory.api.ldap.model.schema.syntaxes.MhsOrAddressSyntaxCheckerTest
Running org.apache.directory.api.ldap.model.schema.syntaxes.IntegerSyntaxCheckerTest
Tests run: 5, Failures: 0, Errors: 0, Skipped: 0, Time elapsed: 0.002 sec - in org.apache.directory.api.ldap.model.schema.syntaxes.IntegerSyntaxCheckerTest
Running org.apache.directory.api.ldap.model.schema.syntaxes.FacsimileTelephoneNumberSyntaxCheckerTest
Tests run: 9, Failures: 0, Errors: 0, Skipped: 0, Time elapsed: 0.004 sec - in org.apache.directory.api.ldap.model.schema.syntaxes.FacsimileTelephoneNumberSyntaxCheckerTest
Running org.apache.directory.api.ldap.model.schema.syntaxes.DlSubmitPermissionSyntaxCheckerTest
Tests run: 4, Failures: 0, Errors: 0, Skipped: 0, Time elapsed: 0.001 sec - in org.apache.directory.api.ldap.model.schema.syntaxes.DlSubmitPermissionSyntaxCheckerTest
Running org.apache.directory.api.ldap.model.schema.syntaxes.UuidSyntaxCheckerTest
Tests run: 5, Failures: 0, Errors: 0, Skipped: 0, Time elapsed: 0.002 sec - in org.apache.directory.api.ldap.model.schema.syntaxes.UuidSyntaxCheckerTest
Running org.apache.directory.api.ldap.model.schema.syntaxes.ObjectClassDescriptionSyntaxCheckerTest
Tests run: 2, Failures: 0, Errors: 0, Skipped: 0, Time elapsed: 0.003 sec - in org.apache.directory.api.ldap.model.schema.syntaxes.ObjectClassDescriptionSyntaxCheckerTest
Running org.apache.directory.api.ldap.model.schema.syntaxes.MatchingRuleDescriptionSyntaxCheckerTest
Tests run: 2, Failures: 0, Errors: 0, Skipped: 0, Time elapsed: 0.003 sec - in org.apache.directory.api.ldap.model.schema.syntaxes.MatchingRuleDescriptionSyntaxCheckerTest
Running org.apache.directory.api.ldap.model.schema.syntaxes.CertificatePairSyntaxCheckerTest
Tests run: 4, Failures: 0, Errors: 0, Skipped: 0, Time elapsed: 0.001 sec - in org.apache.directory.api.ldap.model.schema.syntaxes.CertificatePairSyntaxCheckerTest
Running org.apache.directory.api.ldap.model.schema.syntaxes.AttributeTypeDescriptionSyntaxCheckerTest
Tests run: 2, Failures: 0, Errors: 0, Skipped: 0, Time elapsed: 0.005 sec - in org.apache.directory.api.ldap.model.schema.syntaxes.AttributeTypeDescriptionSyntaxCheckerTest
Running org.apache.directory.api.ldap.model.schema.syntaxes.SupplierOrConsumerSyntaxCheckerTest
Tests run: 4, Failures: 0, Errors: 0, Skipped: 0, Time elapsed: 0.002 sec - in org.apache.directory.api.ldap.model.schema.syntaxes.SupplierOrConsumerSyntaxCheckerTest
Running org.apache.directory.api.ldap.model.schema.syntaxes.PresentationAddressSyntaxCheckerTest
Tests run: 4, Failures: 0, Errors: 0, Skipped: 0, Time elapsed: 0.002 sec - in org.apache.directory.api.ldap.model.schema.syntaxes.PresentationAddressSyntaxCheckerTest
Running org.apache.directory.api.ldap.model.schema.syntaxes.SupportedAlgorithmSyntaxCheckerTest
Tests run: 4, Failures: 0, Errors: 0, Skipped: 0, Time elapsed: 0.002 sec - in org.apache.directory.api.ldap.model.schema.syntaxes.SupportedAlgorithmSyntaxCheckerTest
Running org.apache.directory.api.ldap.model.schema.syntaxes.OtherMailboxSyntaxCheckerTest
Tests run: 4, Failures: 0, Errors: 0, Skipped: 0, Time elapsed: 0.001 sec - in org.apache.directory.api.ldap.model.schema.syntaxes.OtherMailboxSyntaxCheckerTest
Running org.apache.directory.api.ldap.model.schema.syntaxes.FaxSyntaxCheckerTest
Tests run: 4, Failures: 0, Errors: 0, Skipped: 0, Time elapsed: 0.001 sec - in org.apache.directory.api.ldap.model.schema.syntaxes.FaxSyntaxCheckerTest
Running org.apache.directory.api.ldap.model.schema.syntaxes.NameOrNumericIdSyntaxCheckerTest
Tests run: 3, Failures: 0, Errors: 0, Skipped: 0, Time elapsed: 0.001 sec - in org.apache.directory.api.ldap.model.schema.syntaxes.NameOrNumericIdSyntaxCheckerTest
Running org.apache.directory.api.ldap.model.schema.syntaxes.DseTypeSyntaxCheckerTest
Tests run: 4, Failures: 0, Errors: 0, Skipped: 0, Time elapsed: 0.001 sec - in org.apache.directory.api.ldap.model.schema.syntaxes.DseTypeSyntaxCheckerTest
Running org.apache.directory.api.ldap.model.schema.syntaxes.ProtocolInformationSyntaxCheckerTest
Tests run: 4, Failures: 0, Errors: 0, Skipped: 0, Time elapsed: 0.001 sec - in org.apache.directory.api.ldap.model.schema.syntaxes.ProtocolInformationSyntaxCheckerTest
Running org.apache.directory.api.ldap.model.schema.syntaxes.ObjectClassTypeSyntaxCheckerTest
Tests run: 5, Failures: 0, Errors: 0, Skipped: 0, Time elapsed: 0.001 sec - in org.apache.directory.api.ldap.model.schema.syntaxes.ObjectClassTypeSyntaxCheckerTest
Running org.apache.directory.api.ldap.model.schema.syntaxes.CertificateListSyntaxCheckerTest
Tests run: 4, Failures: 0, Errors: 0, Skipped: 0, Time elapsed: 0.002 sec - in org.apache.directory.api.ldap.model.schema.syntaxes.CertificateListSyntaxCheckerTest
Running org.apache.directory.api.ldap.model.schema.syntaxes.PrintableStringSyntaxCheckerTest
Tests run: 4, Failures: 0, Errors: 0, Skipped: 0, Time elapsed: 0.002 sec - in org.apache.directory.api.ldap.model.schema.syntaxes.PrintableStringSyntaxCheckerTest
Running org.apache.directory.api.ldap.model.schema.syntaxes.LdapSyntaxDescriptionSyntaxCheckerTest
Tests run: 2, Failures: 0, Errors: 0, Skipped: 0, Time elapsed: 0.002 sec - in org.apache.directory.api.ldap.model.schema.syntaxes.LdapSyntaxDescriptionSyntaxCheckerTest
Running org.apache.directory.api.ldap.model.schema.syntaxes.DeliveryMethodSyntaxCheckerTest
Tests run: 5, Failures: 0, Errors: 0, Skipped: 0, Time elapsed: 0.002 sec - in org.apache.directory.api.ldap.model.schema.syntaxes.DeliveryMethodSyntaxCheckerTest
Running org.apache.directory.api.ldap.model.schema.syntaxes.JavaByteSyntaxCheckerTest
Tests run: 7, Failures: 0, Errors: 0, Skipped: 0, Time elapsed: 0.002 sec - in org.apache.directory.api.ldap.model.schema.syntaxes.JavaByteSyntaxCheckerTest

Results :

Tests run: 1460, Failures: 0, Errors: 0, Skipped: 2

[JENKINS] Recording test results
[INFO] 
[INFO] --- maven-bundle-plugin:2.3.7:bundle (default-bundle) @ api-ldap-model ---
[INFO] 
[INFO] --- maven-site-plugin:3.3:attach-descriptor (attach-descriptor) @ api-ldap-model ---
[INFO] 
[INFO] --- tools-maven-plugin:1.4:verify-legal-files (verify-legal-files) @ api-ldap-model
---
[INFO] Checking legal files in: api-ldap-model-1.0.0-M21-SNAPSHOT.jar
[INFO] 
[INFO] --- maven-source-plugin:2.2.1:jar-no-fork (attach-sources) @ api-ldap-model ---
[INFO] Building jar: <https://builds.apache.org/job/dir-shared-ubuntu-deploy/org.apache.directory.api$api-ldap-model/ws/target/api-ldap-model-1.0.0-M21-SNAPSHOT-sources.jar>
[INFO] 
[INFO] --- maven-install-plugin:2.4:install (default-install) @ api-ldap-model ---
[INFO] Installing <https://builds.apache.org/job/dir-shared-ubuntu-deploy/org.apache.directory.api$api-ldap-model/ws/target/api-ldap-model-1.0.0-M21-SNAPSHOT.jar>
to /home/jenkins/jenkins-slave/maven-repositories/1/org/apache/directory/api/api-ldap-model/1.0.0-M21-SNAPSHOT/api-ldap-model-1.0.0-M21-SNAPSHOT.jar
[INFO] Installing <https://builds.apache.org/job/dir-shared-ubuntu-deploy/org.apache.directory.api$api-ldap-model/ws/pom.xml>
to /home/jenkins/jenkins-slave/maven-repositories/1/org/apache/directory/api/api-ldap-model/1.0.0-M21-SNAPSHOT/api-ldap-model-1.0.0-M21-SNAPSHOT.pom
[INFO] Installing <https://builds.apache.org/job/dir-shared-ubuntu-deploy/org.apache.directory.api$api-ldap-model/ws/target/api-ldap-model-1.0.0-M21-SNAPSHOT-sources.jar>
to /home/jenkins/jenkins-slave/maven-repositories/1/org/apache/directory/api/api-ldap-model/1.0.0-M21-SNAPSHOT/api-ldap-model-1.0.0-M21-SNAPSHOT-sources.jar
[INFO] 
[INFO] --- maven-bundle-plugin:2.3.7:install (default-install) @ api-ldap-model ---
[WARNING] Exception while updating local OBR: Unable to read repository xml: file:/home/jenkins/jenkins-slave/maven-repositories/1/repository.xml
org.apache.maven.plugin.MojoExecutionException: Unable to read repository xml: file:/home/jenkins/jenkins-slave/maven-repositories/1/repository.xml
	at org.apache.felix.obrplugin.ObrUpdate.parseRepositoryXml(ObrUpdate.java:324)
	at org.apache.felix.obrplugin.ObrInstall.execute(ObrInstall.java:141)
	at org.apache.maven.plugin.DefaultBuildPluginManager.executeMojo(DefaultBuildPluginManager.java:101)
	at org.apache.maven.lifecycle.internal.MojoExecutor.execute(MojoExecutor.java:209)
	at org.apache.maven.lifecycle.internal.MojoExecutor.execute(MojoExecutor.java:153)
	at org.apache.maven.lifecycle.internal.MojoExecutor.execute(MojoExecutor.java:145)
	at org.apache.maven.lifecycle.internal.LifecycleModuleBuilder.buildProject(LifecycleModuleBuilder.java:84)
	at org.apache.maven.lifecycle.internal.LifecycleModuleBuilder.buildProject(LifecycleModuleBuilder.java:59)
	at org.apache.maven.lifecycle.internal.LifecycleStarter.singleThreadedBuild(LifecycleStarter.java:183)
	at org.apache.maven.lifecycle.internal.LifecycleStarter.execute(LifecycleStarter.java:161)
	at org.apache.maven.DefaultMaven.doExecute(DefaultMaven.java:320)
	at org.apache.maven.DefaultMaven.execute(DefaultMaven.java:156)
	at org.jvnet.hudson.maven3.launcher.Maven3Launcher.main(Maven3Launcher.java:117)
	at sun.reflect.NativeMethodAccessorImpl.invoke0(Native Method)
	at sun.reflect.NativeMethodAccessorImpl.invoke(NativeMethodAccessorImpl.java:39)
	at sun.reflect.DelegatingMethodAccessorImpl.invoke(DelegatingMethodAccessorImpl.java:25)
	at java.lang.reflect.Method.invoke(Method.java:597)
	at org.codehaus.plexus.classworlds.launcher.Launcher.launchStandard(Launcher.java:329)
	at org.codehaus.plexus.classworlds.launcher.Launcher.launch(Launcher.java:239)
	at org.jvnet.hudson.maven3.agent.Maven3Main.launch(Maven3Main.java:178)
	at sun.reflect.NativeMethodAccessorImpl.invoke0(Native Method)
	at sun.reflect.NativeMethodAccessorImpl.invoke(NativeMethodAccessorImpl.java:39)
	at sun.reflect.DelegatingMethodAccessorImpl.invoke(DelegatingMethodAccessorImpl.java:25)
	at java.lang.reflect.Method.invoke(Method.java:597)
	at hudson.maven.Maven3Builder.call(Maven3Builder.java:134)
	at hudson.maven.Maven3Builder.call(Maven3Builder.java:69)
	at hudson.remoting.UserRequest.perform(UserRequest.java:118)
	at hudson.remoting.UserRequest.perform(UserRequest.java:48)
	at hudson.remoting.Request$2.run(Request.java:328)
	at hudson.remoting.InterceptingExecutorService$1.call(InterceptingExecutorService.java:72)
	at java.util.concurrent.FutureTask$Sync.innerRun(FutureTask.java:303)
	at java.util.concurrent.FutureTask.run(FutureTask.java:138)
	at java.util.concurrent.ThreadPoolExecutor$Worker.runTask(ThreadPoolExecutor.java:886)
	at java.util.concurrent.ThreadPoolExecutor$Worker.run(ThreadPoolExecutor.java:908)
	at java.lang.Thread.run(Thread.java:619)
Caused by: org.xmlpull.v1.XmlPullParserException: unexpected type (position:END_DOCUMENT null@3:1
in java.io.InputStreamReader@1cc75b3) 
	at org.kxml2.io.KXmlParser.exception(Unknown Source)
	at org.kxml2.io.KXmlParser.nextTag(Unknown Source)
	at org.apache.felix.bundlerepository.impl.PullParser.parseRepository(PullParser.java:43)
	at org.apache.felix.bundlerepository.impl.DataModelHelperImpl.repository(DataModelHelperImpl.java:147)
	at org.apache.felix.bundlerepository.impl.DataModelHelperImpl.repository(DataModelHelperImpl.java:118)
	at org.apache.felix.obrplugin.ObrUpdate.parseRepositoryXml(ObrUpdate.java:316)
	... 34 more
[INFO] 
[INFO] --- maven-antrun-plugin:1.7:run (default) @ api-ldap-model ---
[INFO] No ant target defined - SKIPPED
[INFO] 
[INFO] --- antlr-maven-plugin:2.2:generate (default) @ api-ldap-model ---
[INFO] grammar [schema-value.g] was up-to-date; skipping
[INFO] grammar [schema-extension.g] was up-to-date; skipping
[INFO] grammar [SubtreeSpecificationChecker.g] was up-to-date; skipping
[INFO] grammar [subtree-specification.g] was up-to-date; skipping
[INFO] grammar [distinguishedName.g] was up-to-date; skipping
[INFO] grammar [schema-qdstring.g] was up-to-date; skipping
[INFO] grammar [schema.g] was up-to-date; skipping
[WARNING] Failed to getClass for org.apache.maven.plugin.source.SourceJarMojo
[INFO] 
[INFO] --- maven-source-plugin:2.2.1:jar (default-cli) @ api-ldap-model ---
[WARNING] Artifact org.apache.directory.api:api-ldap-model:java-source:sources:1.0.0-M21-SNAPSHOT
already attached to project, ignoring duplicate
[INFO] 
[INFO] --- maven-antrun-plugin:1.7:run (default) @ api-ldap-model ---
[INFO] No ant target defined - SKIPPED
[INFO] 
[INFO] --- antlr-maven-plugin:2.2:generate (default) @ api-ldap-model ---
[INFO] grammar [schema-value.g] was up-to-date; skipping
[INFO] grammar [schema-extension.g] was up-to-date; skipping
[INFO] grammar [SubtreeSpecificationChecker.g] was up-to-date; skipping
[INFO] grammar [subtree-specification.g] was up-to-date; skipping
[INFO] grammar [distinguishedName.g] was up-to-date; skipping
[INFO] grammar [schema-qdstring.g] was up-to-date; skipping
[INFO] grammar [schema.g] was up-to-date; skipping
[INFO] 
[INFO] --- maven-remote-resources-plugin:1.2.1:process (default) @ api-ldap-model ---
[INFO] 
[INFO] --- maven-resources-plugin:2.6:resources (default-resources) @ api-ldap-model ---
[INFO] Using 'UTF-8' encoding to copy filtered resources.
[INFO] skip non existing resourceDirectory <https://builds.apache.org/job/dir-shared-ubuntu-deploy/org.apache.directory.api$api-ldap-model/ws/src/main/resources>
[INFO] Copying 7 resources
[INFO] Copying 3 resources
[INFO] Copying 7 resources
[INFO] Copying 3 resources
[INFO] 
[INFO] --- maven-compiler-plugin:3.1:compile (default-compile) @ api-ldap-model ---
[INFO] Nothing to compile - all classes are up to date
[INFO] 
[INFO] --- maven-resources-plugin:2.6:testResources (default-testResources) @ api-ldap-model
---
[INFO] Using 'UTF-8' encoding to copy filtered resources.
[INFO] Copying 5 resources
[INFO] Copying 3 resources
[INFO] Copying 3 resources
[INFO] 
[INFO] --- maven-compiler-plugin:3.1:testCompile (default-testCompile) @ api-ldap-model ---
[INFO] Nothing to compile - all classes are up to date
[INFO] 
[INFO] --- maven-surefire-plugin:2.15:test (default-test) @ api-ldap-model ---
[INFO] Skipping execution of surefire because it has already been run for this configuration
[JENKINS] Recording test results
[INFO] 
[INFO] --- maven-bundle-plugin:2.3.7:bundle (default-bundle) @ api-ldap-model ---
[INFO] 
[INFO] --- maven-site-plugin:3.3:attach-descriptor (attach-descriptor) @ api-ldap-model ---
[INFO] 
[INFO] --- tools-maven-plugin:1.4:verify-legal-files (verify-legal-files) @ api-ldap-model
---
[INFO] Checking legal files in: api-ldap-model-1.0.0-M21-SNAPSHOT.jar
[INFO] Checking legal files in: api-ldap-model-1.0.0-M21-SNAPSHOT-sources.jar
[INFO] 
[INFO] --- maven-source-plugin:2.2.1:jar-no-fork (attach-sources) @ api-ldap-model ---
[INFO] Building jar: <https://builds.apache.org/job/dir-shared-ubuntu-deploy/org.apache.directory.api$api-ldap-model/ws/target/api-ldap-model-1.0.0-M21-SNAPSHOT-sources.jar>
[WARNING] Artifact org.apache.directory.api:api-ldap-model:java-source:sources:1.0.0-M21-SNAPSHOT
already attached to project, ignoring duplicate
[INFO] 
[INFO] --- maven-install-plugin:2.4:install (default-install) @ api-ldap-model ---
[INFO] Installing <https://builds.apache.org/job/dir-shared-ubuntu-deploy/org.apache.directory.api$api-ldap-model/ws/target/api-ldap-model-1.0.0-M21-SNAPSHOT.jar>
to /home/jenkins/jenkins-slave/maven-repositories/1/org/apache/directory/api/api-ldap-model/1.0.0-M21-SNAPSHOT/api-ldap-model-1.0.0-M21-SNAPSHOT.jar
[INFO] Installing <https://builds.apache.org/job/dir-shared-ubuntu-deploy/org.apache.directory.api$api-ldap-model/ws/pom.xml>
to /home/jenkins/jenkins-slave/maven-repositories/1/org/apache/directory/api/api-ldap-model/1.0.0-M21-SNAPSHOT/api-ldap-model-1.0.0-M21-SNAPSHOT.pom
[INFO] Installing <https://builds.apache.org/job/dir-shared-ubuntu-deploy/org.apache.directory.api$api-ldap-model/ws/target/api-ldap-model-1.0.0-M21-SNAPSHOT-sources.jar>
to /home/jenkins/jenkins-slave/maven-repositories/1/org/apache/directory/api/api-ldap-model/1.0.0-M21-SNAPSHOT/api-ldap-model-1.0.0-M21-SNAPSHOT-sources.jar
[INFO] 
[INFO] --- maven-bundle-plugin:2.3.7:install (default-install) @ api-ldap-model ---
[WARNING] Exception while updating local OBR: Unable to read repository xml: file:/home/jenkins/jenkins-slave/maven-repositories/1/repository.xml
org.apache.maven.plugin.MojoExecutionException: Unable to read repository xml: file:/home/jenkins/jenkins-slave/maven-repositories/1/repository.xml
	at org.apache.felix.obrplugin.ObrUpdate.parseRepositoryXml(ObrUpdate.java:324)
	at org.apache.felix.obrplugin.ObrInstall.execute(ObrInstall.java:141)
	at org.apache.maven.plugin.DefaultBuildPluginManager.executeMojo(DefaultBuildPluginManager.java:101)
	at org.apache.maven.lifecycle.internal.MojoExecutor.execute(MojoExecutor.java:209)
	at org.apache.maven.lifecycle.internal.MojoExecutor.execute(MojoExecutor.java:153)
	at org.apache.maven.lifecycle.internal.MojoExecutor.execute(MojoExecutor.java:145)
	at org.apache.maven.lifecycle.internal.LifecycleModuleBuilder.buildProject(LifecycleModuleBuilder.java:84)
	at org.apache.maven.lifecycle.internal.LifecycleModuleBuilder.buildProject(LifecycleModuleBuilder.java:59)
	at org.apache.maven.lifecycle.internal.LifecycleStarter.singleThreadedBuild(LifecycleStarter.java:183)
	at org.apache.maven.lifecycle.internal.LifecycleStarter.execute(LifecycleStarter.java:161)
	at org.apache.maven.DefaultMaven.doExecute(DefaultMaven.java:320)
	at org.apache.maven.DefaultMaven.execute(DefaultMaven.java:156)
	at org.jvnet.hudson.maven3.launcher.Maven3Launcher.main(Maven3Launcher.java:117)
	at sun.reflect.NativeMethodAccessorImpl.invoke0(Native Method)
	at sun.reflect.NativeMethodAccessorImpl.invoke(NativeMethodAccessorImpl.java:39)
	at sun.reflect.DelegatingMethodAccessorImpl.invoke(DelegatingMethodAccessorImpl.java:25)
	at java.lang.reflect.Method.invoke(Method.java:597)
	at org.codehaus.plexus.classworlds.launcher.Launcher.launchStandard(Launcher.java:329)
	at org.codehaus.plexus.classworlds.launcher.Launcher.launch(Launcher.java:239)
	at org.jvnet.hudson.maven3.agent.Maven3Main.launch(Maven3Main.java:178)
	at sun.reflect.NativeMethodAccessorImpl.invoke0(Native Method)
	at sun.reflect.NativeMethodAccessorImpl.invoke(NativeMethodAccessorImpl.java:39)
	at sun.reflect.DelegatingMethodAccessorImpl.invoke(DelegatingMethodAccessorImpl.java:25)
	at java.lang.reflect.Method.invoke(Method.java:597)
	at hudson.maven.Maven3Builder.call(Maven3Builder.java:134)
	at hudson.maven.Maven3Builder.call(Maven3Builder.java:69)
	at hudson.remoting.UserRequest.perform(UserRequest.java:118)
	at hudson.remoting.UserRequest.perform(UserRequest.java:48)
	at hudson.remoting.Request$2.run(Request.java:328)
	at hudson.remoting.InterceptingExecutorService$1.call(InterceptingExecutorService.java:72)
	at java.util.concurrent.FutureTask$Sync.innerRun(FutureTask.java:303)
	at java.util.concurrent.FutureTask.run(FutureTask.java:138)
	at java.util.concurrent.ThreadPoolExecutor$Worker.runTask(ThreadPoolExecutor.java:886)
	at java.util.concurrent.ThreadPoolExecutor$Worker.run(ThreadPoolExecutor.java:908)
	at java.lang.Thread.run(Thread.java:619)
Caused by: org.xmlpull.v1.XmlPullParserException: unexpected type (position:END_DOCUMENT null@3:1
in java.io.InputStreamReader@16cf727) 
	at org.kxml2.io.KXmlParser.exception(Unknown Source)
	at org.kxml2.io.KXmlParser.nextTag(Unknown Source)
	at org.apache.felix.bundlerepository.impl.PullParser.parseRepository(PullParser.java:43)
	at org.apache.felix.bundlerepository.impl.DataModelHelperImpl.repository(DataModelHelperImpl.java:147)
	at org.apache.felix.bundlerepository.impl.DataModelHelperImpl.repository(DataModelHelperImpl.java:118)
	at org.apache.felix.obrplugin.ObrUpdate.parseRepositoryXml(ObrUpdate.java:316)
	... 34 more
[INFO] 
[INFO] --- maven-deploy-plugin:2.7:deploy (default-deploy) @ api-ldap-model ---
Downloading: https://repository.apache.org/content/repositories/snapshots/org/apache/directory/api/api-ldap-model/1.0.0-M21-SNAPSHOT/maven-metadata.xml
[WARNING] Could not transfer metadata org.apache.directory.api:api-ldap-model:1.0.0-M21-SNAPSHOT/maven-metadata.xml
from/to apache.snapshots.https (https://repository.apache.org/content/repositories/snapshots):
Failed to transfer file: https://repository.apache.org/content/repositories/snapshots/org/apache/directory/api/api-ldap-model/1.0.0-M21-SNAPSHOT/maven-metadata.xml.
Return code is: 502, ReasonPhrase:Proxy Error.

Mime
View raw message