directory-notifications mailing list archives

Site index · List index
Message view « Date » · « Thread »
Top « Date » · « Thread »
From Apache Jenkins Server <jenk...@builds.apache.org>
Subject Build failed in Jenkins: dir-apacheds-win #555
Date Thu, 07 Nov 2013 21:10:06 GMT
See <https://builds.apache.org/job/dir-apacheds-win/555/>

------------------------------------------
[...truncated 2307 lines...]
Running org.apache.directory.server.dns.io.encoder.MailExchangeRecordEncoderTest
Tests run: 1, Failures: 0, Errors: 0, Skipped: 0, Time elapsed: 0 sec - in org.apache.directory.server.dns.io.encoder.MailExchangeRecordEncoderTest
Running org.apache.directory.server.dns.io.encoder.NameServerRecordEncoderTest
Tests run: 1, Failures: 0, Errors: 0, Skipped: 0, Time elapsed: 0 sec - in org.apache.directory.server.dns.io.encoder.NameServerRecordEncoderTest
Running org.apache.directory.server.dns.io.encoder.PointerRecordEncoderTest
Tests run: 1, Failures: 0, Errors: 0, Skipped: 0, Time elapsed: 0 sec - in org.apache.directory.server.dns.io.encoder.PointerRecordEncoderTest
Running org.apache.directory.server.dns.io.encoder.QuestionRecordEncoderTest
Tests run: 1, Failures: 0, Errors: 0, Skipped: 0, Time elapsed: 0 sec - in org.apache.directory.server.dns.io.encoder.QuestionRecordEncoderTest
Running org.apache.directory.server.dns.io.encoder.ServerSelectionRecordEncoderTest
Tests run: 1, Failures: 0, Errors: 0, Skipped: 0, Time elapsed: 0 sec - in org.apache.directory.server.dns.io.encoder.ServerSelectionRecordEncoderTest
Running org.apache.directory.server.dns.io.encoder.StartOfAuthorityRecordEncoderTest
Tests run: 1, Failures: 0, Errors: 0, Skipped: 0, Time elapsed: 0 sec - in org.apache.directory.server.dns.io.encoder.StartOfAuthorityRecordEncoderTest
Running org.apache.directory.server.dns.io.encoder.TextRecordEncoderTest
Tests run: 1, Failures: 0, Errors: 0, Skipped: 0, Time elapsed: 0 sec - in org.apache.directory.server.dns.io.encoder.TextRecordEncoderTest
Running org.apache.directory.server.dns.messages.RecordClassTest
Tests run: 1, Failures: 0, Errors: 0, Skipped: 0, Time elapsed: 0 sec - in org.apache.directory.server.dns.messages.RecordClassTest

Results :

Tests run: 14, Failures: 0, Errors: 0, Skipped: 0

[JENKINS] Recording test results
[INFO] 
[INFO] --- maven-bundle-plugin:2.3.7:bundle (default-bundle) @ apacheds-protocol-dns ---
[INFO] 
[INFO] --- maven-site-plugin:3.3:attach-descriptor (attach-descriptor) @ apacheds-protocol-dns
---
[INFO] 
[INFO] --- tools-maven-plugin:1.4:verify-legal-files (verify-legal-files) @ apacheds-protocol-dns
---
[INFO] Checking legal files in: apacheds-protocol-dns-2.0.0-M16-SNAPSHOT.jar
[WARNING] Failed to getClass for org.apache.maven.plugin.source.SourceJarMojo
[INFO] 
[INFO] --- maven-source-plugin:2.2.1:jar (attach-sources) @ apacheds-protocol-dns ---
[INFO] Building jar: F:\hudson\hudson-slave\workspace\dir-apacheds-win\trunk\protocol-dns\target\apacheds-protocol-dns-2.0.0-M16-SNAPSHOT-sources.jar
[INFO] 
[INFO] --- maven-install-plugin:2.4:install (default-install) @ apacheds-protocol-dns ---
[INFO] Installing F:\hudson\hudson-slave\workspace\dir-apacheds-win\trunk\protocol-dns\target\apacheds-protocol-dns-2.0.0-M16-SNAPSHOT.jar
to f:\hudson\hudson-slave\maven-repositories\0\org\apache\directory\server\apacheds-protocol-dns\2.0.0-M16-SNAPSHOT\apacheds-protocol-dns-2.0.0-M16-SNAPSHOT.jar
[INFO] Installing F:\hudson\hudson-slave\workspace\dir-apacheds-win\trunk\protocol-dns\pom.xml
to f:\hudson\hudson-slave\maven-repositories\0\org\apache\directory\server\apacheds-protocol-dns\2.0.0-M16-SNAPSHOT\apacheds-protocol-dns-2.0.0-M16-SNAPSHOT.pom
[INFO] Installing F:\hudson\hudson-slave\workspace\dir-apacheds-win\trunk\protocol-dns\target\apacheds-protocol-dns-2.0.0-M16-SNAPSHOT-sources.jar
to f:\hudson\hudson-slave\maven-repositories\0\org\apache\directory\server\apacheds-protocol-dns\2.0.0-M16-SNAPSHOT\apacheds-protocol-dns-2.0.0-M16-SNAPSHOT-sources.jar
[INFO] 
[INFO] --- maven-bundle-plugin:2.3.7:install (default-install) @ apacheds-protocol-dns ---
[INFO] Installing org/apache/directory/server/apacheds-protocol-dns/2.0.0-M16-SNAPSHOT/apacheds-protocol-dns-2.0.0-M16-SNAPSHOT.jar
[INFO] Writing OBR metadata
[INFO]                                                                         
[INFO] ------------------------------------------------------------------------
[INFO] Building ApacheDS Protocol Kerberos 2.0.0-M16-SNAPSHOT
[INFO] ------------------------------------------------------------------------
[INFO] 
[INFO] --- maven-clean-plugin:2.4.1:clean (default-clean) @ apacheds-protocol-kerberos ---
[INFO] Deleting F:\hudson\hudson-slave\workspace\dir-apacheds-win\trunk\protocol-kerberos\target
[INFO] 
[INFO] --- maven-remote-resources-plugin:1.2.1:process (default) @ apacheds-protocol-kerberos
---
[INFO] 
[INFO] --- maven-resources-plugin:2.6:resources (default-resources) @ apacheds-protocol-kerberos
---
[INFO] Using 'UTF-8' encoding to copy filtered resources.
[INFO] Copying 0 resource
[INFO] Copying 3 resources
[INFO] 
[INFO] --- maven-compiler-plugin:3.1:compile (default-compile) @ apacheds-protocol-kerberos
---
[INFO] Changes detected - recompiling the module!
[INFO] Compiling 33 source files to F:\hudson\hudson-slave\workspace\dir-apacheds-win\trunk\protocol-kerberos\target\classes
[INFO] 
[INFO] --- maven-resources-plugin:2.6:testResources (default-testResources) @ apacheds-protocol-kerberos
---
[INFO] Using 'UTF-8' encoding to copy filtered resources.
[INFO] Copying 2 resources
[INFO] Copying 3 resources
[INFO] 
[INFO] --- maven-compiler-plugin:3.1:testCompile (default-testCompile) @ apacheds-protocol-kerberos
---
[INFO] Changes detected - recompiling the module!
[INFO] Compiling 11 source files to F:\hudson\hudson-slave\workspace\dir-apacheds-win\trunk\protocol-kerberos\target\test-classes
[INFO] 
[INFO] --- maven-surefire-plugin:2.15:test (default-test) @ apacheds-protocol-kerberos ---
[INFO] Surefire report directory: F:\hudson\hudson-slave\workspace\dir-apacheds-win\trunk\protocol-kerberos\target\surefire-reports

-------------------------------------------------------
 T E S T S
-------------------------------------------------------
Running org.apache.directory.server.kerberos.protocol.AuthenticationEncryptionTypeTest
Tests run: 4, Failures: 0, Errors: 0, Skipped: 1, Time elapsed: 1.376 sec - in org.apache.directory.server.kerberos.protocol.AuthenticationEncryptionTypeTest
Running org.apache.directory.server.kerberos.protocol.AuthenticationPolicyTest
Tests run: 7, Failures: 0, Errors: 0, Skipped: 0, Time elapsed: 0.02 sec - in org.apache.directory.server.kerberos.protocol.AuthenticationPolicyTest
Running org.apache.directory.server.kerberos.protocol.AuthenticationServiceTest
Tests run: 30, Failures: 0, Errors: 0, Skipped: 0, Time elapsed: 0.356 sec - in org.apache.directory.server.kerberos.protocol.AuthenticationServiceTest
Running org.apache.directory.server.kerberos.protocol.EncTktInSkeyTest
Tests run: 1, Failures: 0, Errors: 0, Skipped: 0, Time elapsed: 0.071 sec - in org.apache.directory.server.kerberos.protocol.EncTktInSkeyTest
Running org.apache.directory.server.kerberos.protocol.PreAuthenticationTest
Tests run: 4, Failures: 0, Errors: 0, Skipped: 0, Time elapsed: 0.033 sec - in org.apache.directory.server.kerberos.protocol.PreAuthenticationTest
Running org.apache.directory.server.kerberos.protocol.TicketGrantingEncryptionTypeTest
Tests run: 6, Failures: 0, Errors: 0, Skipped: 1, Time elapsed: 0.076 sec - in org.apache.directory.server.kerberos.protocol.TicketGrantingEncryptionTypeTest
[JENKINS] Recording test resultsRunning org.apache.directory.server.kerberos.protocol.TicketGrantingPolicyTest

Tests run: 12, Failures: 0, Errors: 0, Skipped: 0, Time elapsed: 0.202 sec - in org.apache.directory.server.kerberos.protocol.TicketGrantingPolicyTest
Running org.apache.directory.server.kerberos.protocol.TicketGrantingServiceTest
Tests run: 37, Failures: 0, Errors: 0, Skipped: 2, Time elapsed: 0.444 sec - in org.apache.directory.server.kerberos.protocol.TicketGrantingServiceTest

Results :

Tests run: 101, Failures: 0, Errors: 0, Skipped: 4

[INFO] 
[INFO] --- maven-bundle-plugin:2.3.7:bundle (default-bundle) @ apacheds-protocol-kerberos
---
[WARNING] Bundle org.apache.directory.server:apacheds-protocol-kerberos:bundle:2.0.0-M16-SNAPSHOT
: Split package org/apache/directory/server/kerberos/protocol/codec
Use directive -split-package:=(merge-first|merge-last|error|first) on Export/Private Package
instruction to get rid of this warning
Package found in   [Jar:., Jar:apacheds-kerberos-codec]
Reference from     F:\hudson\hudson-slave\workspace\dir-apacheds-win\trunk\kerberos-codec\target\apacheds-kerberos-codec-2.0.0-M16-SNAPSHOT.jar
Classpath          [Jar:., Jar:apacheds-core-api, Jar:commons-lang, Jar:commons-io, Jar:apacheds-core-constants,
Jar:api-i18n, Jar:api-ldap-client-api, Jar:commons-pool, Jar:api-ldap-codec-core, Jar:api-ldap-extras-aci,
Jar:api-ldap-extras-util, Jar:api-ldap-schema-data, Jar:api-util, Jar:apacheds-i18n, Jar:apacheds-kerberos-codec,
Jar:api-asn1-ber, Jar:apacheds-protocol-shared, Jar:apacheds-core-shared, Jar:api-ldap-extras-codec-api,
Jar:api-asn1-api, Jar:api-ldap-model, Jar:antlr, Jar:commons-collections, Jar:mina-core, Jar:ehcache-core,
Jar:annotations, Jar:slf4j-api]
[INFO] 
[INFO] --- maven-site-plugin:3.3:attach-descriptor (attach-descriptor) @ apacheds-protocol-kerberos
---
[INFO] 
[INFO] --- tools-maven-plugin:1.4:verify-legal-files (verify-legal-files) @ apacheds-protocol-kerberos
---
[INFO] Checking legal files in: apacheds-protocol-kerberos-2.0.0-M16-SNAPSHOT.jar
[WARNING] Failed to getClass for org.apache.maven.plugin.source.SourceJarMojo
[INFO] 
[INFO] --- maven-source-plugin:2.2.1:jar (attach-sources) @ apacheds-protocol-kerberos ---
[INFO] Building jar: F:\hudson\hudson-slave\workspace\dir-apacheds-win\trunk\protocol-kerberos\target\apacheds-protocol-kerberos-2.0.0-M16-SNAPSHOT-sources.jar
[INFO] 
[INFO] --- maven-install-plugin:2.4:install (default-install) @ apacheds-protocol-kerberos
---
[INFO] Installing F:\hudson\hudson-slave\workspace\dir-apacheds-win\trunk\protocol-kerberos\target\apacheds-protocol-kerberos-2.0.0-M16-SNAPSHOT.jar
to f:\hudson\hudson-slave\maven-repositories\0\org\apache\directory\server\apacheds-protocol-kerberos\2.0.0-M16-SNAPSHOT\apacheds-protocol-kerberos-2.0.0-M16-SNAPSHOT.jar
[INFO] Installing F:\hudson\hudson-slave\workspace\dir-apacheds-win\trunk\protocol-kerberos\pom.xml
to f:\hudson\hudson-slave\maven-repositories\0\org\apache\directory\server\apacheds-protocol-kerberos\2.0.0-M16-SNAPSHOT\apacheds-protocol-kerberos-2.0.0-M16-SNAPSHOT.pom
[INFO] Installing F:\hudson\hudson-slave\workspace\dir-apacheds-win\trunk\protocol-kerberos\target\apacheds-protocol-kerberos-2.0.0-M16-SNAPSHOT-sources.jar
to f:\hudson\hudson-slave\maven-repositories\0\org\apache\directory\server\apacheds-protocol-kerberos\2.0.0-M16-SNAPSHOT\apacheds-protocol-kerberos-2.0.0-M16-SNAPSHOT-sources.jar
[INFO] 
[INFO] --- maven-bundle-plugin:2.3.7:install (default-install) @ apacheds-protocol-kerberos
---
[INFO] Installing org/apache/directory/server/apacheds-protocol-kerberos/2.0.0-M16-SNAPSHOT/apacheds-protocol-kerberos-2.0.0-M16-SNAPSHOT.jar
[INFO] Writing OBR metadata
[INFO]                                                                         
[INFO] ------------------------------------------------------------------------
[INFO] Building ApacheDS Protocol Ldap 2.0.0-M16-SNAPSHOT
[INFO] ------------------------------------------------------------------------
Downloading: http://repository.apache.org/snapshots/org/apache/directory/api/api-ldap-extras-sp/1.0.0-M21-SNAPSHOT/maven-metadata.xml
Downloaded: http://repository.apache.org/snapshots/org/apache/directory/api/api-ldap-extras-sp/1.0.0-M21-SNAPSHOT/maven-metadata.xml
(2 KB at 2.0 KB/sec)
[INFO] 
[INFO] --- maven-clean-plugin:2.4.1:clean (default-clean) @ apacheds-protocol-ldap ---
[INFO] Deleting F:\hudson\hudson-slave\workspace\dir-apacheds-win\trunk\protocol-ldap\target
[INFO] 
[INFO] --- maven-remote-resources-plugin:1.2.1:process (default) @ apacheds-protocol-ldap
---
[INFO] 
[INFO] --- maven-resources-plugin:2.6:resources (default-resources) @ apacheds-protocol-ldap
---
[INFO] Using 'UTF-8' encoding to copy filtered resources.
[INFO] Copying 0 resource
[INFO] Copying 3 resources
[INFO] 
[INFO] --- maven-compiler-plugin:3.1:compile (default-compile) @ apacheds-protocol-ldap ---
[INFO] Changes detected - recompiling the module!
[INFO] Compiling 80 source files to F:\hudson\hudson-slave\workspace\dir-apacheds-win\trunk\protocol-ldap\target\classes
[WARNING] /F:/hudson/hudson-slave/workspace/dir-apacheds-win/trunk/protocol-ldap/src/main/java/org/apache/directory/server/ldap/LdapServer.java:
Some input files use unchecked or unsafe operations.
[WARNING] /F:/hudson/hudson-slave/workspace/dir-apacheds-win/trunk/protocol-ldap/src/main/java/org/apache/directory/server/ldap/LdapServer.java:
Recompile with -Xlint:unchecked for details.
[INFO] 
[INFO] --- maven-resources-plugin:2.6:testResources (default-testResources) @ apacheds-protocol-ldap
---
[INFO] Using 'UTF-8' encoding to copy filtered resources.
[INFO] Copying 1 resource
[INFO] Copying 3 resources
[INFO] 
[INFO] --- maven-compiler-plugin:3.1:testCompile (default-testCompile) @ apacheds-protocol-ldap
---
[INFO] Changes detected - recompiling the module!
[INFO] Compiling 3 source files to F:\hudson\hudson-slave\workspace\dir-apacheds-win\trunk\protocol-ldap\target\test-classes
[INFO] 
[INFO] --- maven-surefire-plugin:2.15:test (default-test) @ apacheds-protocol-ldap ---
[INFO] Surefire report directory: F:\hudson\hudson-slave\workspace\dir-apacheds-win\trunk\protocol-ldap\target\surefire-reports

-------------------------------------------------------
 T E S T S
-------------------------------------------------------
Running org.apache.directory.server.ldap.JournalTest
Tests run: 3, Failures: 0, Errors: 0, Skipped: 1, Time elapsed: 43.088 sec - in org.apache.directory.server.ldap.JournalTest
Running org.apache.directory.server.ldap.LdapServerSettingsTest
Tests run: 3, Failures: 0, Errors: 0, Skipped: 0, Time elapsed: 0.04 sec - in org.apache.directory.server.ldap.LdapServerSettingsTest
Running org.apache.directory.server.ldap.SettingAlternativeHandlersTest
Tests run: 2, Failures: 0, Errors: 0, Skipped: 0, Time elapsed: 0.015 sec - in org.apache.directory.server.ldap.SettingAlternativeHandlersTest

Results :

Tests run: 8, Failures: 0, Errors: 0, Skipped: 1

[JENKINS] Recording test results
[INFO] 
[INFO] --- maven-bundle-plugin:2.3.7:bundle (default-bundle) @ apacheds-protocol-ldap ---
[INFO] 
[INFO] --- maven-site-plugin:3.3:attach-descriptor (attach-descriptor) @ apacheds-protocol-ldap
---
[INFO] 
[INFO] --- tools-maven-plugin:1.4:verify-legal-files (verify-legal-files) @ apacheds-protocol-ldap
---
[INFO] Checking legal files in: apacheds-protocol-ldap-2.0.0-M16-SNAPSHOT.jar
[WARNING] Failed to getClass for org.apache.maven.plugin.source.SourceJarMojo
[INFO] 
[INFO] --- maven-source-plugin:2.2.1:jar (attach-sources) @ apacheds-protocol-ldap ---
[INFO] Building jar: F:\hudson\hudson-slave\workspace\dir-apacheds-win\trunk\protocol-ldap\target\apacheds-protocol-ldap-2.0.0-M16-SNAPSHOT-sources.jar
[INFO] 
[INFO] --- maven-install-plugin:2.4:install (default-install) @ apacheds-protocol-ldap ---
[INFO] Installing F:\hudson\hudson-slave\workspace\dir-apacheds-win\trunk\protocol-ldap\target\apacheds-protocol-ldap-2.0.0-M16-SNAPSHOT.jar
to f:\hudson\hudson-slave\maven-repositories\0\org\apache\directory\server\apacheds-protocol-ldap\2.0.0-M16-SNAPSHOT\apacheds-protocol-ldap-2.0.0-M16-SNAPSHOT.jar
[INFO] Installing F:\hudson\hudson-slave\workspace\dir-apacheds-win\trunk\protocol-ldap\pom.xml
to f:\hudson\hudson-slave\maven-repositories\0\org\apache\directory\server\apacheds-protocol-ldap\2.0.0-M16-SNAPSHOT\apacheds-protocol-ldap-2.0.0-M16-SNAPSHOT.pom
[INFO] Installing F:\hudson\hudson-slave\workspace\dir-apacheds-win\trunk\protocol-ldap\target\apacheds-protocol-ldap-2.0.0-M16-SNAPSHOT-sources.jar
to f:\hudson\hudson-slave\maven-repositories\0\org\apache\directory\server\apacheds-protocol-ldap\2.0.0-M16-SNAPSHOT\apacheds-protocol-ldap-2.0.0-M16-SNAPSHOT-sources.jar
[INFO] 
[INFO] --- maven-bundle-plugin:2.3.7:install (default-install) @ apacheds-protocol-ldap ---
[INFO] Installing org/apache/directory/server/apacheds-protocol-ldap/2.0.0-M16-SNAPSHOT/apacheds-protocol-ldap-2.0.0-M16-SNAPSHOT.jar
[INFO] Writing OBR metadata
ERROR: Failed to parse POMs
hudson.remoting.ChannelClosedException: channel is already closed
	at hudson.remoting.Channel.send(Channel.java:516)
	at hudson.remoting.Request.call(Request.java:129)
	at hudson.remoting.Channel.call(Channel.java:714)
	at hudson.remoting.RemoteInvocationHandler.invoke(RemoteInvocationHandler.java:167)
	at com.sun.proxy.$Proxy45.isAlive(Unknown Source)
	at hudson.Launcher$RemoteLauncher$ProcImpl.isAlive(Launcher.java:930)
	at hudson.maven.ProcessCache$MavenProcess.call(ProcessCache.java:165)
	at hudson.maven.MavenModuleSetBuild$MavenModuleSetBuildExecution.doRun(MavenModuleSetBuild.java:823)
	at hudson.model.AbstractBuild$AbstractBuildExecution.run(AbstractBuild.java:562)
	at hudson.model.Run.execute(Run.java:1665)
	at hudson.maven.MavenModuleSetBuild.run(MavenModuleSetBuild.java:509)
	at hudson.model.ResourceController.execute(ResourceController.java:88)
	at hudson.model.Executor.run(Executor.java:230)
Caused by: java.net.SocketException: Socket closed
	at java.net.SocketInputStream.socketRead0(Native Method)
	at java.net.SocketInputStream.read(SocketInputStream.java:150)
	at java.net.SocketInputStream.read(SocketInputStream.java:121)
	at java.io.BufferedInputStream.fill(BufferedInputStream.java:235)
	at java.io.BufferedInputStream.read(BufferedInputStream.java:254)
	at hudson.remoting.FlightRecorderInputStream.read(FlightRecorderInputStream.java:77)
	at java.io.ObjectInputStream$PeekInputStream.peek(ObjectInputStream.java:2291)
	at java.io.ObjectInputStream$BlockDataInputStream.peek(ObjectInputStream.java:2584)
	at java.io.ObjectInputStream$BlockDataInputStream.peekByte(ObjectInputStream.java:2594)
	at java.io.ObjectInputStream.readObject0(ObjectInputStream.java:1316)
	at java.io.ObjectInputStream.readObject(ObjectInputStream.java:370)
	at hudson.remoting.Command.readFrom(Command.java:92)
	at hudson.remoting.ClassicCommandTransport.read(ClassicCommandTransport.java:71)
	at hudson.remoting.SynchronousCommandTransport$ReaderThread.run(SynchronousCommandTransport.java:48)
FATAL: channel is already closed
hudson.remoting.ChannelClosedException: channel is already closed
	at hudson.remoting.Channel.send(Channel.java:516)
	at hudson.remoting.Request.call(Request.java:129)
	at hudson.remoting.Channel.call(Channel.java:714)
	at hudson.Launcher$RemoteLauncher.kill(Launcher.java:887)
	at hudson.model.AbstractBuild$AbstractBuildExecution.run(AbstractBuild.java:585)
	at hudson.model.Run.execute(Run.java:1665)
	at hudson.maven.MavenModuleSetBuild.run(MavenModuleSetBuild.java:509)
	at hudson.model.ResourceController.execute(ResourceController.java:88)
	at hudson.model.Executor.run(Executor.java:230)
Caused by: java.net.SocketException: Socket closed
	at java.net.SocketInputStream.socketRead0(Native Method)
	at java.net.SocketInputStream.read(SocketInputStream.java:150)
	at java.net.SocketInputStream.read(SocketInputStream.java:121)
	at java.io.BufferedInputStream.fill(BufferedInputStream.java:235)
	at java.io.BufferedInputStream.read(BufferedInputStream.java:254)
	at hudson.remoting.FlightRecorderInputStream.read(FlightRecorderInputStream.java:77)
	at java.io.ObjectInputStream$PeekInputStream.peek(ObjectInputStream.java:2291)
	at java.io.ObjectInputStream$BlockDataInputStream.peek(ObjectInputStream.java:2584)
	at java.io.ObjectInputStream$BlockDataInputStream.peekByte(ObjectInputStream.java:2594)
	at java.io.ObjectInputStream.readObject0(ObjectInputStream.java:1316)
	at java.io.ObjectInputStream.readObject(ObjectInputStream.java:370)
	at hudson.remoting.Command.readFrom(Command.java:92)
	at hudson.remoting.ClassicCommandTransport.read(ClassicCommandTransport.java:71)
	at hudson.remoting.SynchronousCommandTransport$ReaderThread.run(SynchronousCommandTransport.java:48)

Mime
View raw message