directory-notifications mailing list archives

Site index · List index
Message view « Date » · « Thread »
Top « Date » · « Thread »
From Apache Jenkins Server <jenk...@builds.apache.org>
Subject Build failed in Jenkins: dir-apacheds-ubuntu-deploy #1170
Date Fri, 08 Nov 2013 09:29:05 GMT
See <https://builds.apache.org/job/dir-apacheds-ubuntu-deploy/1170/>

------------------------------------------
[...truncated 2190 lines...]
  symbol:   class ValueCursor
  location: class org.apache.directory.server.core.partition.impl.btree.mavibot.KeyTupleArrayCursor<K,V>
[ERROR] <https://builds.apache.org/job/dir-apacheds-ubuntu-deploy/ws/trunk/mavibot-partition/src/main/java/org/apache/directory/server/core/partition/impl/btree/mavibot/MavibotCursor.java>:[29,42]
cannot find symbol
  symbol:   class TupleCursor
  location: package org.apache.directory.mavibot.btree
[ERROR] <https://builds.apache.org/job/dir-apacheds-ubuntu-deploy/ws/trunk/mavibot-partition/src/main/java/org/apache/directory/server/core/partition/impl/btree/mavibot/MavibotCursor.java>:[50,13]
cannot find symbol
  symbol:   class TupleCursor
  location: class org.apache.directory.server.core.partition.impl.btree.mavibot.MavibotCursor<K,V>
[ERROR] <https://builds.apache.org/job/dir-apacheds-ubuntu-deploy/ws/trunk/mavibot-partition/src/main/java/org/apache/directory/server/core/partition/impl/btree/mavibot/MavibotCursor.java>:[328,32]
cannot find symbol
  symbol:   class TupleCursor
  location: class org.apache.directory.server.core.partition.impl.btree.mavibot.MavibotCursor<K,V>
[ERROR] <https://builds.apache.org/job/dir-apacheds-ubuntu-deploy/ws/trunk/mavibot-partition/src/main/java/org/apache/directory/server/core/partition/impl/btree/mavibot/MavibotTable.java>:[134,9]
cannot find symbol
  symbol:   class TupleCursor
  location: class org.apache.directory.server.core.partition.impl.btree.mavibot.MavibotTable<K,V>
[ERROR] <https://builds.apache.org/job/dir-apacheds-ubuntu-deploy/ws/trunk/mavibot-partition/src/main/java/org/apache/directory/server/core/partition/impl/btree/mavibot/MavibotTable.java>:[155,9]
cannot find symbol
  symbol:   class TupleCursor
  location: class org.apache.directory.server.core.partition.impl.btree.mavibot.MavibotTable<K,V>
[ERROR] <https://builds.apache.org/job/dir-apacheds-ubuntu-deploy/ws/trunk/mavibot-partition/src/main/java/org/apache/directory/server/core/partition/impl/btree/mavibot/MavibotTable.java>:[211,9]
cannot find symbol
  symbol:   class TupleCursor
  location: class org.apache.directory.server.core.partition.impl.btree.mavibot.MavibotTable<K,V>
[ERROR] <https://builds.apache.org/job/dir-apacheds-ubuntu-deploy/ws/trunk/mavibot-partition/src/main/java/org/apache/directory/server/core/partition/impl/btree/mavibot/MavibotTable.java>:[220,13]
cannot find symbol
  symbol:   class ValueCursor
  location: class org.apache.directory.server.core.partition.impl.btree.mavibot.MavibotTable<K,V>
[ERROR] <https://builds.apache.org/job/dir-apacheds-ubuntu-deploy/ws/trunk/mavibot-partition/src/main/java/org/apache/directory/server/core/partition/impl/btree/mavibot/MavibotTable.java>:[258,9]
cannot find symbol
  symbol:   class ValueCursor
  location: class org.apache.directory.server.core.partition.impl.btree.mavibot.MavibotTable<K,V>
[ERROR] <https://builds.apache.org/job/dir-apacheds-ubuntu-deploy/ws/trunk/mavibot-partition/src/main/java/org/apache/directory/server/core/partition/impl/btree/mavibot/MavibotTable.java>:[323,13]
cannot find symbol
  symbol:   class ValueCursor
  location: class org.apache.directory.server.core.partition.impl.btree.mavibot.MavibotTable<K,V>
[ERROR] <https://builds.apache.org/job/dir-apacheds-ubuntu-deploy/ws/trunk/mavibot-partition/src/main/java/org/apache/directory/server/core/partition/impl/btree/mavibot/MavibotTable.java>:[396,17]
cannot find symbol
  symbol:   class ValueCursor
  location: class org.apache.directory.server.core.partition.impl.btree.mavibot.MavibotTable<K,V>
[ERROR] <https://builds.apache.org/job/dir-apacheds-ubuntu-deploy/ws/trunk/mavibot-partition/src/main/java/org/apache/directory/server/core/partition/impl/btree/mavibot/MavibotTable.java>:[430,17]
cannot find symbol
  symbol:   class ValueCursor
  location: class org.apache.directory.server.core.partition.impl.btree.mavibot.MavibotTable<K,V>
[ERROR] <https://builds.apache.org/job/dir-apacheds-ubuntu-deploy/ws/trunk/mavibot-partition/src/main/java/org/apache/directory/server/core/partition/impl/btree/mavibot/MavibotTable.java>:[458,17]
cannot find symbol
  symbol:   class ValueCursor
  location: class org.apache.directory.server.core.partition.impl.btree.mavibot.MavibotTable<K,V>
[ERROR] <https://builds.apache.org/job/dir-apacheds-ubuntu-deploy/ws/trunk/mavibot-partition/src/main/java/org/apache/directory/server/core/partition/impl/btree/mavibot/MavibotParentIdAndRdnSerializer.java>:[231,5]
method does not override or implement a method from a supertype
[ERROR] <https://builds.apache.org/job/dir-apacheds-ubuntu-deploy/ws/trunk/mavibot-partition/src/main/java/org/apache/directory/server/core/partition/impl/btree/mavibot/MavibotParentIdAndRdnSerializer.java>:[241,5]
method does not override or implement a method from a supertype
[ERROR] <https://builds.apache.org/job/dir-apacheds-ubuntu-deploy/ws/trunk/mavibot-partition/src/main/java/org/apache/directory/server/core/partition/impl/btree/mavibot/DnSerializer.java>:[166,5]
method does not override or implement a method from a supertype
[ERROR] <https://builds.apache.org/job/dir-apacheds-ubuntu-deploy/ws/trunk/mavibot-partition/src/main/java/org/apache/directory/server/core/partition/impl/btree/mavibot/DnSerializer.java>:[176,5]
method does not override or implement a method from a supertype
[ERROR] <https://builds.apache.org/job/dir-apacheds-ubuntu-deploy/ws/trunk/mavibot-partition/src/main/java/org/apache/directory/server/core/partition/impl/btree/mavibot/MavibotEntrySerializer.java>:[290,5]
method does not override or implement a method from a supertype
[ERROR] <https://builds.apache.org/job/dir-apacheds-ubuntu-deploy/ws/trunk/mavibot-partition/src/main/java/org/apache/directory/server/core/partition/impl/btree/mavibot/MavibotEntrySerializer.java>:[300,5]
method does not override or implement a method from a supertype
[INFO] 27 errors 
[INFO] -------------------------------------------------------------
[INFO] ------------------------------------------------------------------------
[INFO] Reactor Summary:
[INFO] 
[INFO] ApacheDS .......................................... SUCCESS [30.817s]
[INFO] ApacheDS I18n ..................................... SUCCESS [33.765s]
[INFO] ApacheDS Core Constants ........................... SUCCESS [15.788s]
[INFO] ApacheDS Core API ................................. SUCCESS [55.150s]
[INFO] ApacheDS Core Shared .............................. SUCCESS [22.886s]
[INFO] ApacheDS Interceptors ............................. SUCCESS [6.617s]
[INFO] ApacheDS AdministrativePoint Interceptor .......... SUCCESS [30.124s]
[INFO] ApacheDS Authentication Interceptor ............... SUCCESS [24.853s]
[INFO] ApacheDS Authorization Interceptor ................ SUCCESS [29.310s]
[INFO] ApacheDS ChangeLog Interceptor .................... SUCCESS [21.335s]
[INFO] ApacheDS Collective Attribute Interceptor ......... SUCCESS [20.691s]
[INFO] ApacheDS Event Interceptor ........................ SUCCESS [19.088s]
[INFO] ApacheDS Exception Interceptor .................... SUCCESS [18.126s]
[INFO] ApacheDS Journal Interceptor ...................... SUCCESS [22.733s]
[INFO] ApacheDS Normalization Interceptor ................ SUCCESS [18.530s]
[INFO] ApacheDS Operational Attribute Interceptor ........ SUCCESS [20.534s]
[INFO] ApacheDS Referral Interceptor ..................... SUCCESS [17.179s]
[INFO] ApacheDS Schema Interceptor ....................... SUCCESS [27.431s]
[INFO] ApacheDS Subtree Interceptor ...................... SUCCESS [25.270s]
[INFO] ApacheDS Triggers Interceptor ..................... SUCCESS [21.903s]
[INFO] ApacheDS Core ..................................... SUCCESS [25.751s]
[INFO] ApacheDS Core AVL ................................. SUCCESS [24.688s]
[INFO] ApacheDS Generalized (X) DBM Partition ............ SUCCESS [24.101s]
[INFO] ApacheDS LDIF Partition ........................... SUCCESS [36.215s]
[INFO] ApacheDS JDBM Partition ........................... SUCCESS [1:45.915s]
[INFO] ApacheDS Mavibot Partition ........................ FAILURE [4.598s]
[INFO] ApacheDS Core Annotations ......................... SKIPPED
[INFO] ApacheDS Core JNDI ................................ SKIPPED
[INFO] ApacheDS Protocol Kerberos Codec .................. SKIPPED
[INFO] ApacheDS Interceptors for Kerberos ................ SKIPPED
[INFO] ApacheDS Protocol Dhcp ............................ SKIPPED
[INFO] ApacheDS Protocol Shared .......................... SKIPPED
[INFO] ApacheDS Protocol Dns ............................. SKIPPED
[INFO] ApacheDS Protocol Kerberos ........................ SKIPPED
[INFO] ApacheDS Protocol Ldap ............................ SKIPPED
[INFO] ApacheDS Protocol Ntp ............................. SKIPPED
[INFO] Apacheds Server Annotations ....................... SKIPPED
[INFO] ApacheDS Server Config ............................ SKIPPED
[INFO] ApacheDS Server JNDI .............................. SKIPPED
[INFO] ApacheDS Test Framework ........................... SKIPPED
[INFO] ApacheDS All ...................................... SKIPPED
[INFO] ApacheDS Logger Interceptor ....................... SKIPPED
[INFO] ApacheDS Password Hashing Interceptor ............. SKIPPED
[INFO] ApacheDS Core Integration ......................... SKIPPED
[INFO] ApacheDS Protocol Kerberos Test ................... SKIPPED
[INFO] ApacheDS Server Integration ....................... SKIPPED
[INFO] ApacheDS DirectoryService-WebApp bridge ........... SKIPPED
[INFO] ApacheDS Jetty HTTP Server Integration ............ SKIPPED
[INFO] ApacheDS Service Builder .......................... SKIPPED
[INFO] Apache Directory LDAP Client API test ............. SKIPPED
[INFO] kerberos-client ................................... SKIPPED
[INFO] ApacheDS Service .................................. SKIPPED
[INFO] ApacheDS Wrapper .................................. SKIPPED
[INFO] ApacheDS Installers Maven Plugin .................. SKIPPED
[INFO] ApacheDS Installers ............................... SKIPPED
[INFO] ------------------------------------------------------------------------
[INFO] BUILD FAILURE
[INFO] ------------------------------------------------------------------------
[INFO] Total time: 1:37:31.955s
[INFO] Finished at: Fri Nov 08 08:00:25 UTC 2013
[INFO] Final Memory: 46M/380M
[INFO] ------------------------------------------------------------------------
[JENKINS] Archiving disabled
[JENKINS] Archiving disabled
[JENKINS] Archiving disabled
[JENKINS] Archiving disabled
[JENKINS] Archiving disabled
[JENKINS] Archiving disabled
[JENKINS] Archiving disabled
[JENKINS] Archiving disabled
[JENKINS] Archiving disabled
[JENKINS] Archiving disabled
[JENKINS] Archiving disabled
[JENKINS] Archiving disabled
[JENKINS] Archiving disabled
[JENKINS] Archiving disabled
[JENKINS] Archiving disabled
[JENKINS] Archiving disabled
[JENKINS] Archiving disabled
[JENKINS] Archiving disabled
[JENKINS] Archiving disabled
[JENKINS] Archiving disabled
[JENKINS] Archiving disabled
[JENKINS] Archiving disabled
[JENKINS] Archiving disabled
[JENKINS] Archiving disabled
[JENKINS] Archiving disabled
[JENKINS] Archiving disabled
[JENKINS] Archiving disabled
[JENKINS] Archiving disabled
[JENKINS] Archiving disabled
[JENKINS] Archiving disabled
[JENKINS] Archiving disabled
[JENKINS] Archiving disabled
[JENKINS] Archiving disabled
[JENKINS] Archiving disabled
[JENKINS] Archiving disabled
[JENKINS] Archiving disabled
[JENKINS] Archiving disabled
[JENKINS] Archiving disabled
[JENKINS] Archiving disabled
[JENKINS] Archiving disabled
[JENKINS] Archiving disabled
[JENKINS] Archiving disabled
[JENKINS] Archiving disabled
[JENKINS] Archiving disabled
[JENKINS] Archiving disabled
[JENKINS] Archiving disabled
[JENKINS] Archiving disabled
[JENKINS] Archiving disabled
[JENKINS] Archiving disabled
[JENKINS] Archiving disabled
[JENKINS] Archiving disabled
[JENKINS] Archiving disabled
[JENKINS] Archiving disabled
[JENKINS] Archiving disabled
[JENKINS] Archiving disabled
Waiting for Jenkins to finish collecting data
[ERROR] Failed to execute goal org.apache.maven.plugins:maven-compiler-plugin:3.1:compile
(default-compile) on project apacheds-mavibot-partition: Compilation failure: Compilation
failure:
[ERROR] <https://builds.apache.org/job/dir-apacheds-ubuntu-deploy/ws/trunk/mavibot-partition/src/main/java/org/apache/directory/server/core/partition/impl/btree/mavibot/MavibotTable.java>:[31,42]
cannot find symbol
[ERROR] symbol:   class TupleCursor
[ERROR] location: package org.apache.directory.mavibot.btree
[ERROR] <https://builds.apache.org/job/dir-apacheds-ubuntu-deploy/ws/trunk/mavibot-partition/src/main/java/org/apache/directory/server/core/partition/impl/btree/mavibot/MavibotTable.java>:[32,42]
cannot find symbol
[ERROR] symbol:   class ValueCursor
[ERROR] location: package org.apache.directory.mavibot.btree
[ERROR] <https://builds.apache.org/job/dir-apacheds-ubuntu-deploy/ws/trunk/mavibot-partition/src/main/java/org/apache/directory/server/core/partition/impl/btree/mavibot/MavibotTable.java>:[37,50]
cannot find symbol
[ERROR] symbol:   class ValueHolder
[ERROR] location: package org.apache.directory.mavibot.btree.managed
[ERROR] <https://builds.apache.org/job/dir-apacheds-ubuntu-deploy/ws/trunk/mavibot-partition/src/main/java/org/apache/directory/server/core/partition/impl/btree/mavibot/ValueTreeCursor.java>:[29,42]
cannot find symbol
[ERROR] symbol:   class ValueCursor
[ERROR] location: package org.apache.directory.mavibot.btree
[ERROR] <https://builds.apache.org/job/dir-apacheds-ubuntu-deploy/ws/trunk/mavibot-partition/src/main/java/org/apache/directory/server/core/partition/impl/btree/mavibot/ValueTreeCursor.java>:[41,13]
cannot find symbol
[ERROR] symbol:   class ValueCursor
[ERROR] location: class org.apache.directory.server.core.partition.impl.btree.mavibot.ValueTreeCursor<V>
[ERROR] <https://builds.apache.org/job/dir-apacheds-ubuntu-deploy/ws/trunk/mavibot-partition/src/main/java/org/apache/directory/server/core/partition/impl/btree/mavibot/ValueTreeCursor.java>:[49,29]
cannot find symbol
[ERROR] symbol:   class ValueCursor
[ERROR] location: class org.apache.directory.server.core.partition.impl.btree.mavibot.ValueTreeCursor<V>
[ERROR] <https://builds.apache.org/job/dir-apacheds-ubuntu-deploy/ws/trunk/mavibot-partition/src/main/java/org/apache/directory/server/core/partition/impl/btree/mavibot/KeyTupleArrayCursor.java>:[30,42]
cannot find symbol
[ERROR] symbol:   class ValueCursor
[ERROR] location: package org.apache.directory.mavibot.btree
[ERROR] <https://builds.apache.org/job/dir-apacheds-ubuntu-deploy/ws/trunk/mavibot-partition/src/main/java/org/apache/directory/server/core/partition/impl/btree/mavibot/KeyTupleArrayCursor.java>:[51,19]
cannot find symbol
[ERROR] symbol:   class ValueCursor
[ERROR] location: class org.apache.directory.server.core.partition.impl.btree.mavibot.KeyTupleArrayCursor<K,V>
[ERROR] <https://builds.apache.org/job/dir-apacheds-ubuntu-deploy/ws/trunk/mavibot-partition/src/main/java/org/apache/directory/server/core/partition/impl/btree/mavibot/KeyTupleArrayCursor.java>:[64,33]
cannot find symbol
[ERROR] symbol:   class ValueCursor
[ERROR] location: class org.apache.directory.server.core.partition.impl.btree.mavibot.KeyTupleArrayCursor<K,V>
[ERROR] <https://builds.apache.org/job/dir-apacheds-ubuntu-deploy/ws/trunk/mavibot-partition/src/main/java/org/apache/directory/server/core/partition/impl/btree/mavibot/MavibotCursor.java>:[29,42]
cannot find symbol
[ERROR] symbol:   class TupleCursor
[ERROR] location: package org.apache.directory.mavibot.btree
[ERROR] <https://builds.apache.org/job/dir-apacheds-ubuntu-deploy/ws/trunk/mavibot-partition/src/main/java/org/apache/directory/server/core/partition/impl/btree/mavibot/MavibotCursor.java>:[50,13]
cannot find symbol
[ERROR] symbol:   class TupleCursor
[ERROR] location: class org.apache.directory.server.core.partition.impl.btree.mavibot.MavibotCursor<K,V>
[ERROR] <https://builds.apache.org/job/dir-apacheds-ubuntu-deploy/ws/trunk/mavibot-partition/src/main/java/org/apache/directory/server/core/partition/impl/btree/mavibot/MavibotCursor.java>:[328,32]
cannot find symbol
[ERROR] symbol:   class TupleCursor
[ERROR] location: class org.apache.directory.server.core.partition.impl.btree.mavibot.MavibotCursor<K,V>
[ERROR] <https://builds.apache.org/job/dir-apacheds-ubuntu-deploy/ws/trunk/mavibot-partition/src/main/java/org/apache/directory/server/core/partition/impl/btree/mavibot/MavibotTable.java>:[134,9]
cannot find symbol
[ERROR] symbol:   class TupleCursor
[ERROR] location: class org.apache.directory.server.core.partition.impl.btree.mavibot.MavibotTable<K,V>
[ERROR] <https://builds.apache.org/job/dir-apacheds-ubuntu-deploy/ws/trunk/mavibot-partition/src/main/java/org/apache/directory/server/core/partition/impl/btree/mavibot/MavibotTable.java>:[155,9]
cannot find symbol
[ERROR] symbol:   class TupleCursor
[ERROR] location: class org.apache.directory.server.core.partition.impl.btree.mavibot.MavibotTable<K,V>
[ERROR] <https://builds.apache.org/job/dir-apacheds-ubuntu-deploy/ws/trunk/mavibot-partition/src/main/java/org/apache/directory/server/core/partition/impl/btree/mavibot/MavibotTable.java>:[211,9]
cannot find symbol
[ERROR] symbol:   class TupleCursor
[ERROR] location: class org.apache.directory.server.core.partition.impl.btree.mavibot.MavibotTable<K,V>
[ERROR] <https://builds.apache.org/job/dir-apacheds-ubuntu-deploy/ws/trunk/mavibot-partition/src/main/java/org/apache/directory/server/core/partition/impl/btree/mavibot/MavibotTable.java>:[220,13]
cannot find symbol
[ERROR] symbol:   class ValueCursor
[ERROR] location: class org.apache.directory.server.core.partition.impl.btree.mavibot.MavibotTable<K,V>
[ERROR] <https://builds.apache.org/job/dir-apacheds-ubuntu-deploy/ws/trunk/mavibot-partition/src/main/java/org/apache/directory/server/core/partition/impl/btree/mavibot/MavibotTable.java>:[258,9]
cannot find symbol
[ERROR] symbol:   class ValueCursor
[ERROR] location: class org.apache.directory.server.core.partition.impl.btree.mavibot.MavibotTable<K,V>
[ERROR] <https://builds.apache.org/job/dir-apacheds-ubuntu-deploy/ws/trunk/mavibot-partition/src/main/java/org/apache/directory/server/core/partition/impl/btree/mavibot/MavibotTable.java>:[323,13]
cannot find symbol
[ERROR] symbol:   class ValueCursor
[ERROR] location: class org.apache.directory.server.core.partition.impl.btree.mavibot.MavibotTable<K,V>
[ERROR] <https://builds.apache.org/job/dir-apacheds-ubuntu-deploy/ws/trunk/mavibot-partition/src/main/java/org/apache/directory/server/core/partition/impl/btree/mavibot/MavibotTable.java>:[396,17]
cannot find symbol
[ERROR] symbol:   class ValueCursor
[ERROR] location: class org.apache.directory.server.core.partition.impl.btree.mavibot.MavibotTable<K,V>
[ERROR] <https://builds.apache.org/job/dir-apacheds-ubuntu-deploy/ws/trunk/mavibot-partition/src/main/java/org/apache/directory/server/core/partition/impl/btree/mavibot/MavibotTable.java>:[430,17]
cannot find symbol
[ERROR] symbol:   class ValueCursor
[ERROR] location: class org.apache.directory.server.core.partition.impl.btree.mavibot.MavibotTable<K,V>
[ERROR] <https://builds.apache.org/job/dir-apacheds-ubuntu-deploy/ws/trunk/mavibot-partition/src/main/java/org/apache/directory/server/core/partition/impl/btree/mavibot/MavibotTable.java>:[458,17]
cannot find symbol
[ERROR] symbol:   class ValueCursor
[ERROR] location: class org.apache.directory.server.core.partition.impl.btree.mavibot.MavibotTable<K,V>
[ERROR] <https://builds.apache.org/job/dir-apacheds-ubuntu-deploy/ws/trunk/mavibot-partition/src/main/java/org/apache/directory/server/core/partition/impl/btree/mavibot/MavibotParentIdAndRdnSerializer.java>:[231,5]
method does not override or implement a method from a supertype
[ERROR] <https://builds.apache.org/job/dir-apacheds-ubuntu-deploy/ws/trunk/mavibot-partition/src/main/java/org/apache/directory/server/core/partition/impl/btree/mavibot/MavibotParentIdAndRdnSerializer.java>:[241,5]
method does not override or implement a method from a supertype
[ERROR] <https://builds.apache.org/job/dir-apacheds-ubuntu-deploy/ws/trunk/mavibot-partition/src/main/java/org/apache/directory/server/core/partition/impl/btree/mavibot/DnSerializer.java>:[166,5]
method does not override or implement a method from a supertype
[ERROR] <https://builds.apache.org/job/dir-apacheds-ubuntu-deploy/ws/trunk/mavibot-partition/src/main/java/org/apache/directory/server/core/partition/impl/btree/mavibot/DnSerializer.java>:[176,5]
method does not override or implement a method from a supertype
[ERROR] <https://builds.apache.org/job/dir-apacheds-ubuntu-deploy/ws/trunk/mavibot-partition/src/main/java/org/apache/directory/server/core/partition/impl/btree/mavibot/MavibotEntrySerializer.java>:[290,5]
method does not override or implement a method from a supertype
[ERROR] <https://builds.apache.org/job/dir-apacheds-ubuntu-deploy/ws/trunk/mavibot-partition/src/main/java/org/apache/directory/server/core/partition/impl/btree/mavibot/MavibotEntrySerializer.java>:[300,5]
method does not override or implement a method from a supertype
[ERROR] -> [Help 1]
[ERROR] 
[ERROR] To see the full stack trace of the errors, re-run Maven with the -e switch.
[ERROR] Re-run Maven using the -X switch to enable full debug logging.
[ERROR] 
[ERROR] For more information about the errors and possible solutions, please read the following
articles:
[ERROR] [Help 1] http://cwiki.apache.org/confluence/display/MAVEN/MojoFailureException
[ERROR] 
[ERROR] After correcting the problems, you can resume the build with the command
[ERROR]   mvn <goals> -rf :apacheds-mavibot-partition
Build timed out (after 120 minutes). Marking the build as aborted.
channel stopped

Mime
View raw message