directory-notifications mailing list archives

Site index · List index
Message view « Date » · « Thread »
Top « Date » · « Thread »
From Apache Jenkins Server <jenk...@builds.apache.org>
Subject Build failed in Jenkins: dir-apacheds-win #509
Date Tue, 17 Sep 2013 04:14:45 GMT
See <https://builds.apache.org/job/dir-apacheds-win/509/>

------------------------------------------
[...truncated 14554 lines...]
[INFO] Compiling 1 source file to F:\hudson\hudson-slave\workspace\dir-apacheds-win\trunk\service\target\test-classes
Sep 17, 2013 5:13:23 AM org.apache.maven.cli.event.ExecutionEventLogger mojoStarted
INFO: 
Sep 17, 2013 5:13:23 AM org.apache.maven.cli.event.ExecutionEventLogger mojoStarted
INFO: --- maven-surefire-plugin:2.15:test (default-test) @ apacheds-service ---
[INFO] Surefire report directory: F:\hudson\hudson-slave\workspace\dir-apacheds-win\trunk\service\target\surefire-reports

-------------------------------------------------------
 T E S T S
-------------------------------------------------------
Running org.apache.directory.server.UberJarMainTest
net.sf.ehcache.CacheException: java.io.FileNotFoundException: C:\Users\hudson\AppData\Local\Temp\1\ApacheDS-201381751324\cache\groupCache.data
(There is not enough space on the disk)
	at net.sf.ehcache.store.compound.factories.DiskStorageFactory.<init>(DiskStorageFactory.java:102)
	at net.sf.ehcache.store.compound.factories.DiskOverflowStorageFactory.<init>(DiskOverflowStorageFactory.java:71)
	at net.sf.ehcache.store.compound.impl.OverflowToDiskStore.create(OverflowToDiskStore.java:63)
	at net.sf.ehcache.Cache.initialise(Cache.java:1113)
	at net.sf.ehcache.CacheManager.addCacheNoCheck(CacheManager.java:1082)
	at net.sf.ehcache.CacheManager.addConfiguredCaches(CacheManager.java:657)
	at net.sf.ehcache.CacheManager.init(CacheManager.java:375)
	at net.sf.ehcache.CacheManager.<init>(CacheManager.java:228)
	at org.apache.directory.server.core.api.CacheService.initialize(CacheService.java:127)
	at org.apache.directory.server.ApacheDsService.start(ApacheDsService.java:167)
	at org.apache.directory.server.UberjarMain.start(UberjarMain.java:76)
	at org.apache.directory.server.UberJarMainTest.serviceInstanceTest(UberJarMainTest.java:98)
	at sun.reflect.NativeMethodAccessorImpl.invoke0(Native Method)
	at sun.reflect.NativeMethodAccessorImpl.invoke(NativeMethodAccessorImpl.java:57)
	at sun.reflect.DelegatingMethodAccessorImpl.invoke(DelegatingMethodAccessorImpl.java:43)
	at java.lang.reflect.Method.invoke(Method.java:601)
	at org.junit.runners.model.FrameworkMethod$1.runReflectiveCall(FrameworkMethod.java:47)
	at org.junit.internal.runners.model.ReflectiveCallable.run(ReflectiveCallable.java:12)
	at org.junit.runners.model.FrameworkMethod.invokeExplosively(FrameworkMethod.java:44)
	at org.junit.internal.runners.statements.InvokeMethod.evaluate(InvokeMethod.java:17)
	at org.junit.internal.runners.statements.RunBefores.evaluate(RunBefores.java:26)
	at org.junit.internal.runners.statements.RunAfters.evaluate(RunAfters.java:27)
	at org.junit.runners.ParentRunner.runLeaf(ParentRunner.java:271)
	at org.junit.runners.BlockJUnit4ClassRunner.runChild(BlockJUnit4ClassRunner.java:70)
	at org.junit.runners.BlockJUnit4ClassRunner.runChild(BlockJUnit4ClassRunner.java:50)
	at org.junit.runners.ParentRunner$3.run(ParentRunner.java:238)
	at org.junit.runners.ParentRunner$1.schedule(ParentRunner.java:63)
	at org.junit.runners.ParentRunner.runChildren(ParentRunner.java:236)
	at org.junit.runners.ParentRunner.access$000(ParentRunner.java:53)
	at org.junit.runners.ParentRunner$2.evaluate(ParentRunner.java:229)
	at org.junit.runners.ParentRunner.run(ParentRunner.java:309)
	at org.apache.maven.surefire.junit4.JUnit4Provider.execute(JUnit4Provider.java:264)
	at org.apache.maven.surefire.junit4.JUnit4Provider.executeTestSet(JUnit4Provider.java:153)
	at org.apache.maven.surefire.junit4.JUnit4Provider.invoke(JUnit4Provider.java:124)
	at org.apache.maven.surefire.booter.ForkedBooter.invokeProviderInSameClassLoader(ForkedBooter.java:200)
	at org.apache.maven.surefire.booter.ForkedBooter.runSuitesInProcess(ForkedBooter.java:153)
	at org.apache.maven.surefire.booter.ForkedBooter.main(ForkedBooter.java:103)
Caused by: java.io.FileNotFoundException: C:\Users\hudson\AppData\Local\Temp\1\ApacheDS-201381751324\cache\groupCache.data
(There is not enough space on the disk)
	at java.io.RandomAccessFile.open(Native Method)
	at java.io.RandomAccessFile.<init>(RandomAccessFile.java:233)
	at net.sf.ehcache.store.compound.factories.DiskStorageFactory.allocateRandomAccessFiles(DiskStorageFactory.java:130)
	at net.sf.ehcache.store.compound.factories.DiskStorageFactory.<init>(DiskStorageFactory.java:100)
	... 36 more

Results :

Tests run: 0, Failures: 0, Errors: 0, Skipped: 0

[JENKINS] Recording test results
Sep 17, 2013 5:13:24 AM org.apache.maven.cli.event.ExecutionEventLogger logReactorSummary
INFO: ------------------------------------------------------------------------
Sep 17, 2013 5:13:24 AM org.apache.maven.cli.event.ExecutionEventLogger logReactorSummary
INFO: Reactor Summary:
Sep 17, 2013 5:13:24 AM org.apache.maven.cli.event.ExecutionEventLogger logReactorSummary
INFO: 
Sep 17, 2013 5:13:24 AM org.apache.maven.cli.event.ExecutionEventLogger logReactorSummary
INFO: ApacheDS .......................................... SUCCESS [12.417s]
Sep 17, 2013 5:13:24 AM org.apache.maven.cli.event.ExecutionEventLogger logReactorSummary
INFO: ApacheDS I18n ..................................... SUCCESS [10.547s]
Sep 17, 2013 5:13:24 AM org.apache.maven.cli.event.ExecutionEventLogger logReactorSummary
INFO: ApacheDS Core Constants ........................... SUCCESS [6.230s]
Sep 17, 2013 5:13:24 AM org.apache.maven.cli.event.ExecutionEventLogger logReactorSummary
INFO: ApacheDS Core API ................................. SUCCESS [34.928s]
Sep 17, 2013 5:13:24 AM org.apache.maven.cli.event.ExecutionEventLogger logReactorSummary
INFO: ApacheDS Core Shared .............................. SUCCESS [6.159s]
Sep 17, 2013 5:13:24 AM org.apache.maven.cli.event.ExecutionEventLogger logReactorSummary
INFO: ApacheDS Interceptors ............................. SUCCESS [1.886s]
Sep 17, 2013 5:13:24 AM org.apache.maven.cli.event.ExecutionEventLogger logReactorSummary
INFO: ApacheDS AdministrativePoint Interceptor .......... SUCCESS [3.786s]
Sep 17, 2013 5:13:24 AM org.apache.maven.cli.event.ExecutionEventLogger logReactorSummary
INFO: ApacheDS Authentication Interceptor ............... SUCCESS [7.550s]
Sep 17, 2013 5:13:24 AM org.apache.maven.cli.event.ExecutionEventLogger logReactorSummary
INFO: ApacheDS Authorization Interceptor ................ SUCCESS [10.450s]
Sep 17, 2013 5:13:24 AM org.apache.maven.cli.event.ExecutionEventLogger logReactorSummary
INFO: ApacheDS ChangeLog Interceptor .................... SUCCESS [7.677s]
Sep 17, 2013 5:13:24 AM org.apache.maven.cli.event.ExecutionEventLogger logReactorSummary
INFO: ApacheDS Collective Attribute Interceptor ......... SUCCESS [3.638s]
Sep 17, 2013 5:13:24 AM org.apache.maven.cli.event.ExecutionEventLogger logReactorSummary
INFO: ApacheDS Event Interceptor ........................ SUCCESS [3.067s]
Sep 17, 2013 5:13:24 AM org.apache.maven.cli.event.ExecutionEventLogger logReactorSummary
INFO: ApacheDS Exception Interceptor .................... SUCCESS [3.418s]
Sep 17, 2013 5:13:24 AM org.apache.maven.cli.event.ExecutionEventLogger logReactorSummary
INFO: ApacheDS Journal Interceptor ...................... SUCCESS [3.189s]
Sep 17, 2013 5:13:24 AM org.apache.maven.cli.event.ExecutionEventLogger logReactorSummary
INFO: ApacheDS Normalization Interceptor ................ SUCCESS [6.090s]
Sep 17, 2013 5:13:24 AM org.apache.maven.cli.event.ExecutionEventLogger logReactorSummary
INFO: ApacheDS Operational Attribute Interceptor ........ SUCCESS [3.761s]
Sep 17, 2013 5:13:24 AM org.apache.maven.cli.event.ExecutionEventLogger logReactorSummary
INFO: ApacheDS Referral Interceptor ..................... SUCCESS [4.172s]
Sep 17, 2013 5:13:24 AM org.apache.maven.cli.event.ExecutionEventLogger logReactorSummary
INFO: ApacheDS Schema Interceptor ....................... SUCCESS [10.528s]
Sep 17, 2013 5:13:24 AM org.apache.maven.cli.event.ExecutionEventLogger logReactorSummary
INFO: ApacheDS Subtree Interceptor ...................... SUCCESS [23.189s]
Sep 17, 2013 5:13:24 AM org.apache.maven.cli.event.ExecutionEventLogger logReactorSummary
INFO: ApacheDS Triggers Interceptor ..................... SUCCESS [4.642s]
Sep 17, 2013 5:13:24 AM org.apache.maven.cli.event.ExecutionEventLogger logReactorSummary
INFO: ApacheDS Core ..................................... SUCCESS [10.146s]
Sep 17, 2013 5:13:24 AM org.apache.maven.cli.event.ExecutionEventLogger logReactorSummary
INFO: ApacheDS Core AVL ................................. SUCCESS [18.320s]
Sep 17, 2013 5:13:24 AM org.apache.maven.cli.event.ExecutionEventLogger logReactorSummary
INFO: ApacheDS Generalized (X) DBM Partition ............ SUCCESS [42.512s]
Sep 17, 2013 5:13:24 AM org.apache.maven.cli.event.ExecutionEventLogger logReactorSummary
INFO: ApacheDS LDIF Partition ........................... SUCCESS [19.371s]
Sep 17, 2013 5:13:24 AM org.apache.maven.cli.event.ExecutionEventLogger logReactorSummary
INFO: ApacheDS JDBM Partition ........................... SUCCESS [33.827s]
Sep 17, 2013 5:13:24 AM org.apache.maven.cli.event.ExecutionEventLogger logReactorSummary
INFO: ApacheDS Mavibot Partition ........................ SUCCESS [24.031s]
Sep 17, 2013 5:13:24 AM org.apache.maven.cli.event.ExecutionEventLogger logReactorSummary
INFO: ApacheDS Core Annotations ......................... SUCCESS [17.146s]
Sep 17, 2013 5:13:24 AM org.apache.maven.cli.event.ExecutionEventLogger logReactorSummary
INFO: ApacheDS Core JNDI ................................ SUCCESS [11.707s]
Sep 17, 2013 5:13:24 AM org.apache.maven.cli.event.ExecutionEventLogger logReactorSummary
INFO: ApacheDS Protocol Kerberos Codec .................. SUCCESS [1:03.018s]
Sep 17, 2013 5:13:24 AM org.apache.maven.cli.event.ExecutionEventLogger logReactorSummary
INFO: ApacheDS Interceptors for Kerberos ................ SUCCESS [4.764s]
Sep 17, 2013 5:13:24 AM org.apache.maven.cli.event.ExecutionEventLogger logReactorSummary
INFO: ApacheDS Protocol Dhcp ............................ SUCCESS [6.910s]
Sep 17, 2013 5:13:24 AM org.apache.maven.cli.event.ExecutionEventLogger logReactorSummary
INFO: ApacheDS Protocol Shared .......................... SUCCESS [5.178s]
Sep 17, 2013 5:13:24 AM org.apache.maven.cli.event.ExecutionEventLogger logReactorSummary
INFO: ApacheDS Protocol Dns ............................. SUCCESS [8.495s]
Sep 17, 2013 5:13:24 AM org.apache.maven.cli.event.ExecutionEventLogger logReactorSummary
INFO: ApacheDS Protocol Kerberos ........................ SUCCESS [10.438s]
Sep 17, 2013 5:13:24 AM org.apache.maven.cli.event.ExecutionEventLogger logReactorSummary
INFO: ApacheDS Protocol Ldap ............................ SUCCESS [17.732s]
Sep 17, 2013 5:13:24 AM org.apache.maven.cli.event.ExecutionEventLogger logReactorSummary
INFO: ApacheDS Protocol Ntp ............................. SUCCESS [4.761s]
Sep 17, 2013 5:13:24 AM org.apache.maven.cli.event.ExecutionEventLogger logReactorSummary
INFO: Apacheds Server Annotations ....................... SUCCESS [9.030s]
Sep 17, 2013 5:13:24 AM org.apache.maven.cli.event.ExecutionEventLogger logReactorSummary
INFO: ApacheDS Server Config ............................ SUCCESS [6.517s]
Sep 17, 2013 5:13:24 AM org.apache.maven.cli.event.ExecutionEventLogger logReactorSummary
INFO: ApacheDS Server JNDI .............................. SUCCESS [5.562s]
Sep 17, 2013 5:13:24 AM org.apache.maven.cli.event.ExecutionEventLogger logReactorSummary
INFO: ApacheDS Test Framework ........................... SUCCESS [8.184s]
Sep 17, 2013 5:13:24 AM org.apache.maven.cli.event.ExecutionEventLogger logReactorSummary
INFO: ApacheDS All ...................................... SUCCESS [7.842s]
Sep 17, 2013 5:13:24 AM org.apache.maven.cli.event.ExecutionEventLogger logReactorSummary
INFO: ApacheDS Logger Interceptor ....................... SUCCESS [5.080s]
Sep 17, 2013 5:13:24 AM org.apache.maven.cli.event.ExecutionEventLogger logReactorSummary
INFO: ApacheDS Password Hashing Interceptor ............. SUCCESS [3.418s]
Sep 17, 2013 5:13:24 AM org.apache.maven.cli.event.ExecutionEventLogger logReactorSummary
INFO: ApacheDS Core Integration ......................... SUCCESS [14.417s]
Sep 17, 2013 5:13:24 AM org.apache.maven.cli.event.ExecutionEventLogger logReactorSummary
INFO: ApacheDS Protocol Kerberos Test ................... SUCCESS [5.934s]
Sep 17, 2013 5:13:24 AM org.apache.maven.cli.event.ExecutionEventLogger logReactorSummary
INFO: ApacheDS Server Integration ....................... SUCCESS [17.768s]
Sep 17, 2013 5:13:24 AM org.apache.maven.cli.event.ExecutionEventLogger logReactorSummary
INFO: ApacheDS DirectoryService-WebApp bridge ........... SUCCESS [3.848s]
Sep 17, 2013 5:13:24 AM org.apache.maven.cli.event.ExecutionEventLogger logReactorSummary
INFO: ApacheDS Jetty HTTP Server Integration ............ SUCCESS [4.538s]
Sep 17, 2013 5:13:24 AM org.apache.maven.cli.event.ExecutionEventLogger logReactorSummary
INFO: ApacheDS Service Builder .......................... SUCCESS [3.579s]
Sep 17, 2013 5:13:24 AM org.apache.maven.cli.event.ExecutionEventLogger logReactorSummary
INFO: Apache Directory LDAP Client API test ............. SUCCESS [8.051s]
Sep 17, 2013 5:13:24 AM org.apache.maven.cli.event.ExecutionEventLogger logReactorSummary
INFO: kerberos-client ................................... SUCCESS [6.023s]
Sep 17, 2013 5:13:24 AM org.apache.maven.cli.event.ExecutionEventLogger logReactorSummary
INFO: ApacheDS Service .................................. FAILURE [5.128s]
Sep 17, 2013 5:13:24 AM org.apache.maven.cli.event.ExecutionEventLogger logReactorSummary
INFO: ApacheDS Wrapper .................................. SKIPPED
Sep 17, 2013 5:13:24 AM org.apache.maven.cli.event.ExecutionEventLogger logReactorSummary
INFO: ApacheDS Installers Maven Plugin .................. SKIPPED
Sep 17, 2013 5:13:24 AM org.apache.maven.cli.event.ExecutionEventLogger logReactorSummary
INFO: ApacheDS Installers ............................... SKIPPED
Sep 17, 2013 5:13:24 AM org.apache.maven.cli.event.ExecutionEventLogger logResult
INFO: ------------------------------------------------------------------------
Sep 17, 2013 5:13:24 AM org.apache.maven.cli.event.ExecutionEventLogger logResult
INFO: BUILD FAILURE
Sep 17, 2013 5:13:24 AM org.apache.maven.cli.event.ExecutionEventLogger logStats
INFO: ------------------------------------------------------------------------
Sep 17, 2013 5:13:24 AM org.apache.maven.cli.event.ExecutionEventLogger logStats
INFO: Total time: 9:57.109s
Sep 17, 2013 5:13:24 AM org.apache.maven.cli.event.ExecutionEventLogger logStats
INFO: Finished at: Tue Sep 17 05:13:24 BST 2013
Sep 17, 2013 5:13:25 AM org.apache.maven.cli.event.ExecutionEventLogger logStats
INFO: Final Memory: 97M/279M
Sep 17, 2013 5:13:25 AM org.apache.maven.cli.event.ExecutionEventLogger sessionEnded
INFO: ------------------------------------------------------------------------
[JENKINS] Archiving disabled
[JENKINS] Archiving disabled
[JENKINS] Archiving disabled
[JENKINS] Archiving disabled
[JENKINS] Archiving disabled
[JENKINS] Archiving disabled
[JENKINS] Archiving disabled
[JENKINS] Archiving disabled
[JENKINS] Archiving disabled
[JENKINS] Archiving disabled
[JENKINS] Archiving disabled
[JENKINS] Archiving disabled
[JENKINS] Archiving disabled
[JENKINS] Archiving disabled
[JENKINS] Archiving disabled
[JENKINS] Archiving disabled
[JENKINS] Archiving disabled
[JENKINS] Archiving disabled
[JENKINS] Archiving disabled
[JENKINS] Archiving disabled
[JENKINS] Archiving disabled
[JENKINS] Archiving disabled
[JENKINS] Archiving disabled
[JENKINS] Archiving disabled
[JENKINS] Archiving disabled
[JENKINS] Archiving disabled
[JENKINS] Archiving disabled
[JENKINS] Archiving disabled
[JENKINS] Archiving disabled
[JENKINS] Archiving disabled
[JENKINS] Archiving disabled
[JENKINS] Archiving disabled
[JENKINS] Archiving disabled
[JENKINS] Archiving disabled
[JENKINS] Archiving disabled
[JENKINS] Archiving disabled
[JENKINS] Archiving disabled
[JENKINS] Archiving disabled
[JENKINS] Archiving disabled
[JENKINS] Archiving disabled
[JENKINS] Archiving disabled
[JENKINS] Archiving disabled
[JENKINS] Archiving disabled
[JENKINS] Archiving disabled
[JENKINS] Archiving disabled
[JENKINS] Archiving disabled
[JENKINS] Archiving disabled
[JENKINS] Archiving disabled
[JENKINS] Archiving disabled
[JENKINS] Archiving disabled
[JENKINS] Archiving disabled
[JENKINS] Archiving disabled
[JENKINS] Archiving disabled
[JENKINS] Archiving disabled
[JENKINS] Archiving disabled
Waiting for Jenkins to finish collecting data
Maven failed with error.
channel stopped

Mime
View raw message