directory-notifications mailing list archives

Site index · List index
Message view « Date » · « Thread »
Top « Date » · « Thread »
From Apache Jenkins Server <jenk...@builds.apache.org>
Subject Build failed in Jenkins: dir-apacheds-win #508
Date Mon, 16 Sep 2013 20:50:02 GMT
See <https://builds.apache.org/job/dir-apacheds-win/508/changes>

Changes:

[pamarcelot] Removed useless generic types.

[pamarcelot] Added missing method to clear the list of partitions.

------------------------------------------
[...truncated 14597 lines...]
[INFO] Compiling 1 source file to F:\hudson\hudson-slave\workspace\dir-apacheds-win\trunk\service\target\test-classes
Sep 16, 2013 9:49:43 PM org.apache.maven.cli.event.ExecutionEventLogger mojoStarted
INFO: 
Sep 16, 2013 9:49:43 PM org.apache.maven.cli.event.ExecutionEventLogger mojoStarted
INFO: --- maven-surefire-plugin:2.15:test (default-test) @ apacheds-service ---
[INFO] Surefire report directory: F:\hudson\hudson-slave\workspace\dir-apacheds-win\trunk\service\target\surefire-reports

-------------------------------------------------------
 T E S T S
-------------------------------------------------------
Running org.apache.directory.server.UberJarMainTest
net.sf.ehcache.CacheException: java.io.FileNotFoundException: C:\Users\hudson\AppData\Local\Temp\1\ApacheDS-201381694943\cache\changePwdReplayCache.data
(There is not enough space on the disk)
	at net.sf.ehcache.store.compound.factories.DiskStorageFactory.<init>(DiskStorageFactory.java:102)
	at net.sf.ehcache.store.compound.factories.DiskOverflowStorageFactory.<init>(DiskOverflowStorageFactory.java:71)
	at net.sf.ehcache.store.compound.impl.OverflowToDiskStore.create(OverflowToDiskStore.java:63)
	at net.sf.ehcache.Cache.initialise(Cache.java:1113)
	at net.sf.ehcache.CacheManager.addCacheNoCheck(CacheManager.java:1082)
	at net.sf.ehcache.CacheManager.addConfiguredCaches(CacheManager.java:657)
	at net.sf.ehcache.CacheManager.init(CacheManager.java:375)
	at net.sf.ehcache.CacheManager.<init>(CacheManager.java:228)
	at org.apache.directory.server.core.api.CacheService.initialize(CacheService.java:127)
	at org.apache.directory.server.ApacheDsService.start(ApacheDsService.java:167)
	at org.apache.directory.server.UberjarMain.start(UberjarMain.java:76)
	at org.apache.directory.server.UberJarMainTest.serviceInstanceTest(UberJarMainTest.java:98)
	at sun.reflect.NativeMethodAccessorImpl.invoke0(Native Method)
	at sun.reflect.NativeMethodAccessorImpl.invoke(NativeMethodAccessorImpl.java:57)
	at sun.reflect.DelegatingMethodAccessorImpl.invoke(DelegatingMethodAccessorImpl.java:43)
	at java.lang.reflect.Method.invoke(Method.java:601)
	at org.junit.runners.model.FrameworkMethod$1.runReflectiveCall(FrameworkMethod.java:47)
	at org.junit.internal.runners.model.ReflectiveCallable.run(ReflectiveCallable.java:12)
	at org.junit.runners.model.FrameworkMethod.invokeExplosively(FrameworkMethod.java:44)
	at org.junit.internal.runners.statements.InvokeMethod.evaluate(InvokeMethod.java:17)
	at org.junit.internal.runners.statements.RunBefores.evaluate(RunBefores.java:26)
	at org.junit.internal.runners.statements.RunAfters.evaluate(RunAfters.java:27)
	at org.junit.runners.ParentRunner.runLeaf(ParentRunner.java:271)
	at org.junit.runners.BlockJUnit4ClassRunner.runChild(BlockJUnit4ClassRunner.java:70)
	at org.junit.runners.BlockJUnit4ClassRunner.runChild(BlockJUnit4ClassRunner.java:50)
	at org.junit.runners.ParentRunner$3.run(ParentRunner.java:238)
	at org.junit.runners.ParentRunner$1.schedule(ParentRunner.java:63)
	at org.junit.runners.ParentRunner.runChildren(ParentRunner.java:236)
	at org.junit.runners.ParentRunner.access$000(ParentRunner.java:53)
	at org.junit.runners.ParentRunner$2.evaluate(ParentRunner.java:229)
	at org.junit.runners.ParentRunner.run(ParentRunner.java:309)
	at org.apache.maven.surefire.junit4.JUnit4Provider.execute(JUnit4Provider.java:264)
	at org.apache.maven.surefire.junit4.JUnit4Provider.executeTestSet(JUnit4Provider.java:153)
	at org.apache.maven.surefire.junit4.JUnit4Provider.invoke(JUnit4Provider.java:124)
	at org.apache.maven.surefire.booter.ForkedBooter.invokeProviderInSameClassLoader(ForkedBooter.java:200)
	at org.apache.maven.surefire.booter.ForkedBooter.runSuitesInProcess(ForkedBooter.java:153)
	at org.apache.maven.surefire.booter.ForkedBooter.main(ForkedBooter.java:103)
Caused by: java.io.FileNotFoundException: C:\Users\hudson\AppData\Local\Temp\1\ApacheDS-201381694943\cache\changePwdReplayCache.data
(There is not enough space on the disk)
	at java.io.RandomAccessFile.open(Native Method)
	at java.io.RandomAccessFile.<init>(RandomAccessFile.java:233)
	at net.sf.ehcache.store.compound.factories.DiskStorageFactory.allocateRandomAccessFiles(DiskStorageFactory.java:130)
	at net.sf.ehcache.store.compound.factories.DiskStorageFactory.<init>(DiskStorageFactory.java:100)
	... 36 more

Results :

Tests run: 0, Failures: 0, Errors: 0, Skipped: 0

[JENKINS] Recording test results
Sep 16, 2013 9:49:44 PM org.apache.maven.cli.event.ExecutionEventLogger logReactorSummary
INFO: ------------------------------------------------------------------------
Sep 16, 2013 9:49:44 PM org.apache.maven.cli.event.ExecutionEventLogger logReactorSummary
INFO: Reactor Summary:
Sep 16, 2013 9:49:44 PM org.apache.maven.cli.event.ExecutionEventLogger logReactorSummary
INFO: 
Sep 16, 2013 9:49:44 PM org.apache.maven.cli.event.ExecutionEventLogger logReactorSummary
INFO: ApacheDS .......................................... SUCCESS [19.262s]
Sep 16, 2013 9:49:44 PM org.apache.maven.cli.event.ExecutionEventLogger logReactorSummary
INFO: ApacheDS I18n ..................................... SUCCESS [22.565s]
Sep 16, 2013 9:49:44 PM org.apache.maven.cli.event.ExecutionEventLogger logReactorSummary
INFO: ApacheDS Core Constants ........................... SUCCESS [3.786s]
Sep 16, 2013 9:49:44 PM org.apache.maven.cli.event.ExecutionEventLogger logReactorSummary
INFO: ApacheDS Core API ................................. SUCCESS [39.564s]
Sep 16, 2013 9:49:44 PM org.apache.maven.cli.event.ExecutionEventLogger logReactorSummary
INFO: ApacheDS Core Shared .............................. SUCCESS [10.365s]
Sep 16, 2013 9:49:44 PM org.apache.maven.cli.event.ExecutionEventLogger logReactorSummary
INFO: ApacheDS Interceptors ............................. SUCCESS [1.680s]
Sep 16, 2013 9:49:44 PM org.apache.maven.cli.event.ExecutionEventLogger logReactorSummary
INFO: ApacheDS AdministrativePoint Interceptor .......... SUCCESS [3.509s]
Sep 16, 2013 9:49:44 PM org.apache.maven.cli.event.ExecutionEventLogger logReactorSummary
INFO: ApacheDS Authentication Interceptor ............... SUCCESS [8.021s]
Sep 16, 2013 9:49:44 PM org.apache.maven.cli.event.ExecutionEventLogger logReactorSummary
INFO: ApacheDS Authorization Interceptor ................ SUCCESS [14.225s]
Sep 16, 2013 9:49:44 PM org.apache.maven.cli.event.ExecutionEventLogger logReactorSummary
INFO: ApacheDS ChangeLog Interceptor .................... SUCCESS [11.708s]
Sep 16, 2013 9:49:44 PM org.apache.maven.cli.event.ExecutionEventLogger logReactorSummary
INFO: ApacheDS Collective Attribute Interceptor ......... SUCCESS [5.225s]
Sep 16, 2013 9:49:44 PM org.apache.maven.cli.event.ExecutionEventLogger logReactorSummary
INFO: ApacheDS Event Interceptor ........................ SUCCESS [2.893s]
Sep 16, 2013 9:49:44 PM org.apache.maven.cli.event.ExecutionEventLogger logReactorSummary
INFO: ApacheDS Exception Interceptor .................... SUCCESS [2.876s]
Sep 16, 2013 9:49:44 PM org.apache.maven.cli.event.ExecutionEventLogger logReactorSummary
INFO: ApacheDS Journal Interceptor ...................... SUCCESS [3.358s]
Sep 16, 2013 9:49:44 PM org.apache.maven.cli.event.ExecutionEventLogger logReactorSummary
INFO: ApacheDS Normalization Interceptor ................ SUCCESS [6.005s]
Sep 16, 2013 9:49:44 PM org.apache.maven.cli.event.ExecutionEventLogger logReactorSummary
INFO: ApacheDS Operational Attribute Interceptor ........ SUCCESS [4.045s]
Sep 16, 2013 9:49:44 PM org.apache.maven.cli.event.ExecutionEventLogger logReactorSummary
INFO: ApacheDS Referral Interceptor ..................... SUCCESS [5.170s]
Sep 16, 2013 9:49:44 PM org.apache.maven.cli.event.ExecutionEventLogger logReactorSummary
INFO: ApacheDS Schema Interceptor ....................... SUCCESS [12.999s]
Sep 16, 2013 9:49:44 PM org.apache.maven.cli.event.ExecutionEventLogger logReactorSummary
INFO: ApacheDS Subtree Interceptor ...................... SUCCESS [14.633s]
Sep 16, 2013 9:49:44 PM org.apache.maven.cli.event.ExecutionEventLogger logReactorSummary
INFO: ApacheDS Triggers Interceptor ..................... SUCCESS [3.761s]
Sep 16, 2013 9:49:44 PM org.apache.maven.cli.event.ExecutionEventLogger logReactorSummary
INFO: ApacheDS Core ..................................... SUCCESS [10.104s]
Sep 16, 2013 9:49:44 PM org.apache.maven.cli.event.ExecutionEventLogger logReactorSummary
INFO: ApacheDS Core AVL ................................. SUCCESS [22.939s]
Sep 16, 2013 9:49:44 PM org.apache.maven.cli.event.ExecutionEventLogger logReactorSummary
INFO: ApacheDS Generalized (X) DBM Partition ............ SUCCESS [43.392s]
Sep 16, 2013 9:49:44 PM org.apache.maven.cli.event.ExecutionEventLogger logReactorSummary
INFO: ApacheDS LDIF Partition ........................... SUCCESS [26.068s]
Sep 16, 2013 9:49:44 PM org.apache.maven.cli.event.ExecutionEventLogger logReactorSummary
INFO: ApacheDS JDBM Partition ........................... SUCCESS [59.655s]
Sep 16, 2013 9:49:44 PM org.apache.maven.cli.event.ExecutionEventLogger logReactorSummary
INFO: ApacheDS Mavibot Partition ........................ SUCCESS [28.823s]
Sep 16, 2013 9:49:44 PM org.apache.maven.cli.event.ExecutionEventLogger logReactorSummary
INFO: ApacheDS Core Annotations ......................... SUCCESS [10.290s]
Sep 16, 2013 9:49:44 PM org.apache.maven.cli.event.ExecutionEventLogger logReactorSummary
INFO: ApacheDS Core JNDI ................................ SUCCESS [6.853s]
Sep 16, 2013 9:49:44 PM org.apache.maven.cli.event.ExecutionEventLogger logReactorSummary
INFO: ApacheDS Protocol Kerberos Codec .................. SUCCESS [35.477s]
Sep 16, 2013 9:49:44 PM org.apache.maven.cli.event.ExecutionEventLogger logReactorSummary
INFO: ApacheDS Interceptors for Kerberos ................ SUCCESS [5.441s]
Sep 16, 2013 9:49:44 PM org.apache.maven.cli.event.ExecutionEventLogger logReactorSummary
INFO: ApacheDS Protocol Dhcp ............................ SUCCESS [12.756s]
Sep 16, 2013 9:49:44 PM org.apache.maven.cli.event.ExecutionEventLogger logReactorSummary
INFO: ApacheDS Protocol Shared .......................... SUCCESS [27.610s]
Sep 16, 2013 9:49:44 PM org.apache.maven.cli.event.ExecutionEventLogger logReactorSummary
INFO: ApacheDS Protocol Dns ............................. SUCCESS [8.171s]
Sep 16, 2013 9:49:44 PM org.apache.maven.cli.event.ExecutionEventLogger logReactorSummary
INFO: ApacheDS Protocol Kerberos ........................ SUCCESS [10.184s]
Sep 16, 2013 9:49:44 PM org.apache.maven.cli.event.ExecutionEventLogger logReactorSummary
INFO: ApacheDS Protocol Ldap ............................ SUCCESS [18.311s]
Sep 16, 2013 9:49:44 PM org.apache.maven.cli.event.ExecutionEventLogger logReactorSummary
INFO: ApacheDS Protocol Ntp ............................. SUCCESS [5.663s]
Sep 16, 2013 9:49:44 PM org.apache.maven.cli.event.ExecutionEventLogger logReactorSummary
INFO: Apacheds Server Annotations ....................... SUCCESS [8.325s]
Sep 16, 2013 9:49:44 PM org.apache.maven.cli.event.ExecutionEventLogger logReactorSummary
INFO: ApacheDS Server Config ............................ SUCCESS [13.691s]
Sep 16, 2013 9:49:44 PM org.apache.maven.cli.event.ExecutionEventLogger logReactorSummary
INFO: ApacheDS Server JNDI .............................. SUCCESS [4.949s]
Sep 16, 2013 9:49:44 PM org.apache.maven.cli.event.ExecutionEventLogger logReactorSummary
INFO: ApacheDS Test Framework ........................... SUCCESS [14.671s]
Sep 16, 2013 9:49:44 PM org.apache.maven.cli.event.ExecutionEventLogger logReactorSummary
INFO: ApacheDS All ...................................... SUCCESS [11.451s]
Sep 16, 2013 9:49:44 PM org.apache.maven.cli.event.ExecutionEventLogger logReactorSummary
INFO: ApacheDS Logger Interceptor ....................... SUCCESS [4.171s]
Sep 16, 2013 9:49:44 PM org.apache.maven.cli.event.ExecutionEventLogger logReactorSummary
INFO: ApacheDS Password Hashing Interceptor ............. SUCCESS [4.618s]
Sep 16, 2013 9:49:44 PM org.apache.maven.cli.event.ExecutionEventLogger logReactorSummary
INFO: ApacheDS Core Integration ......................... SUCCESS [27.069s]
Sep 16, 2013 9:49:44 PM org.apache.maven.cli.event.ExecutionEventLogger logReactorSummary
INFO: ApacheDS Protocol Kerberos Test ................... SUCCESS [8.393s]
Sep 16, 2013 9:49:44 PM org.apache.maven.cli.event.ExecutionEventLogger logReactorSummary
INFO: ApacheDS Server Integration ....................... SUCCESS [35.055s]
Sep 16, 2013 9:49:44 PM org.apache.maven.cli.event.ExecutionEventLogger logReactorSummary
INFO: ApacheDS DirectoryService-WebApp bridge ........... SUCCESS [3.935s]
Sep 16, 2013 9:49:44 PM org.apache.maven.cli.event.ExecutionEventLogger logReactorSummary
INFO: ApacheDS Jetty HTTP Server Integration ............ SUCCESS [5.152s]
Sep 16, 2013 9:49:44 PM org.apache.maven.cli.event.ExecutionEventLogger logReactorSummary
INFO: ApacheDS Service Builder .......................... SUCCESS [4.628s]
Sep 16, 2013 9:49:44 PM org.apache.maven.cli.event.ExecutionEventLogger logReactorSummary
INFO: Apache Directory LDAP Client API test ............. SUCCESS [7.868s]
Sep 16, 2013 9:49:44 PM org.apache.maven.cli.event.ExecutionEventLogger logReactorSummary
INFO: kerberos-client ................................... SUCCESS [4.967s]
Sep 16, 2013 9:49:44 PM org.apache.maven.cli.event.ExecutionEventLogger logReactorSummary
INFO: ApacheDS Service .................................. FAILURE [3.726s]
Sep 16, 2013 9:49:44 PM org.apache.maven.cli.event.ExecutionEventLogger logReactorSummary
INFO: ApacheDS Wrapper .................................. SKIPPED
Sep 16, 2013 9:49:44 PM org.apache.maven.cli.event.ExecutionEventLogger logReactorSummary
INFO: ApacheDS Installers Maven Plugin .................. SKIPPED
Sep 16, 2013 9:49:44 PM org.apache.maven.cli.event.ExecutionEventLogger logReactorSummary
INFO: ApacheDS Installers ............................... SKIPPED
Sep 16, 2013 9:49:44 PM org.apache.maven.cli.event.ExecutionEventLogger logResult
INFO: ------------------------------------------------------------------------
Sep 16, 2013 9:49:44 PM org.apache.maven.cli.event.ExecutionEventLogger logResult
INFO: BUILD FAILURE
Sep 16, 2013 9:49:44 PM org.apache.maven.cli.event.ExecutionEventLogger logStats
INFO: ------------------------------------------------------------------------
Sep 16, 2013 9:49:44 PM org.apache.maven.cli.event.ExecutionEventLogger logStats
INFO: Total time: 11:48.347s
Sep 16, 2013 9:49:44 PM org.apache.maven.cli.event.ExecutionEventLogger logStats
INFO: Finished at: Mon Sep 16 21:49:44 BST 2013
Sep 16, 2013 9:49:44 PM org.apache.maven.cli.event.ExecutionEventLogger logStats
INFO: Final Memory: 95M/261M
Sep 16, 2013 9:49:44 PM org.apache.maven.cli.event.ExecutionEventLogger sessionEnded
INFO: ------------------------------------------------------------------------
[JENKINS] Archiving disabled
[JENKINS] Archiving disabled
[JENKINS] Archiving disabled
[JENKINS] Archiving disabled
[JENKINS] Archiving disabled
[JENKINS] Archiving disabled
[JENKINS] Archiving disabled
[JENKINS] Archiving disabled
[JENKINS] Archiving disabled
[JENKINS] Archiving disabled
[JENKINS] Archiving disabled
[JENKINS] Archiving disabled
[JENKINS] Archiving disabled
[JENKINS] Archiving disabled
[JENKINS] Archiving disabled
[JENKINS] Archiving disabled
[JENKINS] Archiving disabled
[JENKINS] Archiving disabled
[JENKINS] Archiving disabled
[JENKINS] Archiving disabled
[JENKINS] Archiving disabled
[JENKINS] Archiving disabled
[JENKINS] Archiving disabled
[JENKINS] Archiving disabled
[JENKINS] Archiving disabled
[JENKINS] Archiving disabled
[JENKINS] Archiving disabled
[JENKINS] Archiving disabled
[JENKINS] Archiving disabled
[JENKINS] Archiving disabled
[JENKINS] Archiving disabled
[JENKINS] Archiving disabled
[JENKINS] Archiving disabled
[JENKINS] Archiving disabled
[JENKINS] Archiving disabled
[JENKINS] Archiving disabled
[JENKINS] Archiving disabled
[JENKINS] Archiving disabled
[JENKINS] Archiving disabled
[JENKINS] Archiving disabled
[JENKINS] Archiving disabled
[JENKINS] Archiving disabled
[JENKINS] Archiving disabled
[JENKINS] Archiving disabled
[JENKINS] Archiving disabled
[JENKINS] Archiving disabled
[JENKINS] Archiving disabled
[JENKINS] Archiving disabled
[JENKINS] Archiving disabled
[JENKINS] Archiving disabled
[JENKINS] Archiving disabled
[JENKINS] Archiving disabled
[JENKINS] Archiving disabled
[JENKINS] Archiving disabled
[JENKINS] Archiving disabled
Waiting for Jenkins to finish collecting data
Maven failed with error.
channel stopped

Mime
View raw message