directory-notifications mailing list archives

Site index · List index
Message view « Date » · « Thread »
Top « Date » · « Thread »
From Apache Jenkins Server <jenk...@builds.apache.org>
Subject Build failed in Jenkins: dir-apacheds-ubuntu-deploy #1120
Date Wed, 18 Sep 2013 05:46:19 GMT
See <https://builds.apache.org/job/dir-apacheds-ubuntu-deploy/1120/changes>

Changes:

[kayyagari] tests for all the password hashing interceptors

[kayyagari] support for PKCS5S2 hashing mechanism (DIRSERVER-1898)

[kayyagari] replace the plain text password with the hashed password (DIRSERVER-1900)

------------------------------------------
[...truncated 5986 lines...]
Running org.apache.directory.server.operations.ldapsdk.BindIT
Tests run: 5, Failures: 0, Errors: 0, Skipped: 0, Time elapsed: 16.165 sec - in org.apache.directory.server.operations.ldapsdk.BindIT
Running org.apache.directory.server.operations.ldapsdk.ModifyDnReferralIT
Tests run: 7, Failures: 0, Errors: 0, Skipped: 0, Time elapsed: 29.247 sec - in org.apache.directory.server.operations.ldapsdk.ModifyDnReferralIT
Running org.apache.directory.server.operations.ldapsdk.IllegalModificationIT
Tests run: 2, Failures: 0, Errors: 0, Skipped: 0, Time elapsed: 12.199 sec - in org.apache.directory.server.operations.ldapsdk.IllegalModificationIT
Running org.apache.directory.server.operations.ldapsdk.AddIT
Tests run: 30, Failures: 0, Errors: 0, Skipped: 0, Time elapsed: 101.357 sec - in org.apache.directory.server.operations.ldapsdk.AddIT
Running org.apache.directory.server.operations.ldapsdk.CompareIT
Tests run: 7, Failures: 0, Errors: 0, Skipped: 0, Time elapsed: 15.837 sec - in org.apache.directory.server.operations.ldapsdk.CompareIT
Running org.apache.directory.server.operations.ldapsdk.ModifyReferralIT
Tests run: 4, Failures: 0, Errors: 0, Skipped: 0, Time elapsed: 18.603 sec - in org.apache.directory.server.operations.ldapsdk.ModifyReferralIT
Running org.apache.directory.server.operations.ldapsdk.DeleteIT
Tests run: 8, Failures: 0, Errors: 0, Skipped: 0, Time elapsed: 15.815 sec - in org.apache.directory.server.operations.ldapsdk.DeleteIT
Running org.apache.directory.server.operations.delete.DeleteAliasIT
Tests run: 2, Failures: 0, Errors: 0, Skipped: 0, Time elapsed: 19.144 sec - in org.apache.directory.server.operations.delete.DeleteAliasIT
Running org.apache.directory.server.operations.delete.DeleteIT
Tests run: 8, Failures: 0, Errors: 0, Skipped: 0, Time elapsed: 16.357 sec - in org.apache.directory.server.operations.delete.DeleteIT
Running org.apache.directory.server.ssl.StartTlsUpdateCertificateIT
Tests run: 1, Failures: 0, Errors: 0, Skipped: 0, Time elapsed: 20.079 sec - in org.apache.directory.server.ssl.StartTlsUpdateCertificateIT
Running org.apache.directory.server.ssl.StartTlsConfidentialityIT
Tests run: 1, Failures: 0, Errors: 0, Skipped: 0, Time elapsed: 12.036 sec - in org.apache.directory.server.ssl.StartTlsConfidentialityIT
Running org.apache.directory.server.ssl.LdapsIT
Tests run: 1, Failures: 0, Errors: 0, Skipped: 0, Time elapsed: 17.69 sec - in org.apache.directory.server.ssl.LdapsIT
Running org.apache.directory.server.ssl.StartTlsIT
Tests run: 1, Failures: 0, Errors: 0, Skipped: 0, Time elapsed: 10.339 sec - in org.apache.directory.server.ssl.StartTlsIT
Running org.apache.directory.server.ssl.LdapsUpdateCertificateIT
Tests run: 1, Failures: 0, Errors: 0, Skipped: 0, Time elapsed: 7.971 sec - in org.apache.directory.server.ssl.LdapsUpdateCertificateIT
Running org.apache.directory.server.replication.ClientServerReplicationIT
Tests run: 5, Failures: 0, Errors: 0, Skipped: 1, Time elapsed: 91.193 sec - in org.apache.directory.server.replication.ClientServerReplicationIT
Running org.apache.directory.server.replication.StaleEventLogDetectionIT

NbAdded every 100ms : 
0, 11Tests run: 1, Failures: 0, Errors: 0, Skipped: 0, Time elapsed: 39.019 sec - in org.apache.directory.server.replication.StaleEventLogDetectionIT
Running org.apache.directory.server.replication.ClientInitialRefreshIT
Tests run: 4, Failures: 0, Errors: 0, Skipped: 0, Time elapsed: 39.535 sec - in org.apache.directory.server.replication.ClientInitialRefreshIT
Running org.apache.directory.server.admin.AdministrativePointModifyIT
Tests run: 1, Failures: 0, Errors: 0, Skipped: 0, Time elapsed: 26.513 sec - in org.apache.directory.server.admin.AdministrativePointModifyIT
Running org.apache.directory.server.admin.AdministrativePointPersistentIT
Tests run: 1, Failures: 0, Errors: 0, Skipped: 0, Time elapsed: 11.218 sec - in org.apache.directory.server.admin.AdministrativePointPersistentIT
Running org.apache.directory.server.admin.AdministrativePointAddIT
Tests run: 2, Failures: 0, Errors: 0, Skipped: 0, Time elapsed: 28.684 sec - in org.apache.directory.server.admin.AdministrativePointAddIT
Running org.apache.directory.server.admin.AdministrativePointModifyDelIT
Tests run: 3, Failures: 0, Errors: 0, Skipped: 1, Time elapsed: 22.144 sec - in org.apache.directory.server.admin.AdministrativePointModifyDelIT
Running org.apache.directory.server.schema.SchemaIT
Tests run: 3, Failures: 0, Errors: 0, Skipped: 0, Time elapsed: 36.124 sec - in org.apache.directory.server.schema.SchemaIT
Running org.apache.directory.server.kerberos.KeyDerivationServiceIT
Tests run: 4, Failures: 0, Errors: 0, Skipped: 0, Time elapsed: 27.668 sec - in org.apache.directory.server.kerberos.KeyDerivationServiceIT
Running org.apache.directory.server.kerberos.PasswordPolicyServiceIT
Tests run: 1, Failures: 0, Errors: 0, Skipped: 1, Time elapsed: 0 sec - in org.apache.directory.server.kerberos.PasswordPolicyServiceIT

Results :

Failed tests: 
  PasswordPolicyIT.testPwdExpireWarning:1234 expected null, but was:<org.apache.directory.api.ldap.extras.controls.ppolicy.PasswordPolicyResponseImpl@9243b3>

Tests run: 434, Failures: 1, Errors: 0, Skipped: 14

[ERROR] There are test failures.

Please refer to <https://builds.apache.org/job/dir-apacheds-ubuntu-deploy/ws/trunk/server-integ/target/surefire-reports>
for the individual test results.
Sep 18, 2013 5:45:27 AM org.apache.maven.cli.event.ExecutionEventLogger logReactorSummary
INFO: ------------------------------------------------------------------------
Sep 18, 2013 5:45:27 AM org.apache.maven.cli.event.ExecutionEventLogger logReactorSummary
INFO: Reactor Summary:
Sep 18, 2013 5:45:27 AM org.apache.maven.cli.event.ExecutionEventLogger logReactorSummary
INFO: 
Sep 18, 2013 5:45:27 AM org.apache.maven.cli.event.ExecutionEventLogger logReactorSummary
INFO: ApacheDS .......................................... SUCCESS [37.080s]
Sep 18, 2013 5:45:27 AM org.apache.maven.cli.event.ExecutionEventLogger logReactorSummary
INFO: ApacheDS I18n ..................................... SUCCESS [20.452s]
Sep 18, 2013 5:45:27 AM org.apache.maven.cli.event.ExecutionEventLogger logReactorSummary
INFO: ApacheDS Core Constants ........................... SUCCESS [12.238s]
Sep 18, 2013 5:45:27 AM org.apache.maven.cli.event.ExecutionEventLogger logReactorSummary
INFO: ApacheDS Core API ................................. SUCCESS [59.155s]
Sep 18, 2013 5:45:27 AM org.apache.maven.cli.event.ExecutionEventLogger logReactorSummary
INFO: ApacheDS Core Shared .............................. SUCCESS [14.595s]
Sep 18, 2013 5:45:27 AM org.apache.maven.cli.event.ExecutionEventLogger logReactorSummary
INFO: ApacheDS Interceptors ............................. SUCCESS [4.865s]
Sep 18, 2013 5:45:27 AM org.apache.maven.cli.event.ExecutionEventLogger logReactorSummary
INFO: ApacheDS AdministrativePoint Interceptor .......... SUCCESS [11.649s]
Sep 18, 2013 5:45:27 AM org.apache.maven.cli.event.ExecutionEventLogger logReactorSummary
INFO: ApacheDS Authentication Interceptor ............... SUCCESS [17.696s]
Sep 18, 2013 5:45:27 AM org.apache.maven.cli.event.ExecutionEventLogger logReactorSummary
INFO: ApacheDS Authorization Interceptor ................ SUCCESS [15.361s]
Sep 18, 2013 5:45:27 AM org.apache.maven.cli.event.ExecutionEventLogger logReactorSummary
INFO: ApacheDS ChangeLog Interceptor .................... SUCCESS [12.756s]
Sep 18, 2013 5:45:27 AM org.apache.maven.cli.event.ExecutionEventLogger logReactorSummary
INFO: ApacheDS Collective Attribute Interceptor ......... SUCCESS [13.029s]
Sep 18, 2013 5:45:27 AM org.apache.maven.cli.event.ExecutionEventLogger logReactorSummary
INFO: ApacheDS Event Interceptor ........................ SUCCESS [9.899s]
Sep 18, 2013 5:45:27 AM org.apache.maven.cli.event.ExecutionEventLogger logReactorSummary
INFO: ApacheDS Exception Interceptor .................... SUCCESS [10.071s]
Sep 18, 2013 5:45:27 AM org.apache.maven.cli.event.ExecutionEventLogger logReactorSummary
INFO: ApacheDS Journal Interceptor ...................... SUCCESS [9.883s]
Sep 18, 2013 5:45:27 AM org.apache.maven.cli.event.ExecutionEventLogger logReactorSummary
INFO: ApacheDS Normalization Interceptor ................ SUCCESS [18.049s]
Sep 18, 2013 5:45:27 AM org.apache.maven.cli.event.ExecutionEventLogger logReactorSummary
INFO: ApacheDS Operational Attribute Interceptor ........ SUCCESS [12.384s]
Sep 18, 2013 5:45:27 AM org.apache.maven.cli.event.ExecutionEventLogger logReactorSummary
INFO: ApacheDS Referral Interceptor ..................... SUCCESS [13.948s]
Sep 18, 2013 5:45:27 AM org.apache.maven.cli.event.ExecutionEventLogger logReactorSummary
INFO: ApacheDS Schema Interceptor ....................... SUCCESS [17.255s]
Sep 18, 2013 5:45:27 AM org.apache.maven.cli.event.ExecutionEventLogger logReactorSummary
INFO: ApacheDS Subtree Interceptor ...................... SUCCESS [15.739s]
Sep 18, 2013 5:45:27 AM org.apache.maven.cli.event.ExecutionEventLogger logReactorSummary
INFO: ApacheDS Triggers Interceptor ..................... SUCCESS [15.095s]
Sep 18, 2013 5:45:27 AM org.apache.maven.cli.event.ExecutionEventLogger logReactorSummary
INFO: ApacheDS Core ..................................... SUCCESS [15.197s]
Sep 18, 2013 5:45:27 AM org.apache.maven.cli.event.ExecutionEventLogger logReactorSummary
INFO: ApacheDS Core AVL ................................. SUCCESS [17.021s]
Sep 18, 2013 5:45:27 AM org.apache.maven.cli.event.ExecutionEventLogger logReactorSummary
INFO: ApacheDS Generalized (X) DBM Partition ............ SUCCESS [21.882s]
Sep 18, 2013 5:45:27 AM org.apache.maven.cli.event.ExecutionEventLogger logReactorSummary
INFO: ApacheDS LDIF Partition ........................... SUCCESS [32.662s]
Sep 18, 2013 5:45:27 AM org.apache.maven.cli.event.ExecutionEventLogger logReactorSummary
INFO: ApacheDS JDBM Partition ........................... SUCCESS [2:00.927s]
Sep 18, 2013 5:45:27 AM org.apache.maven.cli.event.ExecutionEventLogger logReactorSummary
INFO: ApacheDS Mavibot Partition ........................ SUCCESS [18.252s]
Sep 18, 2013 5:45:27 AM org.apache.maven.cli.event.ExecutionEventLogger logReactorSummary
INFO: ApacheDS Core Annotations ......................... SUCCESS [1:38.443s]
Sep 18, 2013 5:45:27 AM org.apache.maven.cli.event.ExecutionEventLogger logReactorSummary
INFO: ApacheDS Core JNDI ................................ SUCCESS [13.545s]
Sep 18, 2013 5:45:27 AM org.apache.maven.cli.event.ExecutionEventLogger logReactorSummary
INFO: ApacheDS Protocol Kerberos Codec .................. SUCCESS [1:06.606s]
Sep 18, 2013 5:45:27 AM org.apache.maven.cli.event.ExecutionEventLogger logReactorSummary
INFO: ApacheDS Interceptors for Kerberos ................ SUCCESS [13.349s]
Sep 18, 2013 5:45:27 AM org.apache.maven.cli.event.ExecutionEventLogger logReactorSummary
INFO: ApacheDS Protocol Dhcp ............................ SUCCESS [10.592s]
Sep 18, 2013 5:45:27 AM org.apache.maven.cli.event.ExecutionEventLogger logReactorSummary
INFO: ApacheDS Protocol Shared .......................... SUCCESS [22.047s]
Sep 18, 2013 5:45:27 AM org.apache.maven.cli.event.ExecutionEventLogger logReactorSummary
INFO: ApacheDS Protocol Dns ............................. SUCCESS [13.085s]
Sep 18, 2013 5:45:27 AM org.apache.maven.cli.event.ExecutionEventLogger logReactorSummary
INFO: ApacheDS Protocol Kerberos ........................ SUCCESS [18.267s]
Sep 18, 2013 5:45:27 AM org.apache.maven.cli.event.ExecutionEventLogger logReactorSummary
INFO: ApacheDS Protocol Ldap ............................ SUCCESS [3:27.014s]
Sep 18, 2013 5:45:27 AM org.apache.maven.cli.event.ExecutionEventLogger logReactorSummary
INFO: ApacheDS Protocol Ntp ............................. SUCCESS [12.402s]
Sep 18, 2013 5:45:27 AM org.apache.maven.cli.event.ExecutionEventLogger logReactorSummary
INFO: Apacheds Server Annotations ....................... SUCCESS [1:30.971s]
Sep 18, 2013 5:45:27 AM org.apache.maven.cli.event.ExecutionEventLogger logReactorSummary
INFO: ApacheDS Server Config ............................ SUCCESS [22.456s]
Sep 18, 2013 5:45:27 AM org.apache.maven.cli.event.ExecutionEventLogger logReactorSummary
INFO: ApacheDS Server JNDI .............................. SUCCESS [12.664s]
Sep 18, 2013 5:45:27 AM org.apache.maven.cli.event.ExecutionEventLogger logReactorSummary
INFO: ApacheDS Test Framework ........................... SUCCESS [2:16.677s]
Sep 18, 2013 5:45:27 AM org.apache.maven.cli.event.ExecutionEventLogger logReactorSummary
INFO: ApacheDS All ...................................... SUCCESS [13.607s]
Sep 18, 2013 5:45:27 AM org.apache.maven.cli.event.ExecutionEventLogger logReactorSummary
INFO: ApacheDS Logger Interceptor ....................... SUCCESS [13.643s]
Sep 18, 2013 5:45:27 AM org.apache.maven.cli.event.ExecutionEventLogger logReactorSummary
INFO: ApacheDS Password Hashing Interceptor ............. SUCCESS [9.732s]
Sep 18, 2013 5:45:27 AM org.apache.maven.cli.event.ExecutionEventLogger logReactorSummary
INFO: ApacheDS Core Integration ......................... SUCCESS [42:58.960s]
Sep 18, 2013 5:45:27 AM org.apache.maven.cli.event.ExecutionEventLogger logReactorSummary
INFO: ApacheDS Protocol Kerberos Test ................... SUCCESS [1:26.167s]
Sep 18, 2013 5:45:27 AM org.apache.maven.cli.event.ExecutionEventLogger logReactorSummary
INFO: ApacheDS Server Integration ....................... FAILURE [25:52.545s]
Sep 18, 2013 5:45:27 AM org.apache.maven.cli.event.ExecutionEventLogger logReactorSummary
INFO: ApacheDS DirectoryService-WebApp bridge ........... SKIPPED
Sep 18, 2013 5:45:27 AM org.apache.maven.cli.event.ExecutionEventLogger logReactorSummary
INFO: ApacheDS Jetty HTTP Server Integration ............ SKIPPED
Sep 18, 2013 5:45:27 AM org.apache.maven.cli.event.ExecutionEventLogger logReactorSummary
INFO: ApacheDS Service Builder .......................... SKIPPED
Sep 18, 2013 5:45:27 AM org.apache.maven.cli.event.ExecutionEventLogger logReactorSummary
INFO: Apache Directory LDAP Client API test ............. SKIPPED
Sep 18, 2013 5:45:27 AM org.apache.maven.cli.event.ExecutionEventLogger logReactorSummary
INFO: kerberos-client ................................... SKIPPED
Sep 18, 2013 5:45:27 AM org.apache.maven.cli.event.ExecutionEventLogger logReactorSummary
INFO: ApacheDS Service .................................. SKIPPED
Sep 18, 2013 5:45:27 AM org.apache.maven.cli.event.ExecutionEventLogger logReactorSummary
INFO: ApacheDS Wrapper .................................. SKIPPED
Sep 18, 2013 5:45:27 AM org.apache.maven.cli.event.ExecutionEventLogger logReactorSummary
INFO: ApacheDS Installers Maven Plugin .................. SKIPPED
Sep 18, 2013 5:45:27 AM org.apache.maven.cli.event.ExecutionEventLogger logReactorSummary
INFO: ApacheDS Installers ............................... SKIPPED
Sep 18, 2013 5:45:27 AM org.apache.maven.cli.event.ExecutionEventLogger logResult
INFO: ------------------------------------------------------------------------
Sep 18, 2013 5:45:27 AM org.apache.maven.cli.event.ExecutionEventLogger logResult
INFO: BUILD FAILURE
Sep 18, 2013 5:45:27 AM org.apache.maven.cli.event.ExecutionEventLogger logStats
INFO: ------------------------------------------------------------------------
Sep 18, 2013 5:45:27 AM org.apache.maven.cli.event.ExecutionEventLogger logStats
INFO: Total time: 1:33:17.689s
Sep 18, 2013 5:45:27 AM org.apache.maven.cli.event.ExecutionEventLogger logStats
INFO: Finished at: Wed Sep 18 05:45:27 UTC 2013
Sep 18, 2013 5:45:27 AM org.apache.maven.cli.event.ExecutionEventLogger logStats
INFO: Final Memory: 54M/306M
Sep 18, 2013 5:45:27 AM org.apache.maven.cli.event.ExecutionEventLogger sessionEnded
INFO: ------------------------------------------------------------------------
[JENKINS] Archiving disabled
[JENKINS] Archiving disabled
[JENKINS] Archiving disabled
[JENKINS] Archiving disabled
[JENKINS] Archiving disabled
[JENKINS] Archiving disabled
[JENKINS] Archiving disabled
[JENKINS] Archiving disabled
[JENKINS] Archiving disabled
[JENKINS] Archiving disabled
[JENKINS] Archiving disabled
[JENKINS] Archiving disabled
[JENKINS] Archiving disabled
[JENKINS] Archiving disabled
[JENKINS] Archiving disabled
[JENKINS] Archiving disabled
[JENKINS] Archiving disabled
[JENKINS] Archiving disabled
[JENKINS] Archiving disabled
[JENKINS] Archiving disabled
[JENKINS] Archiving disabled
[JENKINS] Archiving disabled
[JENKINS] Archiving disabled
[JENKINS] Archiving disabled
[JENKINS] Archiving disabled
[JENKINS] Archiving disabled
[JENKINS] Archiving disabled
[JENKINS] Archiving disabled
[JENKINS] Archiving disabled
[JENKINS] Archiving disabled
[JENKINS] Archiving disabled
[JENKINS] Archiving disabled
[JENKINS] Archiving disabled
[JENKINS] Archiving disabled
[JENKINS] Archiving disabled
[JENKINS] Archiving disabled
[JENKINS] Archiving disabled
[JENKINS] Archiving disabled
[JENKINS] Archiving disabled
[JENKINS] Archiving disabled
[JENKINS] Archiving disabled
[JENKINS] Archiving disabled
[JENKINS] Archiving disabled
[JENKINS] Archiving disabled
[JENKINS] Archiving disabled
[JENKINS] Archiving disabled
[JENKINS] Archiving disabled
[JENKINS] Archiving disabled
[JENKINS] Archiving disabled
[JENKINS] Archiving disabled
[JENKINS] Archiving disabled
[JENKINS] Archiving disabled
[JENKINS] Archiving disabled
[JENKINS] Archiving disabled
[JENKINS] Archiving disabled
Waiting for Jenkins to finish collecting data
Maven failed with error.
channel stopped

Mime
View raw message