directory-notifications mailing list archives

Site index · List index
Message view « Date » · « Thread »
Top « Date » · « Thread »
From Apache Jenkins Server <jenk...@builds.apache.org>
Subject Build failed in Jenkins: dir-apacheds-jdk17-any » ApacheDS Core Integration #2
Date Sun, 04 Aug 2013 04:45:03 GMT
See <https://builds.apache.org/job/dir-apacheds-jdk17-any/org.apache.directory.server$apacheds-core-integ/2/>

------------------------------------------
[...truncated 16 lines...]
Aug 04, 2013 4:19:44 AM org.apache.maven.cli.event.ExecutionEventLogger mojoStarted
INFO: 
Aug 04, 2013 4:19:44 AM org.apache.maven.cli.event.ExecutionEventLogger mojoStarted
INFO: --- maven-resources-plugin:2.6:resources (default-resources) @ apacheds-core-integ ---
[INFO] Using 'UTF-8' encoding to copy filtered resources.
[INFO] Copying 0 resource
[INFO] Copying 3 resources
Aug 04, 2013 4:19:45 AM org.apache.maven.cli.event.ExecutionEventLogger mojoStarted
INFO: 
Aug 04, 2013 4:19:45 AM org.apache.maven.cli.event.ExecutionEventLogger mojoStarted
INFO: --- maven-compiler-plugin:3.1:compile (default-compile) @ apacheds-core-integ ---
[INFO] Changes detected - recompiling the module!
[INFO] Compiling 1 source file to <https://builds.apache.org/job/dir-apacheds-jdk17-any/org.apache.directory.server$apacheds-core-integ/ws/target/classes>
Aug 04, 2013 4:19:45 AM org.apache.maven.cli.event.ExecutionEventLogger mojoStarted
INFO: 
Aug 04, 2013 4:19:45 AM org.apache.maven.cli.event.ExecutionEventLogger mojoStarted
INFO: --- maven-resources-plugin:2.6:testResources (default-testResources) @ apacheds-core-integ
---
[INFO] Using 'UTF-8' encoding to copy filtered resources.
[INFO] Copying 9 resources
[INFO] Copying 3 resources
Aug 04, 2013 4:19:45 AM org.apache.maven.cli.event.ExecutionEventLogger mojoStarted
INFO: 
Aug 04, 2013 4:19:45 AM org.apache.maven.cli.event.ExecutionEventLogger mojoStarted
INFO: --- maven-dependency-plugin:2.8:copy (copy) @ apacheds-core-integ ---
[INFO] Configured Artifact: org.apache.directory.api:api-ldap-extras-codec:1.0.0-M20-SNAPSHOT:jar
[INFO] Copying api-ldap-extras-codec-1.0.0-M20-SNAPSHOT.jar to <https://builds.apache.org/job/dir-apacheds-jdk17-any/org.apache.directory.server$apacheds-core-integ/ws/target/pluginDirectory/api-ldap-extras-codec-1.0.0-M20-20130804.030858-35.jar>
Aug 04, 2013 4:19:46 AM org.apache.maven.cli.event.ExecutionEventLogger mojoStarted
INFO: 
Aug 04, 2013 4:19:46 AM org.apache.maven.cli.event.ExecutionEventLogger mojoStarted
INFO: --- maven-compiler-plugin:3.1:testCompile (default-testCompile) @ apacheds-core-integ
---
[INFO] Changes detected - recompiling the module!
[INFO] Compiling 105 source files to <https://builds.apache.org/job/dir-apacheds-jdk17-any/org.apache.directory.server$apacheds-core-integ/ws/target/test-classes>
[WARNING] <https://builds.apache.org/job/dir-apacheds-jdk17-any/org.apache.directory.server$apacheds-core-integ/ws/src/test/java/org/apache/directory/server/core/operations/search/SearchIT.java>:
<https://builds.apache.org/job/dir-apacheds-jdk17-any/org.apache.directory.server$apacheds-core-integ/ws/src/test/java/org/apache/directory/server/core/operations/search/SearchIT.java>
uses unchecked or unsafe operations.
[WARNING] <https://builds.apache.org/job/dir-apacheds-jdk17-any/org.apache.directory.server$apacheds-core-integ/ws/src/test/java/org/apache/directory/server/core/operations/search/SearchIT.java>:
Recompile with -Xlint:unchecked for details.
Aug 04, 2013 4:19:47 AM org.apache.maven.cli.event.ExecutionEventLogger mojoStarted
INFO: 
Aug 04, 2013 4:19:47 AM org.apache.maven.cli.event.ExecutionEventLogger mojoStarted
INFO: --- maven-surefire-plugin:2.15:test (default-test) @ apacheds-core-integ ---
[INFO] Surefire report directory: <https://builds.apache.org/job/dir-apacheds-jdk17-any/org.apache.directory.server$apacheds-core-integ/ws/target/surefire-reports>

-------------------------------------------------------
 T E S T S
-------------------------------------------------------
Running org.apache.directory.server.core.jndi.ModifyContextIT
Tests run: 3, Failures: 0, Errors: 0, Skipped: 0, Time elapsed: 19.744 sec - in org.apache.directory.server.core.jndi.ModifyContextIT
Running org.apache.directory.server.core.jndi.RootDSEJndiIT
Tests run: 8, Failures: 0, Errors: 0, Skipped: 0, Time elapsed: 8.875 sec - in org.apache.directory.server.core.jndi.RootDSEJndiIT
Running org.apache.directory.server.core.jndi.AddJndiIT
Tests run: 4, Failures: 0, Errors: 0, Skipped: 0, Time elapsed: 8.911 sec - in org.apache.directory.server.core.jndi.AddJndiIT
Running org.apache.directory.server.core.jndi.ReferralIT
Tests run: 33, Failures: 0, Errors: 0, Skipped: 0, Time elapsed: 88.961 sec - in org.apache.directory.server.core.jndi.ReferralIT
Running org.apache.directory.server.core.jndi.SimpleBindJndiIT
Tests run: 9, Failures: 0, Errors: 0, Skipped: 0, Time elapsed: 5.404 sec - in org.apache.directory.server.core.jndi.SimpleBindJndiIT
Running org.apache.directory.server.core.jndi.DIRSERVER791IT
Tests run: 4, Failures: 0, Errors: 0, Skipped: 0, Time elapsed: 10.062 sec - in org.apache.directory.server.core.jndi.DIRSERVER791IT
Running org.apache.directory.server.core.jndi.ListIT
Tests run: 4, Failures: 0, Errors: 0, Skipped: 0, Time elapsed: 9.58 sec - in org.apache.directory.server.core.jndi.ListIT
Running org.apache.directory.server.core.jndi.DestroyContextIT
Tests run: 1, Failures: 0, Errors: 0, Skipped: 0, Time elapsed: 9.007 sec - in org.apache.directory.server.core.jndi.DestroyContextIT
Running org.apache.directory.server.core.jndi.ExtensibleObjectIT
Tests run: 2, Failures: 0, Errors: 0, Skipped: 0, Time elapsed: 7.16 sec - in org.apache.directory.server.core.jndi.ExtensibleObjectIT
Running org.apache.directory.server.core.jndi.UniqueMemberIT
Tests run: 8, Failures: 0, Errors: 0, Skipped: 0, Time elapsed: 8.049 sec - in org.apache.directory.server.core.jndi.UniqueMemberIT
Running org.apache.directory.server.core.jndi.referral.RenameReferralIgnoreIT
Tests run: 6, Failures: 0, Errors: 0, Skipped: 0, Time elapsed: 8.331 sec - in org.apache.directory.server.core.jndi.referral.RenameReferralIgnoreIT
Running org.apache.directory.server.core.jndi.referral.CompareReferralIT
Tests run: 10, Failures: 0, Errors: 0, Skipped: 0, Time elapsed: 12.557 sec - in org.apache.directory.server.core.jndi.referral.CompareReferralIT
Running org.apache.directory.server.core.jndi.referral.MoveReferralIT
Tests run: 14, Failures: 0, Errors: 0, Skipped: 0, Time elapsed: 10.37 sec - in org.apache.directory.server.core.jndi.referral.MoveReferralIT
Running org.apache.directory.server.core.jndi.referral.DeleteReferralIT
Tests run: 8, Failures: 0, Errors: 0, Skipped: 0, Time elapsed: 10.761 sec - in org.apache.directory.server.core.jndi.referral.DeleteReferralIT
Running org.apache.directory.server.core.jndi.referral.RenameReferralIT
Tests run: 9, Failures: 0, Errors: 0, Skipped: 0, Time elapsed: 7.935 sec - in org.apache.directory.server.core.jndi.referral.RenameReferralIT
Running org.apache.directory.server.core.jndi.referral.SearchReferralIT
Tests run: 10, Failures: 0, Errors: 0, Skipped: 0, Time elapsed: 7.146 sec - in org.apache.directory.server.core.jndi.referral.SearchReferralIT
Running org.apache.directory.server.core.jndi.referral.MoveAndRenameReferralIT
Tests run: 12, Failures: 0, Errors: 0, Skipped: 0, Time elapsed: 9.127 sec - in org.apache.directory.server.core.jndi.referral.MoveAndRenameReferralIT
Running org.apache.directory.server.core.jndi.referral.AddReferralIT
Tests run: 6, Failures: 0, Errors: 0, Skipped: 0, Time elapsed: 8.779 sec - in org.apache.directory.server.core.jndi.referral.AddReferralIT
Running org.apache.directory.server.core.jndi.referral.ModifyReferralIT
Tests run: 10, Failures: 0, Errors: 0, Skipped: 0, Time elapsed: 9.319 sec - in org.apache.directory.server.core.jndi.referral.ModifyReferralIT
Running org.apache.directory.server.core.jndi.CreateContextIT
Tests run: 8, Failures: 0, Errors: 0, Skipped: 0, Time elapsed: 14.111 sec - in org.apache.directory.server.core.jndi.CreateContextIT
Running org.apache.directory.server.core.jndi.MixedCaseIT
Tests run: 4, Failures: 0, Errors: 0, Skipped: 0, Time elapsed: 18.357 sec - in org.apache.directory.server.core.jndi.MixedCaseIT
Running org.apache.directory.server.core.jndi.DIRSERVER169IT
Tests run: 2, Failures: 0, Errors: 0, Skipped: 0, Time elapsed: 9.899 sec - in org.apache.directory.server.core.jndi.DIRSERVER169IT
Running org.apache.directory.server.core.jndi.ObjStateFactoryIT
Tests run: 2, Failures: 0, Errors: 0, Skipped: 0, Time elapsed: 8.191 sec - in org.apache.directory.server.core.jndi.ObjStateFactoryIT
Running org.apache.directory.server.core.jndi.RFC2713IT
Tests run: 1, Failures: 0, Errors: 0, Skipped: 0, Time elapsed: 6.496 sec - in org.apache.directory.server.core.jndi.RFC2713IT
Running org.apache.directory.server.core.operations.modify.ModifyAddIT
Tests run: 18, Failures: 0, Errors: 0, Skipped: 0, Time elapsed: 67.486 sec - in org.apache.directory.server.core.operations.modify.ModifyAddIT
Running org.apache.directory.server.core.operations.modify.ModifyMultipleChangesIT
Tests run: 1, Failures: 0, Errors: 0, Skipped: 0, Time elapsed: 11.009 sec - in org.apache.directory.server.core.operations.modify.ModifyMultipleChangesIT
Running org.apache.directory.server.core.operations.modify.ModifyDelIT
Tests run: 13, Failures: 0, Errors: 0, Skipped: 0, Time elapsed: 66.12 sec - in org.apache.directory.server.core.operations.modify.ModifyDelIT
Running org.apache.directory.server.core.operations.modify.ModifyMVAttributeIT
Tests run: 2, Failures: 0, Errors: 0, Skipped: 2, Time elapsed: 5.843 sec - in org.apache.directory.server.core.operations.modify.ModifyMVAttributeIT
Running org.apache.directory.server.core.operations.search.AliasSearchIT
Tests run: 16, Failures: 0, Errors: 0, Skipped: 8, Time elapsed: 18.285 sec - in org.apache.directory.server.core.operations.search.AliasSearchIT
Running org.apache.directory.server.core.operations.search.SearchIT
Tests run: 50, Failures: 1, Errors: 0, Skipped: 1, Time elapsed: 13.702 sec <<< FAILURE!
- in org.apache.directory.server.core.operations.search.SearchIT
testSearchEmptyDNWithSubLevelScope(org.apache.directory.server.core.operations.search.SearchIT)
 Time elapsed: 0.024 sec  <<< FAILURE!
java.lang.AssertionError: null
	at org.junit.Assert.fail(Assert.java:86)
	at org.junit.Assert.assertTrue(Assert.java:41)
	at org.junit.Assert.assertTrue(Assert.java:52)
	at org.apache.directory.server.core.operations.search.SearchIT.testSearchEmptyDNWithSubLevelScope(SearchIT.java:1774)

Running org.apache.directory.server.core.operations.search.SearchWithIndicesIT
Tests run: 3, Failures: 0, Errors: 0, Skipped: 0, Time elapsed: 22.741 sec - in org.apache.directory.server.core.operations.search.SearchWithIndicesIT
Running org.apache.directory.server.core.operations.search.DIRSERVER759IT
Tests run: 1, Failures: 0, Errors: 0, Skipped: 0, Time elapsed: 8.021 sec - in org.apache.directory.server.core.operations.search.DIRSERVER759IT
Running org.apache.directory.server.core.operations.search.SearchBinaryIT
Tests run: 2, Failures: 0, Errors: 0, Skipped: 1, Time elapsed: 9.177 sec - in org.apache.directory.server.core.operations.search.SearchBinaryIT
Running org.apache.directory.server.core.operations.exists.ExistsIT
Tests run: 2, Failures: 0, Errors: 0, Skipped: 0, Time elapsed: 8.747 sec - in org.apache.directory.server.core.operations.exists.ExistsIT
Running org.apache.directory.server.core.operations.move.MoveIT
Tests run: 2, Failures: 0, Errors: 0, Skipped: 0, Time elapsed: 12.31 sec - in org.apache.directory.server.core.operations.move.MoveIT
Running org.apache.directory.server.core.operations.lookup.LookupIT
Tests run: 8, Failures: 0, Errors: 0, Skipped: 0, Time elapsed: 7.602 sec - in org.apache.directory.server.core.operations.lookup.LookupIT
Running org.apache.directory.server.core.operations.getRootDse.GetRootDseIT
Tests run: 11, Failures: 0, Errors: 0, Skipped: 0, Time elapsed: 5.732 sec - in org.apache.directory.server.core.operations.getRootDse.GetRootDseIT
Running org.apache.directory.server.core.operations.add.ConcurrentAddSearchIT
Tests run: 1, Failures: 0, Errors: 0, Skipped: 1, Time elapsed: 10.593 sec - in org.apache.directory.server.core.operations.add.ConcurrentAddSearchIT
Running org.apache.directory.server.core.operations.add.PasswordHashingInterceptorTest
Tests run: 5, Failures: 0, Errors: 0, Skipped: 0, Time elapsed: 8.456 sec - in org.apache.directory.server.core.operations.add.PasswordHashingInterceptorTest
Running org.apache.directory.server.core.operations.add.AddIT
Tests run: 2, Failures: 0, Errors: 0, Skipped: 0, Time elapsed: 15.728 sec - in org.apache.directory.server.core.operations.add.AddIT
Running org.apache.directory.server.core.operations.add.DIRSERVER783IT
Tests run: 1, Failures: 0, Errors: 0, Skipped: 0, Time elapsed: 10.769 sec - in org.apache.directory.server.core.operations.add.DIRSERVER783IT
Running org.apache.directory.server.core.operations.add.DIRSERVER169IT
Tests run: 4, Failures: 0, Errors: 0, Skipped: 0, Time elapsed: 7.333 sec - in org.apache.directory.server.core.operations.add.DIRSERVER169IT
Running org.apache.directory.server.core.operations.compare.CompareDirserver1139IT
Tests run: 1, Failures: 0, Errors: 0, Skipped: 0, Time elapsed: 6.783 sec - in org.apache.directory.server.core.operations.compare.CompareDirserver1139IT
Running org.apache.directory.server.core.operations.bind.SimpleBindIT
Tests run: 9, Failures: 0, Errors: 0, Skipped: 0, Time elapsed: 7.903 sec - in org.apache.directory.server.core.operations.bind.SimpleBindIT
Running org.apache.directory.server.core.operations.rename.RenameIT
Tests run: 1, Failures: 0, Errors: 0, Skipped: 0, Time elapsed: 10.703 sec - in org.apache.directory.server.core.operations.rename.RenameIT
Running org.apache.directory.server.core.authn.SimpleAuthenticationIT
Tests run: 12, Failures: 0, Errors: 0, Skipped: 0, Time elapsed: 20.766 sec - in org.apache.directory.server.core.authn.SimpleAuthenticationIT
Running org.apache.directory.server.core.collective.CollectiveAttributeServiceIT
----- Checking exclusions
found entry ou=services,ou=configuration,ou=system
found entry ou=users,ou=system
found entry ou=partitions,ou=configuration,ou=system
found entry ou=system
found entry ou=interceptors,ou=configuration,ou=system
found entry ou=configuration,ou=system
found entry ou=groups,ou=system
found entry uid=admin,ou=system
found entry prefNodeName=sysPrefRoot,ou=system
found entry cn=Administrators,ou=groups,ou=system
----- Exclusions OK
Tests run: 6, Failures: 0, Errors: 0, Skipped: 1, Time elapsed: 15.29 sec - in org.apache.directory.server.core.collective.CollectiveAttributeServiceIT
Running org.apache.directory.server.core.configuration.PartitionConfigurationIT
Tests run: 1, Failures: 0, Errors: 0, Skipped: 0, Time elapsed: 13.305 sec - in org.apache.directory.server.core.configuration.PartitionConfigurationIT
Running org.apache.directory.server.core.normalization.NormalizationServiceIT
Tests run: 1, Failures: 0, Errors: 0, Skipped: 0, Time elapsed: 8.844 sec - in org.apache.directory.server.core.normalization.NormalizationServiceIT
Running org.apache.directory.server.core.exception.ExceptionServiceIT
Tests run: 19, Failures: 0, Errors: 0, Skipped: 0, Time elapsed: 21.764 sec - in org.apache.directory.server.core.exception.ExceptionServiceIT
Running org.apache.directory.server.core.authz.MoveRenameAuthorizationIT
Tests run: 5, Failures: 0, Errors: 0, Skipped: 0, Time elapsed: 142.39 sec - in org.apache.directory.server.core.authz.MoveRenameAuthorizationIT
Running org.apache.directory.server.core.authz.AdministratorsGroupIT
Tests run: 2, Failures: 0, Errors: 0, Skipped: 0, Time elapsed: 23.614 sec - in org.apache.directory.server.core.authz.AdministratorsGroupIT
Running org.apache.directory.server.core.authz.AuthorizationServiceAsAdminIT
Tests run: 4, Failures: 0, Errors: 0, Skipped: 0, Time elapsed: 5.247 sec - in org.apache.directory.server.core.authz.AuthorizationServiceAsAdminIT
Running org.apache.directory.server.core.authz.support.MaxImmSubFilterIT
Tests run: 5, Failures: 0, Errors: 0, Skipped: 1, Time elapsed: 6.37 sec - in org.apache.directory.server.core.authz.support.MaxImmSubFilterIT
Running org.apache.directory.server.core.authz.GeneralAuthorizationIT
Tests run: 1, Failures: 0, Errors: 0, Skipped: 0, Time elapsed: 8.469 sec - in org.apache.directory.server.core.authz.GeneralAuthorizationIT
Running org.apache.directory.server.core.authz.ModifyAuthorizationIT
Tests run: 7, Failures: 0, Errors: 0, Skipped: 0, Time elapsed: 96.777 sec - in org.apache.directory.server.core.authz.ModifyAuthorizationIT
Running org.apache.directory.server.core.authz.AuthorizationServiceAsNonAdminIT
Tests run: 4, Failures: 0, Errors: 0, Skipped: 0, Time elapsed: 8.383 sec - in org.apache.directory.server.core.authz.AuthorizationServiceAsNonAdminIT
Running org.apache.directory.server.core.authz.DeleteAuthorizationIT
Tests run: 4, Failures: 0, Errors: 0, Skipped: 0, Time elapsed: 36.251 sec - in org.apache.directory.server.core.authz.DeleteAuthorizationIT
Running org.apache.directory.server.core.authz.LookupAuthorizationIT
Tests run: 1, Failures: 0, Errors: 0, Skipped: 0, Time elapsed: 10.852 sec - in org.apache.directory.server.core.authz.LookupAuthorizationIT
Running org.apache.directory.server.core.authz.AuthzAuthnIT
Tests run: 3, Failures: 0, Errors: 0, Skipped: 0, Time elapsed: 9.424 sec - in org.apache.directory.server.core.authz.AuthzAuthnIT
Running org.apache.directory.server.core.authz.CompareAuthorizationIT
Tests run: 5, Failures: 0, Errors: 0, Skipped: 0, Time elapsed: 34.477 sec - in org.apache.directory.server.core.authz.CompareAuthorizationIT
Running org.apache.directory.server.core.authz.AddAuthorizationIT
Tests run: 4, Failures: 0, Errors: 0, Skipped: 0, Time elapsed: 23.646 sec - in org.apache.directory.server.core.authz.AddAuthorizationIT
Running org.apache.directory.server.core.authz.SearchAuthorizationIT
Tests run: 16, Failures: 0, Errors: 0, Skipped: 1, Time elapsed: 88.149 sec - in org.apache.directory.server.core.authz.SearchAuthorizationIT
Running org.apache.directory.server.core.event.EventServiceIT
Tests run: 2, Failures: 0, Errors: 0, Skipped: 0, Time elapsed: 16.198 sec - in org.apache.directory.server.core.event.EventServiceIT
Running org.apache.directory.server.core.trigger.TriggerInterceptorIT
Tests run: 1, Failures: 0, Errors: 0, Skipped: 1, Time elapsed: 0 sec - in org.apache.directory.server.core.trigger.TriggerInterceptorIT
Running org.apache.directory.server.core.trigger.SubentryServiceForTriggersIT
Tests run: 1, Failures: 0, Errors: 0, Skipped: 1, Time elapsed: 0 sec - in org.apache.directory.server.core.trigger.SubentryServiceForTriggersIT
Running org.apache.directory.server.core.admin.AdministrativePointServiceIT
Tests run: 1, Failures: 0, Errors: 0, Skipped: 1, Time elapsed: 0 sec - in org.apache.directory.server.core.admin.AdministrativePointServiceIT
Running org.apache.directory.server.core.schema.PartitionSchemaLoaderIT
Tests run: 1, Failures: 0, Errors: 0, Skipped: 0, Time elapsed: 0.33 sec - in org.apache.directory.server.core.schema.PartitionSchemaLoaderIT
Running org.apache.directory.server.core.schema.MetaMatchingRuleHandlerIT
Tests run: 14, Failures: 0, Errors: 0, Skipped: 9, Time elapsed: 7.445 sec - in org.apache.directory.server.core.schema.MetaMatchingRuleHandlerIT
Running org.apache.directory.server.core.schema.SubschemaSubentryIT
Tests run: 17, Failures: 0, Errors: 0, Skipped: 1, Time elapsed: 29.453 sec - in org.apache.directory.server.core.schema.SubschemaSubentryIT
Running org.apache.directory.server.core.schema.MetaObjectClassHandlerIT
Tests run: 27, Failures: 0, Errors: 0, Skipped: 12, Time elapsed: 6.499 sec - in org.apache.directory.server.core.schema.MetaObjectClassHandlerIT
Running org.apache.directory.server.core.schema.MetaSyntaxCheckerHandlerIT
Tests run: 20, Failures: 0, Errors: 0, Skipped: 12, Time elapsed: 6.021 sec - in org.apache.directory.server.core.schema.MetaSyntaxCheckerHandlerIT
Running org.apache.directory.server.core.schema.ObjectClassCreateIT
Tests run: 4, Failures: 0, Errors: 0, Skipped: 0, Time elapsed: 6.882 sec - in org.apache.directory.server.core.schema.ObjectClassCreateIT
Running org.apache.directory.server.core.schema.MetaNormalizerHandlerIT
Tests run: 20, Failures: 0, Errors: 0, Skipped: 12, Time elapsed: 6.14 sec - in org.apache.directory.server.core.schema.MetaNormalizerHandlerIT
Running org.apache.directory.server.core.schema.SchemaServiceIT
Tests run: 23, Failures: 0, Errors: 0, Skipped: 0, Time elapsed: 9.934 sec - in org.apache.directory.server.core.schema.SchemaServiceIT
Running org.apache.directory.server.core.schema.SchemaPersistenceIT
Tests run: 2, Failures: 0, Errors: 0, Skipped: 0, Time elapsed: 17.176 sec - in org.apache.directory.server.core.schema.SchemaPersistenceIT
Running org.apache.directory.server.core.schema.MetaComparatorHandlerIT
Tests run: 20, Failures: 0, Errors: 0, Skipped: 12, Time elapsed: 9.987 sec - in org.apache.directory.server.core.schema.MetaComparatorHandlerIT
Running org.apache.directory.server.core.schema.MetaAttributeTypeHandlerIT
Tests run: 19, Failures: 0, Errors: 0, Skipped: 11, Time elapsed: 7.892 sec - in org.apache.directory.server.core.schema.MetaAttributeTypeHandlerIT
Running org.apache.directory.server.core.schema.MetaSyntaxHandlerIT
Tests run: 18, Failures: 0, Errors: 0, Skipped: 12, Time elapsed: 7.509 sec - in org.apache.directory.server.core.schema.MetaSyntaxHandlerIT
Running org.apache.directory.server.core.schema.MetaSchemaHandlerIT
Tests run: 29, Failures: 0, Errors: 0, Skipped: 16, Time elapsed: 5.83 sec - in org.apache.directory.server.core.schema.MetaSchemaHandlerIT
Running org.apache.directory.server.core.changelog.DefaultChangeLogIT
Tests run: 7, Failures: 0, Errors: 0, Skipped: 0, Time elapsed: 22.283 sec - in org.apache.directory.server.core.changelog.DefaultChangeLogIT
Running org.apache.directory.server.core.operational.OperationalAttributeServiceIT
Tests run: 12, Failures: 0, Errors: 0, Skipped: 0, Time elapsed: 25.952 sec - in org.apache.directory.server.core.operational.OperationalAttributeServiceIT
Running org.apache.directory.server.core.partition.PartitionIT
Tests run: 1, Failures: 0, Errors: 0, Skipped: 0, Time elapsed: 17.502 sec - in org.apache.directory.server.core.partition.PartitionIT
Running org.apache.directory.server.core.subtree.SubentryServiceIT
Tests run: 17, Failures: 0, Errors: 0, Skipped: 16, Time elapsed: 15.247 sec - in org.apache.directory.server.core.subtree.SubentryServiceIT
Running org.apache.directory.server.core.subtree.BadSubentryServiceIT
Tests run: 1, Failures: 0, Errors: 0, Skipped: 0, Time elapsed: 10.63 sec - in org.apache.directory.server.core.subtree.BadSubentryServiceIT
Running org.apache.directory.server.core.subtree.SubentryServiceObjectClassChangeHandlingIT
Tests run: 1, Failures: 0, Errors: 0, Skipped: 0, Time elapsed: 7.368 sec - in org.apache.directory.server.core.subtree.SubentryServiceObjectClassChangeHandlingIT
Running org.apache.directory.server.core.subtree.SubentryServiceEntryModificationHandlingIT
Tests run: 1, Failures: 0, Errors: 0, Skipped: 0, Time elapsed: 7.723 sec - in org.apache.directory.server.core.subtree.SubentryServiceEntryModificationHandlingIT
Running org.apache.directory.server.core.sp.LdapClassLoaderIT
Tests run: 2, Failures: 0, Errors: 0, Skipped: 0, Time elapsed: 7.153 sec - in org.apache.directory.server.core.sp.LdapClassLoaderIT

Results :

Failed tests: 
  SearchIT.testSearchEmptyDNWithSubLevelScope:1774 null

Tests run: 692, Failures: 1, Errors: 0, Skipped: 132

[ERROR] There are test failures.

Please refer to <https://builds.apache.org/job/dir-apacheds-jdk17-any/org.apache.directory.server$apacheds-core-integ/ws/target/surefire-reports>
for the individual test results.

Mime
View raw message