directory-notifications mailing list archives

Site index · List index
Message view « Date » · « Thread »
Top « Date » · « Thread »
From Apache Jenkins Server <jenk...@builds.apache.org>
Subject Build failed in Jenkins: dir-apacheds-jdbm-win #424
Date Tue, 20 Aug 2013 04:08:22 GMT
See <https://builds.apache.org/job/dir-apacheds-jdbm-win/424/>

------------------------------------------
[...truncated 70 lines...]
INFO: 
Aug 20, 2013 5:02:44 AM org.apache.maven.cli.event.ExecutionEventLogger mojoStarted
INFO: --- maven-clean-plugin:2.4.1:clean (default-clean) @ apacheds-jdbm1 ---
[INFO] Deleting F:\hudson\hudson-slave\workspace\dir-apacheds-jdbm-win\jdbm1\target
Aug 20, 2013 5:02:44 AM org.apache.maven.cli.event.ExecutionEventLogger mojoStarted
INFO: 
Aug 20, 2013 5:02:44 AM org.apache.maven.cli.event.ExecutionEventLogger mojoStarted
INFO: --- maven-remote-resources-plugin:1.2.1:process (default) @ apacheds-jdbm1 ---
Aug 20, 2013 5:02:44 AM org.apache.maven.cli.event.ExecutionEventLogger mojoStarted
INFO: 
Aug 20, 2013 5:02:44 AM org.apache.maven.cli.event.ExecutionEventLogger mojoStarted
INFO: --- maven-resources-plugin:2.5:resources (default-resources) @ apacheds-jdbm1 ---
[debug] execute contextualize
[INFO] Using 'UTF-8' encoding to copy filtered resources.
[INFO] Copying 6 resources
[INFO] Copying 3 resources
Aug 20, 2013 5:02:45 AM org.apache.maven.cli.event.ExecutionEventLogger mojoStarted
INFO: 
Aug 20, 2013 5:02:45 AM org.apache.maven.cli.event.ExecutionEventLogger mojoStarted
INFO: --- maven-compiler-plugin:2.5.1:compile (default-compile) @ apacheds-jdbm1 ---
[INFO] Compiling 58 source files to F:\hudson\hudson-slave\workspace\dir-apacheds-jdbm-win\jdbm1\target\classes
Aug 20, 2013 5:02:51 AM org.apache.maven.cli.event.ExecutionEventLogger mojoStarted
INFO: 
Aug 20, 2013 5:02:51 AM org.apache.maven.cli.event.ExecutionEventLogger mojoStarted
INFO: --- maven-resources-plugin:2.5:testResources (default-testResources) @ apacheds-jdbm1
---
[debug] execute contextualize
[INFO] Using 'UTF-8' encoding to copy filtered resources.
[INFO] skip non existing resourceDirectory F:\hudson\hudson-slave\workspace\dir-apacheds-jdbm-win\jdbm1\src\test\resources
[INFO] Copying 3 resources
Aug 20, 2013 5:02:51 AM org.apache.maven.cli.event.ExecutionEventLogger mojoStarted
INFO: 
Aug 20, 2013 5:02:51 AM org.apache.maven.cli.event.ExecutionEventLogger mojoStarted
INFO: --- maven-compiler-plugin:2.5.1:testCompile (default-testCompile) @ apacheds-jdbm1 ---
[INFO] Compiling 3 source files to F:\hudson\hudson-slave\workspace\dir-apacheds-jdbm-win\jdbm1\target\test-classes
Aug 20, 2013 5:02:52 AM org.apache.maven.cli.event.ExecutionEventLogger mojoStarted
INFO: 
Aug 20, 2013 5:02:52 AM org.apache.maven.cli.event.ExecutionEventLogger mojoStarted
INFO: --- maven-surefire-plugin:2.12.2:test (default-test) @ apacheds-jdbm1 ---
[INFO] Surefire report directory: F:\hudson\hudson-slave\workspace\dir-apacheds-jdbm-win\jdbm1\target\surefire-reports

-------------------------------------------------------
 T E S T S
-------------------------------------------------------
Running jdbm.btree.TestBTree
Tests run: 10, Failures: 0, Errors: 0, Skipped: 1, Time elapsed: 11.161 sec
Running jdbm.recman.LocationTest
Tests run: 8, Failures: 0, Errors: 0, Skipped: 2, Time elapsed: 0.031 sec

Results :

Tests run: 18, Failures: 0, Errors: 0, Skipped: 3

[JENKINS] Recording test results
Aug 20, 2013 5:03:07 AM org.apache.maven.cli.event.ExecutionEventLogger mojoStarted
INFO: 
Aug 20, 2013 5:03:07 AM org.apache.maven.cli.event.ExecutionEventLogger mojoStarted
INFO: --- maven-bundle-plugin:2.3.7:bundle (default-bundle) @ apacheds-jdbm1 ---
Aug 20, 2013 5:03:08 AM org.apache.maven.cli.event.ExecutionEventLogger mojoStarted
INFO: 
Aug 20, 2013 5:03:08 AM org.apache.maven.cli.event.ExecutionEventLogger mojoStarted
INFO: --- maven-site-plugin:3.0:attach-descriptor (attach-descriptor) @ apacheds-jdbm1 ---
Aug 20, 2013 5:03:08 AM org.apache.maven.cli.event.ExecutionEventLogger mojoStarted
INFO: 
Aug 20, 2013 5:03:08 AM org.apache.maven.cli.event.ExecutionEventLogger mojoStarted
INFO: --- tools-maven-plugin:1.4:verify-legal-files (verify-legal-files) @ apacheds-jdbm1
---
[INFO] Checking legal files in: apacheds-jdbm1-2.0.0-M3-SNAPSHOT.jar
Aug 20, 2013 5:03:08 AM org.apache.maven.cli.event.ExecutionEventLogger mojoStarted
INFO: 
Aug 20, 2013 5:03:08 AM org.apache.maven.cli.event.ExecutionEventLogger mojoStarted
INFO: --- maven-install-plugin:2.3.1:install (default-install) @ apacheds-jdbm1 ---
[INFO] Installing F:\hudson\hudson-slave\workspace\dir-apacheds-jdbm-win\jdbm1\target\apacheds-jdbm1-2.0.0-M3-SNAPSHOT.jar
to f:\hudson\hudson-slave\maven-repositories\1\org\apache\directory\jdbm\apacheds-jdbm1\2.0.0-M3-SNAPSHOT\apacheds-jdbm1-2.0.0-M3-SNAPSHOT.jar
[INFO] Installing F:\hudson\hudson-slave\workspace\dir-apacheds-jdbm-win\jdbm1\pom.xml to
f:\hudson\hudson-slave\maven-repositories\1\org\apache\directory\jdbm\apacheds-jdbm1\2.0.0-M3-SNAPSHOT\apacheds-jdbm1-2.0.0-M3-SNAPSHOT.pom
Aug 20, 2013 5:03:08 AM org.apache.maven.cli.event.ExecutionEventLogger mojoStarted
INFO: 
Aug 20, 2013 5:03:08 AM org.apache.maven.cli.event.ExecutionEventLogger mojoStarted
INFO: --- maven-bundle-plugin:2.3.7:install (default-install) @ apacheds-jdbm1 ---
[INFO] Installing org/apache/directory/jdbm/apacheds-jdbm1/2.0.0-M3-SNAPSHOT/apacheds-jdbm1-2.0.0-M3-SNAPSHOT.jar
[INFO] Writing OBR metadata
Aug 20, 2013 5:03:13 AM org.apache.maven.cli.event.ExecutionEventLogger projectStarted
INFO:                                                                         
Aug 20, 2013 5:03:13 AM org.apache.maven.cli.event.ExecutionEventLogger projectStarted
INFO: ------------------------------------------------------------------------
Aug 20, 2013 5:03:13 AM org.apache.maven.cli.event.ExecutionEventLogger projectStarted
INFO: Building ApacheDS JDBM Implementation MVCC 2.0.0-M3-SNAPSHOT
Aug 20, 2013 5:03:13 AM org.apache.maven.cli.event.ExecutionEventLogger projectStarted
INFO: ------------------------------------------------------------------------
Aug 20, 2013 5:03:13 AM org.apache.maven.cli.event.ExecutionEventLogger mojoStarted
INFO: 
Aug 20, 2013 5:03:13 AM org.apache.maven.cli.event.ExecutionEventLogger mojoStarted
INFO: --- maven-clean-plugin:2.4.1:clean (default-clean) @ apacheds-jdbm2 ---
[INFO] Deleting F:\hudson\hudson-slave\workspace\dir-apacheds-jdbm-win\jdbm2\target
Aug 20, 2013 5:03:13 AM org.apache.maven.cli.event.ExecutionEventLogger mojoStarted
INFO: 
Aug 20, 2013 5:03:13 AM org.apache.maven.cli.event.ExecutionEventLogger mojoStarted
INFO: --- maven-remote-resources-plugin:1.2.1:process (default) @ apacheds-jdbm2 ---
Aug 20, 2013 5:03:13 AM org.apache.maven.cli.event.ExecutionEventLogger mojoStarted
INFO: 
Aug 20, 2013 5:03:13 AM org.apache.maven.cli.event.ExecutionEventLogger mojoStarted
INFO: --- maven-resources-plugin:2.5:resources (default-resources) @ apacheds-jdbm2 ---
[debug] execute contextualize
[INFO] Using 'UTF-8' encoding to copy filtered resources.
[INFO] Copying 6 resources
[INFO] Copying 3 resources
Aug 20, 2013 5:03:13 AM org.apache.maven.cli.event.ExecutionEventLogger mojoStarted
INFO: 
Aug 20, 2013 5:03:13 AM org.apache.maven.cli.event.ExecutionEventLogger mojoStarted
INFO: --- maven-compiler-plugin:2.5.1:compile (default-compile) @ apacheds-jdbm2 ---
[INFO] Compiling 65 source files to F:\hudson\hudson-slave\workspace\dir-apacheds-jdbm-win\jdbm2\target\classes
Aug 20, 2013 5:03:16 AM org.apache.maven.cli.event.ExecutionEventLogger mojoStarted
INFO: 
Aug 20, 2013 5:03:16 AM org.apache.maven.cli.event.ExecutionEventLogger mojoStarted
INFO: --- maven-resources-plugin:2.5:testResources (default-testResources) @ apacheds-jdbm2
---
[debug] execute contextualize
[INFO] Using 'UTF-8' encoding to copy filtered resources.
[INFO] Copying 1 resource
[INFO] Copying 3 resources
Aug 20, 2013 5:03:16 AM org.apache.maven.cli.event.ExecutionEventLogger mojoStarted
INFO: 
Aug 20, 2013 5:03:16 AM org.apache.maven.cli.event.ExecutionEventLogger mojoStarted
INFO: --- maven-compiler-plugin:2.5.1:testCompile (default-testCompile) @ apacheds-jdbm2 ---
[INFO] Compiling 8 source files to F:\hudson\hudson-slave\workspace\dir-apacheds-jdbm-win\jdbm2\target\test-classes
Aug 20, 2013 5:03:17 AM org.apache.maven.cli.event.ExecutionEventLogger mojoStarted
INFO: 
Aug 20, 2013 5:03:17 AM org.apache.maven.cli.event.ExecutionEventLogger mojoStarted
INFO: --- maven-surefire-plugin:2.12.2:test (default-test) @ apacheds-jdbm2 ---
[INFO] Surefire report directory: F:\hudson\hudson-slave\workspace\dir-apacheds-jdbm-win\jdbm2\target\surefire-reports

-------------------------------------------------------
 T E S T S
-------------------------------------------------------
Running jdbm.btree.TestBTree
Tests run: 9, Failures: 0, Errors: 0, Skipped: 0, Time elapsed: 11.357 sec
Running jdbm.btree.TestBTreeBrowser
Tests run: 11, Failures: 0, Errors: 0, Skipped: 0, Time elapsed: 1.103 sec
Running jdbm.btree.TestSnapshotBTree
 TestLongBrowsing read thread min key is0max value is0
 TestLongBrowsing read thread min key is0max value is1
 TestLongBrowsing read thread min key is0max value is1
 TestLongBrowsing read thread min key is0max value is1
TestLongBrowsing read thread count is 10000
TestLongBrowsing read thread count is 10000
TestLongBrowsing read thread count is 10000
TestLongBrowsing read thread count is 10000
TestLongBrowsing updates ended
TestRemoveInsert updates ended
TestRemoveInsert read thread count is 10000
TestRemoveInsert read thread count is 10000
TestRemoveInsert read thread count is 10000
TestRemoveInsert read thread count is 10000
count is 1024
Tests run: 3, Failures: 0, Errors: 0, Skipped: 0, Time elapsed: 249.502 sec
Running jdbm.btree.TestStreamCorrupted
Tests run: 1, Failures: 0, Errors: 0, Skipped: 0, Time elapsed: 0 sec
Running jdbm.helper.TestActionVersioning
Tests run: 1, Failures: 0, Errors: 0, Skipped: 0, Time elapsed: 0.006 sec
Running jdbm.helper.TestVersionedCache
Sum is: 1027
Tests run: 2, Failures: 0, Errors: 0, Skipped: 0, Time elapsed: 0.217 sec
Running jdbm.recman.BlockIoTest
Tests run: 4, Failures: 0, Errors: 0, Skipped: 0, Time elapsed: 0.009 sec
Running jdbm.recman.LocationTest
Tests run: 8, Failures: 0, Errors: 0, Skipped: 2, Time elapsed: 0.123 sec

Results :

Tests run: 39, Failures: 0, Errors: 0, Skipped: 2

[JENKINS] Recording test results
Aug 20, 2013 5:08:10 AM org.apache.maven.cli.event.ExecutionEventLogger mojoStarted
INFO: 
Aug 20, 2013 5:08:10 AM org.apache.maven.cli.event.ExecutionEventLogger mojoStarted
INFO: --- maven-bundle-plugin:2.3.7:bundle (default-bundle) @ apacheds-jdbm2 ---
[ERROR] An internal error occurred
java.io.IOException: There is not enough space on the disk
	at java.io.FileOutputStream.writeBytes(Native Method)
	at java.io.FileOutputStream.write(FileOutputStream.java:318)
	at java.util.zip.DeflaterOutputStream.deflate(DeflaterOutputStream.java:253)
	at java.util.zip.ZipOutputStream.closeEntry(ZipOutputStream.java:238)
	at aQute.lib.osgi.Jar.writeResource(Jar.java:446)
	at aQute.lib.osgi.Jar.write(Jar.java:224)
	at aQute.lib.osgi.Jar.write(Jar.java:192)
	at org.apache.felix.bundleplugin.BundlePlugin.execute(BundlePlugin.java:362)
	at org.apache.felix.bundleplugin.BundlePlugin.execute(BundlePlugin.java:264)
	at org.apache.felix.bundleplugin.BundlePlugin.execute(BundlePlugin.java:255)
	at org.apache.maven.plugin.DefaultBuildPluginManager.executeMojo(DefaultBuildPluginManager.java:107)
	at org.apache.maven.lifecycle.internal.MojoExecutor.execute(MojoExecutor.java:209)
	at org.apache.maven.lifecycle.internal.MojoExecutor.execute(MojoExecutor.java:153)
	at org.apache.maven.lifecycle.internal.MojoExecutor.execute(MojoExecutor.java:145)
	at org.apache.maven.lifecycle.internal.LifecycleModuleBuilder.buildProject(LifecycleModuleBuilder.java:84)
	at org.apache.maven.lifecycle.internal.LifecycleModuleBuilder.buildProject(LifecycleModuleBuilder.java:59)
	at org.apache.maven.lifecycle.internal.LifecycleStarter.singleThreadedBuild(LifecycleStarter.java:183)
	at org.apache.maven.lifecycle.internal.LifecycleStarter.execute(LifecycleStarter.java:161)
	at org.apache.maven.DefaultMaven.doExecute(DefaultMaven.java:319)
	at org.apache.maven.DefaultMaven.execute(DefaultMaven.java:156)
	at org.jvnet.hudson.maven3.launcher.Maven3Launcher.main(Maven3Launcher.java:117)
	at sun.reflect.NativeMethodAccessorImpl.invoke0(Native Method)
	at sun.reflect.NativeMethodAccessorImpl.invoke(NativeMethodAccessorImpl.java:57)
	at sun.reflect.DelegatingMethodAccessorImpl.invoke(DelegatingMethodAccessorImpl.java:43)
	at java.lang.reflect.Method.invoke(Method.java:601)
	at org.codehaus.plexus.classworlds.launcher.Launcher.launchStandard(Launcher.java:329)
	at org.codehaus.plexus.classworlds.launcher.Launcher.launch(Launcher.java:239)
	at org.jvnet.hudson.maven3.agent.Maven3Main.launch(Maven3Main.java:178)
	at sun.reflect.NativeMethodAccessorImpl.invoke0(Native Method)
	at sun.reflect.NativeMethodAccessorImpl.invoke(NativeMethodAccessorImpl.java:57)
	at sun.reflect.DelegatingMethodAccessorImpl.invoke(DelegatingMethodAccessorImpl.java:43)
	at java.lang.reflect.Method.invoke(Method.java:601)
	at hudson.maven.Maven3Builder.call(Maven3Builder.java:130)
	at hudson.maven.Maven3Builder.call(Maven3Builder.java:67)
	at hudson.remoting.UserRequest.perform(UserRequest.java:118)
	at hudson.remoting.UserRequest.perform(UserRequest.java:48)
	at hudson.remoting.Request$2.run(Request.java:326)
	at hudson.remoting.InterceptingExecutorService$1.call(InterceptingExecutorService.java:72)
	at java.util.concurrent.FutureTask$Sync.innerRun(FutureTask.java:334)
	at java.util.concurrent.FutureTask.run(FutureTask.java:166)
	at java.util.concurrent.ThreadPoolExecutor.runWorker(ThreadPoolExecutor.java:1110)
	at java.util.concurrent.ThreadPoolExecutor$Worker.run(ThreadPoolExecutor.java:603)
	at java.lang.Thread.run(Thread.java:722)
Aug 20, 2013 5:08:14 AM org.apache.maven.cli.event.ExecutionEventLogger logReactorSummary
INFO: ------------------------------------------------------------------------
Aug 20, 2013 5:08:14 AM org.apache.maven.cli.event.ExecutionEventLogger logReactorSummary
INFO: Reactor Summary:
Aug 20, 2013 5:08:14 AM org.apache.maven.cli.event.ExecutionEventLogger logReactorSummary
INFO: 
Aug 20, 2013 5:08:14 AM org.apache.maven.cli.event.ExecutionEventLogger logReactorSummary
INFO: ApacheDS JDBM ..................................... SUCCESS [33.243s]
Aug 20, 2013 5:08:14 AM org.apache.maven.cli.event.ExecutionEventLogger logReactorSummary
INFO: ApacheDS JDBM Original Implementation ............. SUCCESS [29.449s]
Aug 20, 2013 5:08:14 AM org.apache.maven.cli.event.ExecutionEventLogger logReactorSummary
INFO: ApacheDS JDBM Implementation MVCC ................. FAILURE [5:00.937s]
Aug 20, 2013 5:08:14 AM org.apache.maven.cli.event.ExecutionEventLogger logResult
INFO: ------------------------------------------------------------------------
Aug 20, 2013 5:08:14 AM org.apache.maven.cli.event.ExecutionEventLogger logResult
INFO: BUILD FAILURE
Aug 20, 2013 5:08:14 AM org.apache.maven.cli.event.ExecutionEventLogger logStats
INFO: ------------------------------------------------------------------------
Aug 20, 2013 5:08:14 AM org.apache.maven.cli.event.ExecutionEventLogger logStats
INFO: Total time: 6:07.684s
Aug 20, 2013 5:08:14 AM org.apache.maven.cli.event.ExecutionEventLogger logStats
INFO: Finished at: Tue Aug 20 05:08:14 BST 2013
Aug 20, 2013 5:08:18 AM org.apache.maven.cli.event.ExecutionEventLogger logStats
INFO: Final Memory: 27M/214M
Aug 20, 2013 5:08:18 AM org.apache.maven.cli.event.ExecutionEventLogger sessionEnded
INFO: ------------------------------------------------------------------------
[JENKINS] Archiving disabled
[JENKINS] Archiving disabled
[JENKINS] Archiving disabled
Waiting for Jenkins to finish collecting data
Maven failed with error.
channel stopped

Mime
View raw message