directory-notifications mailing list archives

Site index · List index
Message view « Date » · « Thread »
Top « Date » · « Thread »
From Apache Jenkins Server <jenk...@builds.apache.org>
Subject Build failed in Jenkins: dir-checkstyle-jdk16-deploy-site » Apache Directory Checkstyle Configuration #1030
Date Tue, 09 Jul 2013 02:10:22 GMT
See <https://builds.apache.org/job/dir-checkstyle-jdk16-deploy-site/org.apache.directory.buildtools$checkstyle-configuration/1030/>

------------------------------------------
<===[JENKINS REMOTING CAPACITY]===>   channel started
log4j:WARN No appenders could be found for logger (org.apache.commons.beanutils.converters.BooleanConverter).
log4j:WARN Please initialize the log4j system properly.
Executing Maven:  -B -f <https://builds.apache.org/job/dir-checkstyle-jdk16-deploy-site/org.apache.directory.buildtools$checkstyle-configuration/ws/pom.xml>
-Dmaven.repo.local=/export/home/hudson/hudson-slave/maven-repositories/1 clean deploy site
[INFO] Scanning for projects...
[INFO]                                                                         
[INFO] ------------------------------------------------------------------------
[INFO] Building Apache Directory Checkstyle Configuration 0.2-SNAPSHOT
[INFO] ------------------------------------------------------------------------
[INFO] 
[INFO] --- maven-clean-plugin:2.4.1:clean (default-clean) @ checkstyle-configuration ---
[INFO] Deleting <https://builds.apache.org/job/dir-checkstyle-jdk16-deploy-site/org.apache.directory.buildtools$checkstyle-configuration/ws/target>
[INFO] 
[INFO] --- maven-remote-resources-plugin:1.2.1:process (default) @ checkstyle-configuration
---
[INFO] 
[INFO] --- maven-resources-plugin:2.5:resources (default-resources) @ checkstyle-configuration
---[debug] execute contextualize
[INFO] Using 'UTF-8' encoding to copy filtered resources.

[INFO] Copying 1 resource
[INFO] Copying 3 resources
[INFO] 
[INFO] --- maven-compiler-plugin:2.5.1:compile (default-compile) @ checkstyle-configuration
---
[INFO] No sources to compile
[INFO] 
[INFO] [debug] execute contextualize
[INFO] Using 'UTF-8' encoding to copy filtered resources.
[INFO] skip non existing resourceDirectory <https://builds.apache.org/job/dir-checkstyle-jdk16-deploy-site/org.apache.directory.buildtools$checkstyle-configuration/ws/src/test/resources>
[INFO] Copying 3 resources
--- maven-resources-plugin:2.5:testResources (default-testResources) @ checkstyle-configuration
---
[INFO] 
[INFO] --- maven-compiler-plugin:2.5.1:testCompile (default-testCompile) @ checkstyle-configuration
---
[INFO] No sources to compile
[INFO] 
[INFO] --- maven-surefire-plugin:2.12:test (default-test) @ checkstyle-configuration ---
[INFO] Surefire report directory: <https://builds.apache.org/job/dir-checkstyle-jdk16-deploy-site/org.apache.directory.buildtools$checkstyle-configuration/ws/target/surefire-reports>

-------------------------------------------------------
 T E S T S
-------------------------------------------------------

Results :

Tests run: 0, Failures: 0, Errors: 0, Skipped: 0

[JENKINS] Recording test results
[INFO] 
[INFO] --- maven-jar-plugin:2.4:jar (default-jar) @ checkstyle-configuration ---
[INFO] Building jar: <https://builds.apache.org/job/dir-checkstyle-jdk16-deploy-site/org.apache.directory.buildtools$checkstyle-configuration/ws/target/checkstyle-configuration-0.2-SNAPSHOT.jar>
[INFO] 
[INFO] --- maven-site-plugin:3.1:attach-descriptor (attach-descriptor) @ checkstyle-configuration
---
[INFO] 
[INFO] --- tools-maven-plugin:1.4:verify-legal-files (verify-legal-files) @ checkstyle-configuration
---
[INFO] Checking legal files in: checkstyle-configuration-0.2-SNAPSHOT.jar
[INFO] 
[INFO] --- maven-install-plugin:2.3.1:install (default-install) @ checkstyle-configuration
---[INFO] Installing <https://builds.apache.org/job/dir-checkstyle-jdk16-deploy-site/org.apache.directory.buildtools$checkstyle-configuration/ws/target/checkstyle-configuration-0.2-SNAPSHOT.jar>
to /export/home/hudson/hudson-slave/maven-repositories/1/org/apache/directory/buildtools/checkstyle-configuration/0.2-SNAPSHOT/checkstyle-configuration-0.2-SNAPSHOT.jar
[INFO] Installing <https://builds.apache.org/job/dir-checkstyle-jdk16-deploy-site/org.apache.directory.buildtools$checkstyle-configuration/ws/pom.xml>
to /export/home/hudson/hudson-slave/maven-repositories/1/org/apache/directory/buildtools/checkstyle-configuration/0.2-SNAPSHOT/checkstyle-configuration-0.2-SNAPSHOT.pom

[INFO] 
[INFO] --- maven-deploy-plugin:2.7:deploy (default-deploy) @ checkstyle-configuration ---
Downloading: https://repository.apache.org/content/repositories/snapshots/org/apache/directory/buildtools/checkstyle-configuration/0.2-SNAPSHOT/maven-metadata.xml
Downloaded: https://repository.apache.org/content/repositories/snapshots/org/apache/directory/buildtools/checkstyle-configuration/0.2-SNAPSHOT/maven-metadata.xml
(805 B at 0.2 KB/sec)
Uploading: https://repository.apache.org/content/repositories/snapshots/org/apache/directory/buildtools/checkstyle-configuration/0.2-SNAPSHOT/checkstyle-configuration-0.2-20130709.020832-945.jar
Uploaded: https://repository.apache.org/content/repositories/snapshots/org/apache/directory/buildtools/checkstyle-configuration/0.2-SNAPSHOT/checkstyle-configuration-0.2-20130709.020832-945.jar
(10 KB at 5.6 KB/sec)
Uploading: https://repository.apache.org/content/repositories/snapshots/org/apache/directory/buildtools/checkstyle-configuration/0.2-SNAPSHOT/checkstyle-configuration-0.2-20130709.020832-945.pom
Uploaded: https://repository.apache.org/content/repositories/snapshots/org/apache/directory/buildtools/checkstyle-configuration/0.2-SNAPSHOT/checkstyle-configuration-0.2-20130709.020832-945.pom
(3 KB at 1.3 KB/sec)
Downloading: https://repository.apache.org/content/repositories/snapshots/org/apache/directory/buildtools/checkstyle-configuration/maven-metadata.xml
Downloaded: https://repository.apache.org/content/repositories/snapshots/org/apache/directory/buildtools/checkstyle-configuration/maven-metadata.xml
(351 B at 0.2 KB/sec)
Uploading: https://repository.apache.org/content/repositories/snapshots/org/apache/directory/buildtools/checkstyle-configuration/0.2-SNAPSHOT/maven-metadata.xml
Uploaded: https://repository.apache.org/content/repositories/snapshots/org/apache/directory/buildtools/checkstyle-configuration/0.2-SNAPSHOT/maven-metadata.xml
(805 B at 0.5 KB/sec)
Uploading: https://repository.apache.org/content/repositories/snapshots/org/apache/directory/buildtools/checkstyle-configuration/maven-metadata.xml
Uploaded: https://repository.apache.org/content/repositories/snapshots/org/apache/directory/buildtools/checkstyle-configuration/maven-metadata.xml
(351 B at 0.2 KB/sec)
[INFO] 
[INFO] --- maven-site-plugin:3.1:site (default-site) @ checkstyle-configuration ---
[INFO] configuring report plugin org.apache.maven.plugins:maven-project-info-reports-plugin:2.4
[INFO] configuring report plugin org.apache.rat:apache-rat-plugin:0.8
[INFO] configuring report plugin org.codehaus.mojo:versions-maven-plugin:1.2
[INFO] Parent project loaded from repository: org.apache.directory.project:project:pom:28
[FINDBUGS] No report found for mojo site
[PMD] No report found for mojo site
[INFO] ------------------------------------------------------------------------
[INFO] BUILD FAILURE
[INFO] ------------------------------------------------------------------------
[INFO] Total time: 5:05.153s
[INFO] Finished at: Tue Jul 09 02:09:36 GMT+00:00 2013
[INFO] Final Memory: 19M/91M
[INFO] ------------------------------------------------------------------------
[JENKINS] Archiving <https://builds.apache.org/job/dir-checkstyle-jdk16-deploy-site/org.apache.directory.buildtools$checkstyle-configuration/ws/pom.xml>
to /home/hudson/hudson/jobs/dir-checkstyle-jdk16-deploy-site/modules/org.apache.directory.buildtools$checkstyle-configuration/builds/2013-07-09_02-01-50/archive/org.apache.directory.buildtools/checkstyle-configuration/0.2-SNAPSHOT/checkstyle-configuration-0.2-SNAPSHOT.pom
[JENKINS] Archiving <https://builds.apache.org/job/dir-checkstyle-jdk16-deploy-site/org.apache.directory.buildtools$checkstyle-configuration/ws/target/checkstyle-configuration-0.2-SNAPSHOT.jar>
to /home/hudson/hudson/jobs/dir-checkstyle-jdk16-deploy-site/modules/org.apache.directory.buildtools$checkstyle-configuration/builds/2013-07-09_02-01-50/archive/org.apache.directory.buildtools/checkstyle-configuration/0.2-20130709.020832-945/checkstyle-configuration-0.2-20130709.020832-945.jar
Waiting for Jenkins to finish collecting data
mavenExecutionResult exceptions not empty
message : Failed to execute goal org.apache.maven.plugins:maven-site-plugin:3.1:site (default-site)
on project checkstyle-configuration: SiteToolException: IOException: cannot interpolate environment
properties: Cannot run program "env": error=12, Not enough space
cause : SiteToolException: IOException: cannot interpolate environment properties: Cannot
run program "env": error=12, Not enough space
Stack trace : 
org.apache.maven.lifecycle.LifecycleExecutionException: Failed to execute goal org.apache.maven.plugins:maven-site-plugin:3.1:site
(default-site) on project checkstyle-configuration: SiteToolException: IOException: cannot
interpolate environment properties: Cannot run program "env": error=12, Not enough space
	at org.apache.maven.lifecycle.internal.MojoExecutor.execute(MojoExecutor.java:217)
	at org.apache.maven.lifecycle.internal.MojoExecutor.execute(MojoExecutor.java:153)
	at org.apache.maven.lifecycle.internal.MojoExecutor.execute(MojoExecutor.java:145)
	at org.apache.maven.lifecycle.internal.LifecycleModuleBuilder.buildProject(LifecycleModuleBuilder.java:84)
	at org.apache.maven.lifecycle.internal.LifecycleModuleBuilder.buildProject(LifecycleModuleBuilder.java:59)
	at org.apache.maven.lifecycle.internal.LifecycleStarter.singleThreadedBuild(LifecycleStarter.java:183)
	at org.apache.maven.lifecycle.internal.LifecycleStarter.execute(LifecycleStarter.java:161)
	at org.apache.maven.DefaultMaven.doExecute(DefaultMaven.java:320)
	at org.apache.maven.DefaultMaven.execute(DefaultMaven.java:156)
	at org.jvnet.hudson.maven3.launcher.Maven3Launcher.main(Maven3Launcher.java:79)
	at sun.reflect.NativeMethodAccessorImpl.invoke0(Native Method)
	at sun.reflect.NativeMethodAccessorImpl.invoke(NativeMethodAccessorImpl.java:39)
	at sun.reflect.DelegatingMethodAccessorImpl.invoke(DelegatingMethodAccessorImpl.java:25)
	at java.lang.reflect.Method.invoke(Method.java:597)
	at org.codehaus.plexus.classworlds.launcher.Launcher.launchStandard(Launcher.java:329)
	at org.codehaus.plexus.classworlds.launcher.Launcher.launch(Launcher.java:239)
	at org.jvnet.hudson.maven3.agent.Maven3Main.launch(Maven3Main.java:158)
	at hudson.maven.Maven3Builder.call(Maven3Builder.java:100)
	at hudson.maven.Maven3Builder.call(Maven3Builder.java:66)
	at hudson.remoting.UserRequest.perform(UserRequest.java:118)
	at hudson.remoting.UserRequest.perform(UserRequest.java:48)
	at hudson.remoting.Request$2.run(Request.java:326)
	at hudson.remoting.InterceptingExecutorService$1.call(InterceptingExecutorService.java:72)
	at java.util.concurrent.FutureTask$Sync.innerRun(FutureTask.java:303)
	at java.util.concurrent.FutureTask.run(FutureTask.java:138)
	at java.util.concurrent.ThreadPoolExecutor$Worker.runTask(ThreadPoolExecutor.java:886)
	at java.util.concurrent.ThreadPoolExecutor$Worker.run(ThreadPoolExecutor.java:908)
	at java.lang.Thread.run(Thread.java:662)
Caused by: org.apache.maven.plugin.MojoExecutionException: SiteToolException: IOException:
cannot interpolate environment properties: Cannot run program "env": error=12, Not enough
space
	at org.apache.maven.plugins.site.AbstractSiteRenderingMojo.createSiteRenderingContext(AbstractSiteRenderingMojo.java:300)
	at org.apache.maven.plugins.site.SiteMojo.renderLocale(SiteMojo.java:154)
	at org.apache.maven.plugins.site.SiteMojo.execute(SiteMojo.java:138)
	at org.apache.maven.plugin.DefaultBuildPluginManager.executeMojo(DefaultBuildPluginManager.java:101)
	at org.apache.maven.lifecycle.internal.MojoExecutor.execute(MojoExecutor.java:209)
	... 27 more
Caused by: org.apache.maven.doxia.tools.SiteToolException: IOException: cannot interpolate
environment properties: Cannot run program "env": error=12, Not enough space
	at org.apache.maven.doxia.tools.DefaultSiteTool.getInterpolatedSiteDescriptorContent(DefaultSiteTool.java:604)
	at org.apache.maven.doxia.tools.DefaultSiteTool.getDecorationModel(DefaultSiteTool.java:1189)
	at org.apache.maven.doxia.tools.DefaultSiteTool.getDecorationModel(DefaultSiteTool.java:458)
	at org.apache.maven.plugins.site.AbstractSiteRenderingMojo.createSiteRenderingContext(AbstractSiteRenderingMojo.java:293)
	... 31 more
Caused by: java.io.IOException: Cannot run program "env": error=12, Not enough space
	at java.lang.ProcessBuilder.start(ProcessBuilder.java:460)
	at java.lang.Runtime.exec(Runtime.java:593)
	at java.lang.Runtime.exec(Runtime.java:431)
	at java.lang.Runtime.exec(Runtime.java:328)
	at org.codehaus.plexus.interpolation.os.OperatingSystemUtils.getSystemEnvVars(OperatingSystemUtils.java:86)
	at org.codehaus.plexus.interpolation.EnvarBasedValueSource.getEnvars(EnvarBasedValueSource.java:74)
	at org.codehaus.plexus.interpolation.EnvarBasedValueSource.<init>(EnvarBasedValueSource.java:64)
	at org.codehaus.plexus.interpolation.EnvarBasedValueSource.<init>(EnvarBasedValueSource.java:50)
	at org.apache.maven.doxia.tools.DefaultSiteTool.getInterpolatedSiteDescriptorContent(DefaultSiteTool.java:599)
	... 34 more
Caused by: java.io.IOException: error=12, Not enough space
	at java.lang.UNIXProcess.forkAndExec(Native Method)
	at java.lang.UNIXProcess.<init>(UNIXProcess.java:53)
	at java.lang.ProcessImpl.start(ProcessImpl.java:65)
	at java.lang.ProcessBuilder.start(ProcessBuilder.java:453)
	... 42 more

Mime
View raw message