directory-notifications mailing list archives

Site index · List index
Message view « Date » · « Thread »
Top « Date » · « Thread »
From Apache Jenkins Server <jenk...@builds.apache.org>
Subject Build failed in Jenkins: dir-studio-jdk16-win #880
Date Mon, 01 Jul 2013 04:17:02 GMT
See <https://builds.apache.org/job/dir-studio-jdk16-win/880/>

------------------------------------------
[...truncated 2706 lines...]
[INFO] 
[INFO] --- maven-compiler-plugin:3.1:testCompile (default-testCompile) @ ldapservers.apacheds.v157
---
[INFO] Nothing to compile - all classes are up to date
[INFO] 
[INFO] --- maven-surefire-plugin:2.15:test (default-test) @ ldapservers.apacheds.v157 ---
[INFO] Tests are skipped.
[INFO] 
[INFO] --- maven-jar-plugin:2.4:jar (default-jar) @ ldapservers.apacheds.v157 ---
[INFO] Building jar: F:\hudson\hudson-slave\workspace\dir-studio-jdk16-win\trunk\plugins\ldapservers.apacheds.v157\target\ldapservers.apacheds.v157-2.0.0-SNAPSHOT.jar
[INFO] 
[INFO] --- maven-site-plugin:3.3:attach-descriptor (attach-descriptor) @ ldapservers.apacheds.v157
---
[INFO] [INFO] Checking legal files in: ldapservers.apacheds.v157-2.0.0-SNAPSHOT.jar

[INFO] --- tools-maven-plugin:1.4:verify-legal-files (verify-legal-files) @ ldapservers.apacheds.v157
---
[INFO] [INFO] Installing F:\hudson\hudson-slave\workspace\dir-studio-jdk16-win\trunk\plugins\ldapservers.apacheds.v157\target\ldapservers.apacheds.v157-2.0.0-SNAPSHOT.jar
to f:\hudson\hudson-slave\maven-repositories\1\org\apache\directory\studio\ldapservers.apacheds.v157\2.0.0-SNAPSHOT\ldapservers.apacheds.v157-2.0.0-SNAPSHOT.jar

[INFO] --- maven-install-plugin:2.4:install (default-install) @ ldapservers.apacheds.v157
---
[INFO] Installing F:\hudson\hudson-slave\workspace\dir-studio-jdk16-win\trunk\plugins\ldapservers.apacheds.v157\pom.xml
to f:\hudson\hudson-slave\maven-repositories\1\org\apache\directory\studio\ldapservers.apacheds.v157\2.0.0-SNAPSHOT\ldapservers.apacheds.v157-2.0.0-SNAPSHOT.pom
[INFO]                                                                         
[INFO] ------------------------------------------------------------------------
[INFO] Building Apache Directory Studio ApacheDS 2.0.0 LDAP Server Adapter 2.0.0-SNAPSHOT
[INFO] ------------------------------------------------------------------------
[INFO] 
[INFO] --- maven-clean-plugin:2.4.1:clean (default-clean) @ ldapservers.apacheds.v200 ---
[INFO] Deleting F:\hudson\hudson-slave\workspace\dir-studio-jdk16-win\trunk\plugins\ldapservers.apacheds.v200\target
[INFO] 
[INFO] --- maven-remote-resources-plugin:1.2.1:process (default) @ ldapservers.apacheds.v200
---
[INFO] [INFO] Using 'UTF-8' encoding to copy filtered resources.
[INFO] Copying 4 resources

[INFO] --- maven-resources-plugin:2.6:resources (default-resources) @ ldapservers.apacheds.v200
---
[INFO] Copying 30 resources to resources
[INFO] Copying 3 resources
[INFO] Copying 3 resources
[INFO] 
[INFO] --- studio-maven-plugin:1.0.5:prepare-jar-package (default) @ ldapservers.apacheds.v200
---
[INFO] 
[INFO] --- maven-dependency-plugin:2.8:copy (copy-apacheds-2.0.0-libraries) @ ldapservers.apacheds.v200
---
[INFO] Configured Artifact: org.apache.directory.server:apacheds-service:2.0.0-M14:jar
Downloading: file://F:\hudson\hudson-slave\workspace\dir-studio-jdk16-win\trunk\plugins\ldapservers.apacheds.v200/org/apache/directory/server/apacheds-service/2.0.0-M14/apacheds-service-2.0.0-M14.jar
Downloading: http://repo1.maven.org/maven2/org/apache/directory/server/apacheds-service/2.0.0-M14/apacheds-service-2.0.0-M14.jar
[INFO] ------------------------------------------------------------------------
[INFO] Reactor Summary:
[INFO] 
[INFO] Apache Directory Studio ........................... SUCCESS [10.657s]
[INFO] Apache Directory Studio Repository ................ SUCCESS [20.775s]
[INFO] Apache Directory Studio Libraries Plugins ......... SUCCESS [0.141s]
[INFO] SLF4J API Module (for Apache Directory Studio) .... SUCCESS [14.902s]
[INFO] Ehcache Core (for Apache Directory Studio) ........ SUCCESS [2.500s]
[INFO] AntLR Parser Generator (for Apache Directory Studio)  SUCCESS [1.235s]
[INFO] Apache Commons Codec (for Apache Directory Studio)  SUCCESS [1.075s]
[INFO] Apache Commons Collections (for Apache Directory Studio)  SUCCESS [1.739s]
[INFO] Apache Commons IO (for Apache Directory Studio) ... SUCCESS [0.961s]
[INFO] Apache Commons Lang (for Apache Directory Studio) . SUCCESS [1.279s]
[INFO] Apache Commons Logging (for Apache Directory Studio)  SUCCESS [1.223s]
[INFO] Apache Commons Pool (for Apache Directory Studio) . SUCCESS [1.247s]
[INFO] Apache HttpComponents Core (for Apache Directory Studio)  SUCCESS [0.951s]
[INFO] Apache HttpComponents Client (for Apache Directory Studio)  SUCCESS [1.148s]
[INFO] Log4j (for Apache Directory Studio) ............... SUCCESS [1.047s]
[INFO] Legion of the Bouncy Castle Java Cryptography APIs (for Apache Directory Studio)  SUCCESS
[1.576s]
[INFO] dom4j (for Apache Directory Studio) ............... SUCCESS [1.143s]
[INFO] SLF4J LOG4J-12 Binding (for Apache Directory Studio)  SUCCESS [0.683s]
[INFO] XPP3 (for Apache Directory Studio) ................ SUCCESS [0.776s]
[INFO] Apache Directory Studio Plugins ................... SUCCESS [0.114s]
[INFO] Apache Directory Studio Common UI ................. SUCCESS [4.281s]
[INFO] Apache Directory Studio Common Core ............... SUCCESS [1.630s]
[INFO] Apache Directory Studio LDIF Parser ............... SUCCESS [8.827s]
[INFO] Apache Directory Studio Connection Core ........... SUCCESS [11.228s]
[INFO] Apache Directory Studio Connection UI ............. SUCCESS [10.717s]
[INFO] Apache Directory Studio LDAP Browser Core ......... SUCCESS [18.052s]
[INFO] Apache Directory Studio LDAP Browser Common ....... SUCCESS [16.801s]
[INFO] Apache Directory Studio Value Editors ............. SUCCESS [9.047s]
[INFO] Apache Directory Studio ACI Item Editor ........... SUCCESS [4.246s]
[INFO] Apache Directory Studio ApacheDS Launcher ......... SUCCESS [4.375s]
[INFO] Apache Directory Studio ApacheDS Configuration .... SUCCESS [11.917s]
[INFO] Apache Directory Studio ApacheDS 2.0 Configuration  SUCCESS [6.778s]
[INFO] Apache Directory Studio LDIF Editor ............... SUCCESS [4.709s]
[INFO] Apache Directory Studio LDAP Browser UI ........... SUCCESS [11.713s]
[INFO] Apache Directory Studio LDAP Servers .............. SUCCESS [5.719s]
[INFO] Apache Directory Studio ApacheDS 1.5.3 LDAP Server Adapter  SUCCESS [7.446s]
[INFO] Apache Directory Studio ApacheDS 1.5.4 LDAP Server Adapter  SUCCESS [4.830s]
[INFO] Apache Directory Studio ApacheDS 1.5.5 LDAP Server Adapter  SUCCESS [5.236s]
[INFO] Apache Directory Studio ApacheDS 1.5.6 LDAP Server Adapter  SUCCESS [8.114s]
[INFO] Apache Directory Studio ApacheDS 1.5.7 LDAP Server Adapter  SUCCESS [6.172s]
[INFO] Apache Directory Studio ApacheDS 2.0.0 LDAP Server Adapter  FAILURE [59.414s]
[INFO] Apache Directory Studio RCP ....................... SKIPPED
[INFO] Apache Directory Studio Schema Editor ............. SKIPPED
[INFO] Apache Directory Studio Help Plugins .............. SKIPPED
[INFO] Apache Directory Studio Apache DS Help ............ SKIPPED
[INFO] Apache Directory Studio Apache DS Configuration Help  SKIPPED
[INFO] Apache Directory Studio LDAP Browser Help ......... SKIPPED
[INFO] Apache Directory Studio LDIF Editor Help .......... SKIPPED
[INFO] Apache Directory Studio RCP Help .................. SKIPPED
[INFO] Apache Directory Studio Schema Editor Help ........ SKIPPED
[INFO] Apache Directory Studio Feature Plugins ........... SKIPPED
[INFO] Apache Directory Studio ApacheDS Configuration Feature  SKIPPED
[INFO] Apache Directory Studio ApacheDS 2.0 Configuration Feature  SKIPPED
[INFO] Apache Directory Studio ApacheDS Feature .......... SKIPPED
[INFO] Apache Directory Studio LDAP Browser Feature ...... SKIPPED
[INFO] Apache Directory Studio LDAP Servers Feature ...... SKIPPED
[INFO] Apache Directory Studio LDIF Editor Feature ....... SKIPPED
[INFO] Apache Directory Studio RCP Feature ............... SKIPPED
[INFO] Apache Directory Studio Schema Editor Feature ..... SKIPPED
[INFO] ------------------------------------------------------------------------
[INFO] BUILD FAILURE
[INFO] ------------------------------------------------------------------------
[INFO] Total time: 4:54.079s
[INFO] Finished at: Mon Jul 01 05:15:48 BST 2013
[INFO] Final Memory: 89M/256M
[INFO] ------------------------------------------------------------------------
[JENKINS] Archiving disabled
[JENKINS] Archiving disabled
[JENKINS] Archiving disabled
[JENKINS] Archiving disabled
[JENKINS] Archiving disabled
[JENKINS] Archiving disabled
[JENKINS] Archiving disabled
[JENKINS] Archiving disabled
[JENKINS] Archiving disabled
[JENKINS] Archiving disabled
[JENKINS] Archiving disabled
[JENKINS] Archiving disabled
[JENKINS] Archiving disabled
[JENKINS] Archiving disabled
[JENKINS] Archiving disabled
[JENKINS] Archiving disabled
[JENKINS] Archiving disabled
[JENKINS] Archiving disabled
[JENKINS] Archiving disabled
[JENKINS] Archiving disabled
[JENKINS] Archiving disabled
[JENKINS] Archiving disabled
[JENKINS] Archiving disabled
[JENKINS] Archiving disabled
[JENKINS] Archiving disabled
[JENKINS] Archiving disabled
[JENKINS] Archiving disabled
[JENKINS] Archiving disabled
[JENKINS] Archiving disabled
[JENKINS] Archiving disabled
[JENKINS] Archiving disabled
[JENKINS] Archiving disabled
[JENKINS] Archiving disabled
[JENKINS] Archiving disabled
[JENKINS] Archiving disabled
[JENKINS] Archiving disabled
[JENKINS] Archiving disabled
[JENKINS] Archiving disabled
[JENKINS] Archiving disabled
[JENKINS] Archiving disabled
[JENKINS] Archiving disabled
[JENKINS] Archiving disabled
[JENKINS] Archiving disabled
[JENKINS] Archiving disabled
[JENKINS] Archiving disabled
[JENKINS] Archiving disabled
[JENKINS] Archiving disabled
[JENKINS] Archiving disabled
[JENKINS] Archiving disabled
[JENKINS] Archiving disabled
[JENKINS] Archiving disabled
[JENKINS] Archiving disabled
[JENKINS] Archiving disabled
[JENKINS] Archiving disabled
[JENKINS] Archiving disabled
[JENKINS] Archiving disabled
[JENKINS] Archiving disabled
[JENKINS] Archiving disabled
[JENKINS] Archiving disabled
Waiting for Jenkins to finish collecting data
mavenExecutionResult exceptions not empty
message : Failed to execute goal org.apache.maven.plugins:maven-dependency-plugin:2.8:copy
(copy-apacheds-2.0.0-libraries) on project ldapservers.apacheds.v200: Unable to find artifact.
cause : Unable to find artifact.
Stack trace : 
org.apache.maven.lifecycle.LifecycleExecutionException: Failed to execute goal org.apache.maven.plugins:maven-dependency-plugin:2.8:copy
(copy-apacheds-2.0.0-libraries) on project ldapservers.apacheds.v200: Unable to find artifact.
	at org.apache.maven.lifecycle.internal.MojoExecutor.execute(MojoExecutor.java:217)
	at org.apache.maven.lifecycle.internal.MojoExecutor.execute(MojoExecutor.java:153)
	at org.apache.maven.lifecycle.internal.MojoExecutor.execute(MojoExecutor.java:145)
	at org.apache.maven.lifecycle.internal.LifecycleModuleBuilder.buildProject(LifecycleModuleBuilder.java:84)
	at org.apache.maven.lifecycle.internal.LifecycleModuleBuilder.buildProject(LifecycleModuleBuilder.java:59)
	at org.apache.maven.lifecycle.internal.LifecycleStarter.singleThreadedBuild(LifecycleStarter.java:183)
	at org.apache.maven.lifecycle.internal.LifecycleStarter.execute(LifecycleStarter.java:161)
	at org.apache.maven.DefaultMaven.doExecute(DefaultMaven.java:319)
	at org.apache.maven.DefaultMaven.execute(DefaultMaven.java:156)
	at org.jvnet.hudson.maven3.launcher.Maven3Launcher.main(Maven3Launcher.java:79)
	at sun.reflect.NativeMethodAccessorImpl.invoke0(Native Method)
	at sun.reflect.NativeMethodAccessorImpl.invoke(NativeMethodAccessorImpl.java:39)
	at sun.reflect.DelegatingMethodAccessorImpl.invoke(DelegatingMethodAccessorImpl.java:25)
	at java.lang.reflect.Method.invoke(Method.java:597)
	at org.codehaus.plexus.classworlds.launcher.Launcher.launchStandard(Launcher.java:329)
	at org.codehaus.plexus.classworlds.launcher.Launcher.launch(Launcher.java:239)
	at org.jvnet.hudson.maven3.agent.Maven3Main.launch(Maven3Main.java:158)
	at hudson.maven.Maven3Builder.call(Maven3Builder.java:100)
	at hudson.maven.Maven3Builder.call(Maven3Builder.java:66)
	at hudson.remoting.UserRequest.perform(UserRequest.java:118)
	at hudson.remoting.UserRequest.perform(UserRequest.java:48)
	at hudson.remoting.Request$2.run(Request.java:326)
	at hudson.remoting.InterceptingExecutorService$1.call(InterceptingExecutorService.java:72)
	at java.util.concurrent.FutureTask$Sync.innerRun(FutureTask.java:303)
	at java.util.concurrent.FutureTask.run(FutureTask.java:138)
	at java.util.concurrent.ThreadPoolExecutor$Worker.runTask(ThreadPoolExecutor.java:886)
	at java.util.concurrent.ThreadPoolExecutor$Worker.run(ThreadPoolExecutor.java:908)
	at java.lang.Thread.run(Thread.java:662)
Caused by: org.apache.maven.plugin.MojoExecutionException: Unable to find artifact.
	at org.apache.maven.plugin.dependency.fromConfiguration.AbstractFromConfigurationMojo.getArtifact(AbstractFromConfigurationMojo.java:265)
	at org.apache.maven.plugin.dependency.fromConfiguration.AbstractFromConfigurationMojo.getProcessedArtifactItems(AbstractFromConfigurationMojo.java:171)
	at org.apache.maven.plugin.dependency.fromConfiguration.CopyMojo.doExecute(CopyMojo.java:105)
	at org.apache.maven.plugin.dependency.AbstractDependencyMojo.execute(AbstractDependencyMojo.java:167)
	at org.apache.maven.plugin.DefaultBuildPluginManager.executeMojo(DefaultBuildPluginManager.java:107)
	at org.apache.maven.lifecycle.internal.MojoExecutor.execute(MojoExecutor.java:209)
	... 27 more
Caused by: org.apache.maven.artifact.resolver.ArtifactNotFoundException: Could not find artifact
org.apache.directory.server:apacheds-service:jar:2.0.0-M14 in studio.repository (file://F:\hudson\hudson-slave\workspace\dir-studio-jdk16-win\trunk\plugins\ldapservers.apacheds.v200)

Try downloading the file manually from the project website.

Then, install it using the command: 
    mvn install:install-file -DgroupId=org.apache.directory.server -DartifactId=apacheds-service
-Dversion=2.0.0-M14 -Dpackaging=jar -Dfile=/path/to/file

Alternatively, if you host your own repository you can deploy the file there: 
    mvn deploy:deploy-file -DgroupId=org.apache.directory.server -DartifactId=apacheds-service
-Dversion=2.0.0-M14 -Dpackaging=jar -Dfile=/path/to/file -Durl=[url] -DrepositoryId=[id]


  org.apache.directory.server:apacheds-service:jar:2.0.0-M14

from the specified remote repositories:
  studio.repository (file://F:\hudson\hudson-slave\workspace\dir-studio-jdk16-win\trunk\plugins\ldapservers.apacheds.v200,
releases=true, snapshots=true),
  Nexus (http://repository.apache.org/snapshots, releases=false, snapshots=true),
  central (http://repo1.maven.org/maven2, releases=true, snapshots=false)

	at org.apache.maven.artifact.resolver.DefaultArtifactResolver.resolve(DefaultArtifactResolver.java:235)
	at org.apache.maven.artifact.resolver.DefaultArtifactResolver.resolve(DefaultArtifactResolver.java:173)
	at org.apache.maven.artifact.resolver.DefaultArtifactResolver.resolve(DefaultArtifactResolver.java:541)
	at org.apache.maven.plugin.dependency.fromConfiguration.AbstractFromConfigurationMojo.getArtifact(AbstractFromConfigurationMojo.java:257)
	... 32 more
Caused by: org.sonatype.aether.resolution.ArtifactResolutionException: Could not find artifact
org.apache.directory.server:apacheds-service:jar:2.0.0-M14 in studio.repository (file://F:\hudson\hudson-slave\workspace\dir-studio-jdk16-win\trunk\plugins\ldapservers.apacheds.v200)
	at org.sonatype.aether.impl.internal.DefaultArtifactResolver.resolveArtifacts(DefaultArtifactResolver.java:526)
	at org.sonatype.aether.impl.internal.DefaultArtifactResolver.resolveArtifact(DefaultArtifactResolver.java:214)
	at org.sonatype.aether.impl.internal.DefaultRepositorySystem.resolveArtifact(DefaultRepositorySystem.java:296)
	at org.apache.maven.artifact.resolver.DefaultArtifactResolver.resolve(DefaultArtifactResolver.java:229)
	... 35 more
Caused by: org.sonatype.aether.transfer.ArtifactNotFoundException: Could not find artifact
org.apache.directory.server:apacheds-service:jar:2.0.0-M14 in studio.repository (file://F:\hudson\hudson-slave\workspace\dir-studio-jdk16-win\trunk\plugins\ldapservers.apacheds.v200)
	at org.sonatype.aether.connector.wagon.WagonRepositoryConnector$4.wrap(WagonRepositoryConnector.java:945)
	at org.sonatype.aether.connector.wagon.WagonRepositoryConnector$4.wrap(WagonRepositoryConnector.java:940)
	at org.sonatype.aether.connector.wagon.WagonRepositoryConnector$GetTask.flush(WagonRepositoryConnector.java:696)
	at org.sonatype.aether.connector.wagon.WagonRepositoryConnector$GetTask.flush(WagonRepositoryConnector.java:690)
	at org.sonatype.aether.connector.wagon.WagonRepositoryConnector.get(WagonRepositoryConnector.java:435)
	at org.sonatype.aether.impl.internal.DefaultArtifactResolver.resolveArtifacts(DefaultArtifactResolver.java:438)
	... 38 more
channel stopped

Mime
View raw message