directory-notifications mailing list archives

Site index · List index
Message view « Date » · « Thread »
Top « Date » · « Thread »
From Apache Jenkins Server <jenk...@builds.apache.org>
Subject Build failed in Jenkins: dir-apacheds-jdk16-ubuntu-deploy #1010
Date Mon, 03 Jun 2013 04:59:07 GMT
See <https://builds.apache.org/job/dir-apacheds-jdk16-ubuntu-deploy/1010/>

------------------------------------------
[...truncated 4597 lines...]
Uploading: https://repository.apache.org/content/repositories/snapshots/org/apache/directory/server/apacheds-kerberos-test/2.0.0-M13-SNAPSHOT/apacheds-kerberos-test-2.0.0-M13-20130603.044039-18.jar
Uploaded: https://repository.apache.org/content/repositories/snapshots/org/apache/directory/server/apacheds-kerberos-test/2.0.0-M13-SNAPSHOT/apacheds-kerberos-test-2.0.0-M13-20130603.044039-18.jar
(7 KB at 21.8 KB/sec)
Uploading: https://repository.apache.org/content/repositories/snapshots/org/apache/directory/server/apacheds-kerberos-test/2.0.0-M13-SNAPSHOT/apacheds-kerberos-test-2.0.0-M13-20130603.044039-18.pom
Uploaded: https://repository.apache.org/content/repositories/snapshots/org/apache/directory/server/apacheds-kerberos-test/2.0.0-M13-SNAPSHOT/apacheds-kerberos-test-2.0.0-M13-20130603.044039-18.pom
(5 KB at 13.1 KB/sec)
Downloading: https://repository.apache.org/content/repositories/snapshots/org/apache/directory/server/apacheds-kerberos-test/maven-metadata.xml
Downloaded: https://repository.apache.org/content/repositories/snapshots/org/apache/directory/server/apacheds-kerberos-test/maven-metadata.xml
(417 B at 2.2 KB/sec)
Uploading: https://repository.apache.org/content/repositories/snapshots/org/apache/directory/server/apacheds-kerberos-test/2.0.0-M13-SNAPSHOT/maven-metadata.xml
Uploaded: https://repository.apache.org/content/repositories/snapshots/org/apache/directory/server/apacheds-kerberos-test/2.0.0-M13-SNAPSHOT/maven-metadata.xml
(2 KB at 3.9 KB/sec)
Uploading: https://repository.apache.org/content/repositories/snapshots/org/apache/directory/server/apacheds-kerberos-test/maven-metadata.xml
Uploaded: https://repository.apache.org/content/repositories/snapshots/org/apache/directory/server/apacheds-kerberos-test/maven-metadata.xml
(417 B at 1.2 KB/sec)
Uploading: https://repository.apache.org/content/repositories/snapshots/org/apache/directory/server/apacheds-kerberos-test/2.0.0-M13-SNAPSHOT/apacheds-kerberos-test-2.0.0-M13-20130603.044039-18-tests.jar
Uploaded: https://repository.apache.org/content/repositories/snapshots/org/apache/directory/server/apacheds-kerberos-test/2.0.0-M13-SNAPSHOT/apacheds-kerberos-test-2.0.0-M13-20130603.044039-18-tests.jar
(31 KB at 77.8 KB/sec)
Uploading: https://repository.apache.org/content/repositories/snapshots/org/apache/directory/server/apacheds-kerberos-test/2.0.0-M13-SNAPSHOT/maven-metadata.xml
Uploaded: https://repository.apache.org/content/repositories/snapshots/org/apache/directory/server/apacheds-kerberos-test/2.0.0-M13-SNAPSHOT/maven-metadata.xml
(2 KB at 3.4 KB/sec)
Uploading: https://repository.apache.org/content/repositories/snapshots/org/apache/directory/server/apacheds-kerberos-test/2.0.0-M13-SNAPSHOT/apacheds-kerberos-test-2.0.0-M13-20130603.044039-18-sources.jar
Uploaded: https://repository.apache.org/content/repositories/snapshots/org/apache/directory/server/apacheds-kerberos-test/2.0.0-M13-SNAPSHOT/apacheds-kerberos-test-2.0.0-M13-20130603.044039-18-sources.jar
(7 KB at 16.8 KB/sec)
Uploading: https://repository.apache.org/content/repositories/snapshots/org/apache/directory/server/apacheds-kerberos-test/2.0.0-M13-SNAPSHOT/maven-metadata.xml
Uploaded: https://repository.apache.org/content/repositories/snapshots/org/apache/directory/server/apacheds-kerberos-test/2.0.0-M13-SNAPSHOT/maven-metadata.xml
(2 KB at 3.6 KB/sec)
[INFO]                                                                         
[INFO] ------------------------------------------------------------------------
[INFO] Building ApacheDS Server Integration 2.0.0-M13-SNAPSHOT
[INFO] ------------------------------------------------------------------------
Downloading: http://repository.apache.org/snapshots/org/apache/directory/api/api-dsml-engine/1.0.0-M18-SNAPSHOT/maven-metadata.xml
Downloaded: http://repository.apache.org/snapshots/org/apache/directory/api/api-dsml-engine/1.0.0-M18-SNAPSHOT/maven-metadata.xml
(1023 B at 1.2 KB/sec)
Downloading: http://repository.apache.org/snapshots/org/apache/directory/api/api-dsml-engine/1.0.0-M18-SNAPSHOT/api-dsml-engine-1.0.0-M18-20130603.030552-30.pom
Downloaded: http://repository.apache.org/snapshots/org/apache/directory/api/api-dsml-engine/1.0.0-M18-SNAPSHOT/api-dsml-engine-1.0.0-M18-20130603.030552-30.pom
(3 KB at 20.8 KB/sec)
Downloading: http://repository.apache.org/snapshots/org/apache/directory/api/api-dsml-parent/1.0.0-M18-SNAPSHOT/maven-metadata.xml
Downloaded: http://repository.apache.org/snapshots/org/apache/directory/api/api-dsml-parent/1.0.0-M18-SNAPSHOT/maven-metadata.xml
(842 B at 3.2 KB/sec)
Downloading: http://repository.apache.org/snapshots/org/apache/directory/api/api-dsml-parent/1.0.0-M18-SNAPSHOT/api-dsml-parent-1.0.0-M18-20130603.030446-31.pom
Downloaded: http://repository.apache.org/snapshots/org/apache/directory/api/api-dsml-parent/1.0.0-M18-SNAPSHOT/api-dsml-parent-1.0.0-M18-20130603.030446-31.pom
(2 KB at 10.1 KB/sec)
Downloading: http://repository.apache.org/snapshots/org/apache/directory/api/api-dsml-parser/1.0.0-M18-SNAPSHOT/maven-metadata.xml
Downloaded: http://repository.apache.org/snapshots/org/apache/directory/api/api-dsml-parser/1.0.0-M18-SNAPSHOT/maven-metadata.xml
(1023 B at 3.0 KB/sec)
Downloading: http://repository.apache.org/snapshots/org/apache/directory/api/api-dsml-parser/1.0.0-M18-SNAPSHOT/api-dsml-parser-1.0.0-M18-20130603.030458-31.pom
Downloaded: http://repository.apache.org/snapshots/org/apache/directory/api/api-dsml-parser/1.0.0-M18-SNAPSHOT/api-dsml-parser-1.0.0-M18-20130603.030458-31.pom
(4 KB at 31.5 KB/sec)
Downloading: http://repository.apache.org/snapshots/org/apache/directory/api/api-dsml-engine/1.0.0-M18-SNAPSHOT/api-dsml-engine-1.0.0-M18-20130603.030552-30.jar
Downloading: http://repository.apache.org/snapshots/org/apache/directory/api/api-dsml-parser/1.0.0-M18-SNAPSHOT/api-dsml-parser-1.0.0-M18-20130603.030458-31.jar
Downloaded: http://repository.apache.org/snapshots/org/apache/directory/api/api-dsml-engine/1.0.0-M18-SNAPSHOT/api-dsml-engine-1.0.0-M18-20130603.030552-30.jar
(16 KB at 88.6 KB/sec)
Downloaded: http://repository.apache.org/snapshots/org/apache/directory/api/api-dsml-parser/1.0.0-M18-SNAPSHOT/api-dsml-parser-1.0.0-M18-20130603.030458-31.jar
(204 KB at 536.0 KB/sec)
[INFO] [INFO] Deleting <https://builds.apache.org/job/dir-apacheds-jdk16-ubuntu-deploy/ws/trunk/server-integ/target>

[INFO] --- maven-clean-plugin:2.4.1:clean (default-clean) @ apacheds-server-integ ---
[INFO] 
[INFO] --- maven-remote-resources-plugin:1.2.1:process (default) @ apacheds-server-integ ---
[INFO] [debug] execute contextualize
[INFO] Using 'UTF-8' encoding to copy filtered resources.
[INFO] Copying 0 resource
[INFO] Copying 3 resources

[INFO] --- maven-resources-plugin:2.5:resources (default-resources) @ apacheds-server-integ
---
[INFO] Compiling 1 source file to <https://builds.apache.org/job/dir-apacheds-jdk16-ubuntu-deploy/ws/trunk/server-integ/target/classes>
[INFO] 
[INFO] --- maven-compiler-plugin:2.5.1:compile (default-compile) @ apacheds-server-integ ---
[INFO] [INFO] Configured Artifact: org.apache.directory.api:api-ldap-extras-codec:?:jar
[INFO] Copying api-ldap-extras-codec-1.0.0-M18-SNAPSHOT.jar to <https://builds.apache.org/job/dir-apacheds-jdk16-ubuntu-deploy/ws/trunk/server-integ/target/pluginDirectory/api-ldap-extras-codec-1.0.0-M18-20130603.030608-30.jar>

[INFO] --- maven-dependency-plugin:2.5:copy (copy) @ apacheds-server-integ ---
[debug] execute contextualize
[INFO] [INFO] Using 'UTF-8' encoding to copy filtered resources.
[INFO] Copying 7 resources
[INFO] Copying 3 resources

[INFO] --- maven-resources-plugin:2.5:testResources (default-testResources) @ apacheds-server-integ
---
[INFO] [INFO] Compiling 74 source files to <https://builds.apache.org/job/dir-apacheds-jdk16-ubuntu-deploy/ws/trunk/server-integ/target/test-classes>

[INFO] --- maven-compiler-plugin:2.5.1:testCompile (default-testCompile) @ apacheds-server-integ
---
[INFO] Surefire report directory: <https://builds.apache.org/job/dir-apacheds-jdk16-ubuntu-deploy/ws/trunk/server-integ/target/surefire-reports>
[INFO] 
-------------------------------------------------------
 T E S T S
-------------------------------------------------------

[INFO] --- maven-surefire-plugin:2.12.2:test (default-test) @ apacheds-server-integ ---
Running org.apache.directory.server.replication.ClientInitialRefreshIT
Tests run: 4, Failures: 0, Errors: 0, Skipped: 0, Time elapsed: 37.828 sec
Running org.apache.directory.server.replication.ClientServerReplicationIT
Tests run: 5, Failures: 0, Errors: 0, Skipped: 1, Time elapsed: 56.428 sec
Running org.apache.directory.server.replication.StaleEventLogDetectionIT

NbAdded every 100ms : 
0, 11Tests run: 1, Failures: 0, Errors: 0, Skipped: 0, Time elapsed: 29.205 sec
Running org.apache.directory.server.admin.AdministrativePointModifyIT
Tests run: 1, Failures: 0, Errors: 0, Skipped: 0, Time elapsed: 16.123 sec
Running org.apache.directory.server.admin.AdministrativePointAddIT
Tests run: 2, Failures: 0, Errors: 0, Skipped: 0, Time elapsed: 22.666 sec
Running org.apache.directory.server.admin.AdministrativePointModifyDelIT
Tests run: 3, Failures: 0, Errors: 0, Skipped: 1, Time elapsed: 16.419 sec
Running org.apache.directory.server.admin.AdministrativePointPersistentIT
Tests run: 1, Failures: 0, Errors: 0, Skipped: 0, Time elapsed: 11.114 sec
Running org.apache.directory.server.operations.modify.ModifyAddIT
Tests run: 16, Failures: 0, Errors: 0, Skipped: 0, Time elapsed: 25.312 sec
Running org.apache.directory.server.operations.modify.ModifyReplaceIT
Tests run: 7, Failures: 0, Errors: 0, Skipped: 0, Time elapsed: 13.844 sec
Running org.apache.directory.server.operations.modify.ModifyRemoveIT
Tests run: 16, Failures: 0, Errors: 0, Skipped: 0, Time elapsed: 27.033 sec
Running org.apache.directory.server.operations.modify.ModifyMultipleChangesIT
Tests run: 2, Failures: 0, Errors: 0, Skipped: 0, Time elapsed: 10.378 sec
Running org.apache.directory.server.operations.modify.ModifyReferralIT
Tests run: 4, Failures: 0, Errors: 0, Skipped: 0, Time elapsed: 11.018 sec
Running org.apache.directory.server.operations.modify.IllegalModificationIT
Tests run: 2, Failures: 0, Errors: 0, Skipped: 0, Time elapsed: 8.343 sec
Running org.apache.directory.server.operations.compare.CompareIT
Tests run: 7, Failures: 0, Errors: 0, Skipped: 0, Time elapsed: 14.23 sec
Running org.apache.directory.server.operations.compare.MatchingRuleCompareIT
Tests run: 2, Failures: 0, Errors: 0, Skipped: 0, Time elapsed: 8.543 sec
Running org.apache.directory.server.operations.lookup.LookupIT
Tests run: 3, Failures: 0, Errors: 0, Skipped: 0, Time elapsed: 9.231 sec
Running org.apache.directory.server.operations.delete.DeleteIT
Tests run: 8, Failures: 0, Errors: 0, Skipped: 0, Time elapsed: 16.018 sec
Running org.apache.directory.server.operations.delete.DeleteAliasIT
Tests run: 2, Failures: 0, Errors: 0, Skipped: 0, Time elapsed: 9.847 sec
Running org.apache.directory.server.operations.add.AddingEntriesWithSpecialCharactersInRDNIT
Tests run: 9, Failures: 0, Errors: 0, Skipped: 0, Time elapsed: 22.819 sec
Running org.apache.directory.server.operations.add.AddAliasIT
Tests run: 3, Failures: 0, Errors: 0, Skipped: 0, Time elapsed: 32.392 sec
Running org.apache.directory.server.operations.add.AddIT
Tests run: 31, Failures: 0, Errors: 0, Skipped: 0, Time elapsed: 82.215 sec
Running org.apache.directory.server.operations.ldapsdk.BindIT
Tests run: 5, Failures: 0, Errors: 0, Skipped: 0, Time elapsed: 14.461 sec
Running org.apache.directory.server.operations.ldapsdk.CompareIT
Tests run: 7, Failures: 0, Errors: 0, Skipped: 0, Time elapsed: 13.803 sec
Running org.apache.directory.server.operations.ldapsdk.ModifyDnReferralIT
Tests run: 7, Failures: 0, Errors: 0, Skipped: 0, Time elapsed: 14.115 sec
Running org.apache.directory.server.operations.ldapsdk.DeleteIT
Tests run: 8, Failures: 0, Errors: 0, Skipped: 0, Time elapsed: 16.328 sec
Running org.apache.directory.server.operations.ldapsdk.ModifyReferralIT
Tests run: 4, Failures: 0, Errors: 0, Skipped: 0, Time elapsed: 11.077 sec
Running org.apache.directory.server.operations.ldapsdk.IllegalModificationIT
Tests run: 2, Failures: 0, Errors: 0, Skipped: 0, Time elapsed: 6.114 sec
Running org.apache.directory.server.operations.ldapsdk.AddIT
Tests run: 30, Failures: 0, Errors: 0, Skipped: 0, Time elapsed: 76.436 sec
Running org.apache.directory.server.operations.bind.BindIT
Tests run: 5, Failures: 0, Errors: 0, Skipped: 0, Time elapsed: 11.942 sec
Running org.apache.directory.server.operations.bind.DelegatedAuthOverSslIT
Tests run: 1, Failures: 0, Errors: 0, Skipped: 0, Time elapsed: 14.047 sec
Running org.apache.directory.server.operations.bind.SaslBindIT
		No encryption was performed by peer.
		No encryption was performed by peer.
Tests run: 17, Failures: 0, Errors: 0, Skipped: 4, Time elapsed: 25.365 sec
Running org.apache.directory.server.operations.bind.DelegatedAuthOverTlsIT
Tests run: 1, Failures: 0, Errors: 0, Skipped: 0, Time elapsed: 14.628 sec
Running org.apache.directory.server.operations.bind.MiscBindIT
Tests run: 6, Failures: 0, Errors: 0, Skipped: 0, Time elapsed: 15.87 sec
Running org.apache.directory.server.operations.bind.SimpleBindIT
Tests run: 10, Failures: 0, Errors: 0, Skipped: 0, Time elapsed: 15.927 sec
Running org.apache.directory.server.operations.bind.DelegatedAuthIT
Tests run: 2, Failures: 0, Errors: 0, Skipped: 0, Time elapsed: 43.35 sec
Running org.apache.directory.server.operations.search.IndexedNegationSearchIT
Tests run: 3, Failures: 0, Errors: 0, Skipped: 0, Time elapsed: 11.904 sec
Running org.apache.directory.server.operations.search.ReferralSearchMoveAndRenameIT
Tests run: 1, Failures: 0, Errors: 0, Skipped: 0, Time elapsed: 11.37 sec
Running org.apache.directory.server.operations.search.ReferralSearchIT
Tests run: 7, Failures: 0, Errors: 0, Skipped: 0, Time elapsed: 20.309 sec
Running org.apache.directory.server.operations.search.NegationSearchIT
Tests run: 2, Failures: 0, Errors: 0, Skipped: 0, Time elapsed: 9.898 sec
Running org.apache.directory.server.operations.search.PagedSearchIT
Tests run: 37, Failures: 0, Errors: 0, Skipped: 0, Time elapsed: 49.13 sec
Running org.apache.directory.server.operations.search.ReferralSearchNoRevertIT
Tests run: 1, Failures: 0, Errors: 0, Skipped: 0, Time elapsed: 12.879 sec
Running org.apache.directory.server.operations.search.PersistentSearchIT
Tests run: 9, Failures: 0, Errors: 0, Skipped: 0, Time elapsed: 22.435 sec
Running org.apache.directory.server.operations.search.SchemaSearchIT
Tests run: 5, Failures: 0, Errors: 0, Skipped: 0, Time elapsed: 11.475 sec
Running org.apache.directory.server.operations.search.SearchIT
Tests run: 41, Failures: 0, Errors: 9, Skipped: 1, Time elapsed: 117.153 sec <<<
FAILURE!
Running org.apache.directory.server.operations.search.SearchLimitsIT
Tests run: 15, Failures: 0, Errors: 12, Skipped: 0, Time elapsed: 22.629 sec <<<
FAILURE!
Running org.apache.directory.server.operations.extended.StoredProcedureIT
Tests run: 1, Failures: 0, Errors: 1, Skipped: 0, Time elapsed: 4.343 sec <<< FAILURE!
Running org.apache.directory.server.operations.extended.ExtendedIT
Tests run: 1, Failures: 0, Errors: 1, Skipped: 0, Time elapsed: 0.007 sec <<< FAILURE!
Running org.apache.directory.server.operations.extended.PwdModifyIT
Tests run: 1, Failures: 0, Errors: 1, Skipped: 0, Time elapsed: 0.006 sec <<< FAILURE!
Running org.apache.directory.server.operations.modifydn.ModifyDnReferralIT
Tests run: 1, Failures: 0, Errors: 1, Skipped: 0, Time elapsed: 0.005 sec <<< FAILURE!
Running org.apache.directory.server.operations.modifydn.ModifyRdnIT
Tests run: 1, Failures: 0, Errors: 1, Skipped: 0, Time elapsed: 0.006 sec <<< FAILURE!
Running org.apache.directory.server.operations.modifydn.MoveIT
Tests run: 1, Failures: 0, Errors: 1, Skipped: 0, Time elapsed: 0.005 sec <<< FAILURE!
Running org.apache.directory.server.schema.SchemaIT
Tests run: 1, Failures: 0, Errors: 1, Skipped: 0, Time elapsed: 0.006 sec <<< FAILURE!
Running org.apache.directory.server.ssl.LdapsUpdateCertificateIT
Tests run: 1, Failures: 0, Errors: 1, Skipped: 0, Time elapsed: 0.005 sec <<< FAILURE!
Running org.apache.directory.server.ssl.StartTlsIT
Tests run: 1, Failures: 0, Errors: 1, Skipped: 0, Time elapsed: 0.005 sec <<< FAILURE!
Running org.apache.directory.server.ssl.StartTlsUpdateCertificateIT
Tests run: 1, Failures: 0, Errors: 1, Skipped: 0, Time elapsed: 0.005 sec <<< FAILURE!
Running org.apache.directory.server.ssl.StartTlsConfidentialityIT
Tests run: 1, Failures: 0, Errors: 1, Skipped: 0, Time elapsed: 0.005 sec <<< FAILURE!
Running org.apache.directory.server.ssl.LdapsIT
Tests run: 1, Failures: 0, Errors: 1, Skipped: 0, Time elapsed: 0.005 sec <<< FAILURE!
Running org.apache.directory.server.ppolicy.PasswordPolicyIT
Tests run: 1, Failures: 0, Errors: 1, Skipped: 0, Time elapsed: 0.013 sec <<< FAILURE!
Running org.apache.directory.server.kerberos.KeyDerivationServiceIT
Tests run: 1, Failures: 0, Errors: 1, Skipped: 0, Time elapsed: 0.005 sec <<< FAILURE!
Running org.apache.directory.server.kerberos.PasswordPolicyServiceIT
Tests run: 1, Failures: 0, Errors: 0, Skipped: 1, Time elapsed: 0 sec
Running org.apache.directory.dsml.engine.Dsmlv2EngineIT
Tests run: 1, Failures: 0, Errors: 1, Skipped: 0, Time elapsed: 0.006 sec <<< FAILURE!
Running org.apache.directory.IndexIT
Tests run: 1, Failures: 0, Errors: 1, Skipped: 0, Time elapsed: 0.006 sec <<< FAILURE!

Results :

Tests in error: 
  testSearchAttrCN(org.apache.directory.server.operations.search.SearchIT): localhost:49717
  testAddWithMissingObjectclasses(org.apache.directory.server.operations.search.SearchIT):
localhost:49717
  testSearchEmptyBaseDn(org.apache.directory.server.operations.search.SearchIT): localhost:49717
  testSearchSchema(org.apache.directory.server.operations.search.SearchIT): localhost:49717
  testSubentryControl(org.apache.directory.server.operations.search.SearchIT): localhost:49717
  testSearchAttrName(org.apache.directory.server.operations.search.SearchIT): localhost:49717
  testSearch(org.apache.directory.server.operations.search.SearchIT): localhost:49717
  testUndefinedAvaInBranchFilters(org.apache.directory.server.operations.search.SearchIT):
localhost:49717
  testUnicodeFilter_DIRSERVER_1347(org.apache.directory.server.operations.search.SearchIT):
localhost:49717
  testRequestConstrainedGreaterThanConfiguration(org.apache.directory.server.operations.search.SearchLimitsIT):
Unexpected exception, expected<javax.naming.TimeLimitExceededException> but was<javax.naming.CommunicationException>
  testRequestConstrainedUnlimitByConfigurationSize(org.apache.directory.server.operations.search.SearchLimitsIT):
Unexpected exception, expected<javax.naming.SizeLimitExceededException> but was<javax.naming.CommunicationException>
  testRequestConstraintedEqualToExpectedSize(org.apache.directory.server.operations.search.SearchLimitsIT):
localhost:35298
  testRequestConstrainedLessThanConfiguration(org.apache.directory.server.operations.search.SearchLimitsIT):
Unexpected exception, expected<javax.naming.TimeLimitExceededException> but was<javax.naming.CommunicationException>
  testRequestUnlimitedConfigurationLimited(org.apache.directory.server.operations.search.SearchLimitsIT):
localhost:35298
  testRequestConstraintedGreaterThanExpectedSize(org.apache.directory.server.operations.search.SearchLimitsIT):
localhost:35298
  testRequestObjectScopeAndSizeLimit(org.apache.directory.server.operations.search.SearchLimitsIT):
localhost:35298
  testNonAdminRequestUnlimitedConfigurationLimited(org.apache.directory.server.operations.search.SearchLimitsIT):
Unexpected exception, expected<javax.naming.TimeLimitExceededException> but was<javax.naming.CommunicationException>
  testRequestConstraintedLessThanExpectedSize(org.apache.directory.server.operations.search.SearchLimitsIT):
Unexpected exception, expected<javax.naming.SizeLimitExceededException> but was<javax.naming.CommunicationException>
  testRequestConstrainedLessThanConfigurationSize(org.apache.directory.server.operations.search.SearchLimitsIT):
Unexpected exception, expected<javax.naming.SizeLimitExceededException> but was<javax.naming.CommunicationException>
  testNonAdminRequestUnlimitedConfigurationLimitedSize(org.apache.directory.server.operations.search.SearchLimitsIT):
Unexpected exception, expected<javax.naming.SizeLimitExceededException> but was<javax.naming.CommunicationException>
  testRequestConstrainedUnlimitByConfiguration(org.apache.directory.server.operations.search.SearchLimitsIT):
Unexpected exception, expected<javax.naming.TimeLimitExceededException> but was<javax.naming.CommunicationException>
  org.apache.directory.server.operations.extended.StoredProcedureIT: java.io.FileNotFoundException:
/tmp/server-work-default5958dd53-0aa3-4f92-8712-da2076eae8d6/partitions/system/2.5.4.0.lg
(Too many open files)
  org.apache.directory.server.operations.extended.ExtendedIT: java.io.FileNotFoundException:
/tmp/server-work-default084ddc80-35be-4352-a01b-6372a144673c/cache/kdcReplayCache.data (Too
many open files)
  org.apache.directory.server.operations.extended.PwdModifyIT: java.io.FileNotFoundException:
/tmp/server-work-PasswordPolicyTest/cache/groupCache.data (Too many open files)
  org.apache.directory.server.operations.modifydn.ModifyDnReferralIT: java.io.FileNotFoundException:
/tmp/server-work-default8f672bc8-40a0-4203-8f3b-f29774b04515/cache/ou=system.data (Too many
open files)
  org.apache.directory.server.operations.modifydn.ModifyRdnIT: java.io.FileNotFoundException:
/tmp/server-work-ModifyRdnIT-class/cache/groupCache.data (Too many open files)
  org.apache.directory.server.operations.modifydn.MoveIT: java.io.FileNotFoundException: /tmp/server-work-default0d3d5cdb-2594-47b4-a1d6-a139d8186fc9/cache/groupCache.data
(Too many open files)
  org.apache.directory.server.schema.SchemaIT: java.io.FileNotFoundException: /tmp/server-work-SchemaIT-class/cache/kdcReplayCache.data
(Too many open files)
  org.apache.directory.server.ssl.LdapsUpdateCertificateIT: java.io.FileNotFoundException:
/tmp/server-work-LdapsUpdateCertificateIT-class/cache/groupCache.data (Too many open files)
  org.apache.directory.server.ssl.StartTlsIT: java.io.FileNotFoundException: /tmp/server-work-StartTlsIT-class/cache/kdcReplayCache.data
(Too many open files)
  org.apache.directory.server.ssl.StartTlsUpdateCertificateIT: java.io.FileNotFoundException:
/tmp/server-work-StartTlsUpdateCertificateIT-class/cache/groupCache.data (Too many open files)
  org.apache.directory.server.ssl.StartTlsConfidentialityIT: java.io.FileNotFoundException:
/tmp/server-work-StartTlsConfidentialityIT-class/cache/kdcReplayCache.data (Too many open
files)
  org.apache.directory.server.ssl.LdapsIT: java.io.FileNotFoundException: /tmp/server-work-LdapsIT-class/cache/kdcReplayCache.data
(Too many open files)
  org.apache.directory.server.ppolicy.PasswordPolicyIT: java.io.FileNotFoundException: /tmp/server-work-PasswordPolicyTest/cache/ehcache_auto_created_1370235516937/changePwdReplayCache.data
(Too many open files)
  org.apache.directory.server.kerberos.KeyDerivationServiceIT: java.io.FileNotFoundException:
/tmp/server-work-KeyDerivationServiceIT-class/cache/kdcReplayCache.data (Too many open files)
  org.apache.directory.dsml.engine.Dsmlv2EngineIT: java.io.FileNotFoundException: /tmp/server-work-Dsmlv2EngineTest-DS/cache/kdcReplayCache.data
(Too many open files)
  org.apache.directory.IndexIT: <https://builds.apache.org/job/dir-apacheds-jdk16-ubuntu-deploy/ws/trunk/server-integ/target/schema/ou=schema/cn=apachemeta/ou=matchingrules/m-oid=1.3.6.1.4.1.18060.0.4.0.1.3.ldif>
(Too many open files)

Tests run: 372, Failures: 0, Errors: 37, Skipped: 8

[ERROR] There are test failures.

Please refer to <https://builds.apache.org/job/dir-apacheds-jdk16-ubuntu-deploy/ws/trunk/server-integ/target/surefire-reports>
for the individual test results.
ERROR: Maven JVM terminated unexpectedly with exit code 143


Mime
View raw message