directory-notifications mailing list archives

Site index · List index
Message view « Date » · « Thread »
Top « Date » · « Thread »
From Apache Jenkins Server <jenk...@builds.apache.org>
Subject Build failed in Jenkins: dir-apacheds-jdbm-jdk16-ubuntu-deploy #471
Date Sun, 23 Jun 2013 04:03:13 GMT
See <https://builds.apache.org/job/dir-apacheds-jdbm-jdk16-ubuntu-deploy/471/>

------------------------------------------
Started by timer
Building remotely on ubuntu2 in workspace <https://builds.apache.org/job/dir-apacheds-jdbm-jdk16-ubuntu-deploy/ws/>
Updating https://svn.apache.org/repos/asf/directory/jdbm/trunk
At revision 1495790
no change for https://svn.apache.org/repos/asf/directory/jdbm/trunk since the previous build
Parsing POMs
Modules changed, recalculating dependency graph
[dir-apacheds-jdbm-jdk16-ubuntu-deploy] $ /home/hudson/tools/java/jdk1.6.0_20-32-unlimited-security/bin/java
-cp /home/jenkins/jenkins-slave/maven3-agent.jar:/home/hudson/tools/maven/apache-maven-3.0.4/boot/plexus-classworlds-2.4.jar
org.jvnet.hudson.maven3.agent.Maven3Main /home/hudson/tools/maven/apache-maven-3.0.4 /home/hudson/jenkins-slave/slave.jar
/home/jenkins/jenkins-slave/maven3-interceptor.jar 57346
<===[JENKINS REMOTING CAPACITY]===>channel started
   log4j:WARN No appenders could be found for logger (org.apache.commons.beanutils.converters.BooleanConverter).
log4j:WARN Please initialize the log4j system properly.
Executing Maven:  -B -f <https://builds.apache.org/job/dir-apacheds-jdbm-jdk16-ubuntu-deploy/ws/pom.xml>
-Dmaven.repo.local=/home/jenkins/jenkins-slave/maven-repositories/1 -U clean deploy -V
Apache Maven 3.0.4 (r1232337; 2012-01-17 08:44:56+0000)
Maven home: /home/hudson/tools/maven/apache-maven-3.0.4
Java version: 1.6.0_20, vendor: Sun Microsystems Inc.
Java home: /home/hudson/tools/java/jdk1.6.0_20-32-unlimited-security/jre
Default locale: en_US, platform encoding: ANSI_X3.4-1968
OS name: "linux", version: "3.2.0-38-generic", arch: "i386", family: "unix"
[INFO] Scanning for projects...
[INFO] ------------------------------------------------------------------------
[INFO] Reactor Build Order:
[INFO] 
[INFO] ApacheDS JDBM
[INFO] ApacheDS JDBM Original Implementation
[INFO] ApacheDS JDBM Implementation MVCC
[INFO]                                                                         
[INFO] ------------------------------------------------------------------------
[INFO] Building ApacheDS JDBM 2.0.0-M3-SNAPSHOT
[INFO] ------------------------------------------------------------------------
[INFO] 
[INFO] --- maven-clean-plugin:2.4.1:clean (default-clean) @ apacheds-jdbm-parent ---
[INFO] Deleting <https://builds.apache.org/job/dir-apacheds-jdbm-jdk16-ubuntu-deploy/ws/target>
[INFO] 
[INFO] --- maven-remote-resources-plugin:1.2.1:process (default) @ apacheds-jdbm-parent ---
[INFO] 
[INFO] --- maven-site-plugin:3.0:attach-descriptor (attach-descriptor) @ apacheds-jdbm-parent
---
[INFO] 
[INFO] --- tools-maven-plugin:1.4:verify-legal-files (verify-legal-files) @ apacheds-jdbm-parent
---
[INFO] 
[INFO] --- maven-install-plugin:2.3.1:install (default-install) @ apacheds-jdbm-parent ---
[INFO] Installing <https://builds.apache.org/job/dir-apacheds-jdbm-jdk16-ubuntu-deploy/ws/pom.xml>
to /home/jenkins/jenkins-slave/maven-repositories/1/org/apache/directory/jdbm/apacheds-jdbm-parent/2.0.0-M3-SNAPSHOT/apacheds-jdbm-parent-2.0.0-M3-SNAPSHOT.pom
[INFO] 
[INFO] --- maven-deploy-plugin:2.7:deploy (default-deploy) @ apacheds-jdbm-parent ---
Downloading: https://repository.apache.org/content/repositories/snapshots/org/apache/directory/jdbm/apacheds-jdbm-parent/2.0.0-M3-SNAPSHOT/maven-metadata.xml
Downloaded: https://repository.apache.org/content/repositories/snapshots/org/apache/directory/jdbm/apacheds-jdbm-parent/2.0.0-M3-SNAPSHOT/maven-metadata.xml
(632 B at 0.3 KB/sec)
Uploading: https://repository.apache.org/content/repositories/snapshots/org/apache/directory/jdbm/apacheds-jdbm-parent/2.0.0-M3-SNAPSHOT/apacheds-jdbm-parent-2.0.0-M3-20130623.040241-141.pom
Uploaded: https://repository.apache.org/content/repositories/snapshots/org/apache/directory/jdbm/apacheds-jdbm-parent/2.0.0-M3-SNAPSHOT/apacheds-jdbm-parent-2.0.0-M3-20130623.040241-141.pom
(18 KB at 56.3 KB/sec)
Downloading: https://repository.apache.org/content/repositories/snapshots/org/apache/directory/jdbm/apacheds-jdbm-parent/maven-metadata.xml
Downloaded: https://repository.apache.org/content/repositories/snapshots/org/apache/directory/jdbm/apacheds-jdbm-parent/maven-metadata.xml
(371 B at 1.8 KB/sec)
Uploading: https://repository.apache.org/content/repositories/snapshots/org/apache/directory/jdbm/apacheds-jdbm-parent/2.0.0-M3-SNAPSHOT/maven-metadata.xml
Uploaded: https://repository.apache.org/content/repositories/snapshots/org/apache/directory/jdbm/apacheds-jdbm-parent/2.0.0-M3-SNAPSHOT/maven-metadata.xml
(632 B at 2.4 KB/sec)
Uploading: https://repository.apache.org/content/repositories/snapshots/org/apache/directory/jdbm/apacheds-jdbm-parent/maven-metadata.xml
Uploaded: https://repository.apache.org/content/repositories/snapshots/org/apache/directory/jdbm/apacheds-jdbm-parent/maven-metadata.xml
(371 B at 1.1 KB/sec)
[INFO]                                                                         
[INFO] ------------------------------------------------------------------------
[INFO] Building ApacheDS JDBM Original Implementation 2.0.0-M3-SNAPSHOT
[INFO] ------------------------------------------------------------------------
[INFO] [INFO] Deleting <https://builds.apache.org/job/dir-apacheds-jdbm-jdk16-ubuntu-deploy/ws/jdbm1/target>

[INFO] --- maven-clean-plugin:2.4.1:clean (default-clean) @ apacheds-jdbm1 ---
[INFO] 
[INFO] --- maven-remote-resources-plugin:1.2.1:process (default) @ apacheds-jdbm1 ---
[INFO] 
[INFO] --- maven-resources-plugin:2.5:resources (default-resources) @ apacheds-jdbm1 ---
[debug] execute contextualize
[INFO] Using 'UTF-8' encoding to copy filtered resources.
[INFO] Copying 6 resources
[INFO] Copying 3 resources
[INFO] 
[INFO] --- maven-compiler-plugin:2.5.1:compile (default-compile) @ apacheds-jdbm1 ---
[INFO] Compiling 58 source files to <https://builds.apache.org/job/dir-apacheds-jdbm-jdk16-ubuntu-deploy/ws/jdbm1/target/classes>
[debug] execute contextualize
[INFO] [INFO] Using 'UTF-8' encoding to copy filtered resources.
[INFO] skip non existing resourceDirectory <https://builds.apache.org/job/dir-apacheds-jdbm-jdk16-ubuntu-deploy/ws/jdbm1/src/test/resources>
[INFO] Copying 3 resources

[INFO] --- maven-resources-plugin:2.5:testResources (default-testResources) @ apacheds-jdbm1
---
[INFO] 
[INFO] --- maven-compiler-plugin:2.5.1:testCompile (default-testCompile) @ apacheds-jdbm1
---
[INFO] Compiling 3 source files to <https://builds.apache.org/job/dir-apacheds-jdbm-jdk16-ubuntu-deploy/ws/jdbm1/target/test-classes>
[INFO] 
[INFO] --- maven-surefire-plugin:2.12.2:test (default-test) @ apacheds-jdbm1 ---
[INFO] Surefire report directory: <https://builds.apache.org/job/dir-apacheds-jdbm-jdk16-ubuntu-deploy/ws/jdbm1/target/surefire-reports>

-------------------------------------------------------
 T E S T S
-------------------------------------------------------
Running jdbm.recman.LocationTest
Tests run: 8, Failures: 0, Errors: 0, Skipped: 2, Time elapsed: 0.207 sec
Running jdbm.btree.TestBTree
Tests run: 10, Failures: 0, Errors: 9, Skipped: 1, Time elapsed: 9.946 sec <<< FAILURE!

Results :

Tests in error: 
  testInsertMany(jdbm.btree.TestBTree): No space left on device
  testFind(jdbm.btree.TestBTree): No space left on device
  testClose(jdbm.btree.TestBTree): No space left on device
  testInsert(jdbm.btree.TestBTree): No space left on device
  testBasics2(jdbm.btree.TestBTree): No space left on device
  testBasics(jdbm.btree.TestBTree): No space left on device
  testRemove(jdbm.btree.TestBTree): No space left on device
  testLargeDataAmount(jdbm.btree.TestBTree): No space left on device
  testMultithreadAccess(jdbm.btree.TestBTree): No space left on device

Tests run: 18, Failures: 0, Errors: 9, Skipped: 3

[ERROR] There are test failures.

Please refer to <https://builds.apache.org/job/dir-apacheds-jdbm-jdk16-ubuntu-deploy/ws/jdbm1/target/surefire-reports>
for the individual test results.
java.lang.reflect.InvocationTargetException
	at sun.reflect.NativeMethodAccessorImpl.invoke0(Native Method)
	at sun.reflect.NativeMethodAccessorImpl.invoke(NativeMethodAccessorImpl.java:39)
	at sun.reflect.DelegatingMethodAccessorImpl.invoke(DelegatingMethodAccessorImpl.java:25)
	at java.lang.reflect.Method.invoke(Method.java:597)
	at org.codehaus.plexus.classworlds.launcher.Launcher.launchStandard(Launcher.java:329)
	at org.codehaus.plexus.classworlds.launcher.Launcher.launch(Launcher.java:239)
	at org.jvnet.hudson.maven3.agent.Maven3Main.launch(Maven3Main.java:158)
	at hudson.maven.Maven3Builder.call(Maven3Builder.java:100)
	at hudson.maven.Maven3Builder.call(Maven3Builder.java:66)
	at hudson.remoting.UserRequest.perform(UserRequest.java:118)
	at hudson.remoting.UserRequest.perform(UserRequest.java:48)
	at hudson.remoting.Request$2.run(Request.java:326)
	at hudson.remoting.InterceptingExecutorService$1.call(InterceptingExecutorService.java:72)
	at java.util.concurrent.FutureTask$Sync.innerRun(FutureTask.java:303)
	at java.util.concurrent.FutureTask.run(FutureTask.java:138)
	at java.util.concurrent.ThreadPoolExecutor$Worker.runTask(ThreadPoolExecutor.java:886)
	at java.util.concurrent.ThreadPoolExecutor$Worker.run(ThreadPoolExecutor.java:908)
	at java.lang.Thread.run(Thread.java:619)
Caused by: java.lang.Error: Unable to load resource hudson/maven/reporters/Messages.properties
	at hudson.remoting.RemoteClassLoader.findResource(RemoteClassLoader.java:241)
	at java.lang.ClassLoader.getResource(ClassLoader.java:1003)
	at java.lang.Class.getResource(Class.java:2074)
	at org.jvnet.localizer.ResourceBundleHolder.get(ResourceBundleHolder.java:83)
	at org.jvnet.localizer.ResourceBundleHolder.get(ResourceBundleHolder.java:102)
	at org.jvnet.localizer.ResourceBundleHolder.get(ResourceBundleHolder.java:102)
	at org.jvnet.localizer.ResourceBundleHolder.format(ResourceBundleHolder.java:139)
	at hudson.maven.reporters.Messages.SurefireArchiver_Recording(Messages.java:165)
	at hudson.maven.reporters.SurefireArchiver.postExecute(SurefireArchiver.java:120)
	at hudson.maven.Maven3Builder$MavenExecutionListener.recordMojoEnded(Maven3Builder.java:443)
	at hudson.maven.Maven3Builder$MavenExecutionListener.mojoSucceeded(Maven3Builder.java:425)
	at org.apache.maven.lifecycle.internal.DefaultExecutionEventCatapult.fire(DefaultExecutionEventCatapult.java:87)
	at org.apache.maven.lifecycle.internal.DefaultExecutionEventCatapult.fire(DefaultExecutionEventCatapult.java:42)
	at org.apache.maven.lifecycle.internal.MojoExecutor.execute(MojoExecutor.java:228)
	at org.apache.maven.lifecycle.internal.MojoExecutor.execute(MojoExecutor.java:153)
	at org.apache.maven.lifecycle.internal.MojoExecutor.execute(MojoExecutor.java:145)
	at org.apache.maven.lifecycle.internal.LifecycleModuleBuilder.buildProject(LifecycleModuleBuilder.java:84)
	at org.apache.maven.lifecycle.internal.LifecycleModuleBuilder.buildProject(LifecycleModuleBuilder.java:59)
	at org.apache.maven.lifecycle.internal.LifecycleStarter.singleThreadedBuild(LifecycleStarter.java:183)
	at org.apache.maven.lifecycle.internal.LifecycleStarter.execute(LifecycleStarter.java:161)
	at org.apache.maven.DefaultMaven.doExecute(DefaultMaven.java:320)
	at org.apache.maven.DefaultMaven.execute(DefaultMaven.java:156)
	at org.jvnet.hudson.maven3.launcher.Maven3Launcher.main(Maven3Launcher.java:79)
	... 18 more
Caused by: java.io.FileNotFoundException: /tmp/hudson-remoting7244889765830795046/hudson/maven/reporters/Messages.properties
(No such file or directory)
	at java.io.FileOutputStream.open(Native Method)
	at java.io.FileOutputStream.<init>(FileOutputStream.java:179)
	at java.io.FileOutputStream.<init>(FileOutputStream.java:131)
	at hudson.remoting.RemoteClassLoader.makeResource(RemoteClassLoader.java:309)
	at hudson.remoting.RemoteClassLoader.findResource(RemoteClassLoader.java:237)
	... 40 more
channel stopped
ERROR: Failed to parse POMs
hudson.util.IOException2: java.lang.reflect.InvocationTargetException
	at hudson.maven.Maven3Builder.call(Maven3Builder.java:162)
	at hudson.maven.Maven3Builder.call(Maven3Builder.java:66)
	at hudson.remoting.UserRequest.perform(UserRequest.java:118)
	at hudson.remoting.UserRequest.perform(UserRequest.java:48)
	at hudson.remoting.Request$2.run(Request.java:326)
	at hudson.remoting.InterceptingExecutorService$1.call(InterceptingExecutorService.java:72)
	at java.util.concurrent.FutureTask$Sync.innerRun(FutureTask.java:303)
	at java.util.concurrent.FutureTask.run(FutureTask.java:138)
	at java.util.concurrent.ThreadPoolExecutor$Worker.runTask(ThreadPoolExecutor.java:886)
	at java.util.concurrent.ThreadPoolExecutor$Worker.run(ThreadPoolExecutor.java:908)
	at java.lang.Thread.run(Thread.java:619)
Caused by: java.lang.Exception: java.lang.reflect.InvocationTargetException
	at org.jvnet.hudson.maven3.agent.Maven3Main.launch(Maven3Main.java:161)
	at hudson.maven.Maven3Builder.call(Maven3Builder.java:100)
	... 10 more
Caused by: java.lang.reflect.InvocationTargetException
	at sun.reflect.NativeMethodAccessorImpl.invoke0(Native Method)
	at sun.reflect.NativeMethodAccessorImpl.invoke(NativeMethodAccessorImpl.java:39)
	at sun.reflect.DelegatingMethodAccessorImpl.invoke(DelegatingMethodAccessorImpl.java:25)
	at java.lang.reflect.Method.invoke(Method.java:597)
	at org.codehaus.plexus.classworlds.launcher.Launcher.launchStandard(Launcher.java:329)
	at org.codehaus.plexus.classworlds.launcher.Launcher.launch(Launcher.java:239)
	at org.jvnet.hudson.maven3.agent.Maven3Main.launch(Maven3Main.java:158)
	... 11 more
Caused by: java.lang.Error: Unable to load resource hudson/maven/reporters/Messages.properties
	at hudson.remoting.RemoteClassLoader.findResource(RemoteClassLoader.java:241)
	at java.lang.ClassLoader.getResource(ClassLoader.java:1003)
	at java.lang.Class.getResource(Class.java:2074)
	at org.jvnet.localizer.ResourceBundleHolder.get(ResourceBundleHolder.java:83)
	at org.jvnet.localizer.ResourceBundleHolder.get(ResourceBundleHolder.java:102)
	at org.jvnet.localizer.ResourceBundleHolder.get(ResourceBundleHolder.java:102)
	at org.jvnet.localizer.ResourceBundleHolder.format(ResourceBundleHolder.java:139)
	at hudson.maven.reporters.Messages.SurefireArchiver_Recording(Messages.java:165)
	at hudson.maven.reporters.SurefireArchiver.postExecute(SurefireArchiver.java:120)
	at hudson.maven.Maven3Builder$MavenExecutionListener.recordMojoEnded(Maven3Builder.java:443)
	at hudson.maven.Maven3Builder$MavenExecutionListener.mojoSucceeded(Maven3Builder.java:425)
	at org.apache.maven.lifecycle.internal.DefaultExecutionEventCatapult.fire(DefaultExecutionEventCatapult.java:87)
	at org.apache.maven.lifecycle.internal.DefaultExecutionEventCatapult.fire(DefaultExecutionEventCatapult.java:42)
	at org.apache.maven.lifecycle.internal.MojoExecutor.execute(MojoExecutor.java:228)
	at org.apache.maven.lifecycle.internal.MojoExecutor.execute(MojoExecutor.java:153)
	at org.apache.maven.lifecycle.internal.MojoExecutor.execute(MojoExecutor.java:145)
	at org.apache.maven.lifecycle.internal.LifecycleModuleBuilder.buildProject(LifecycleModuleBuilder.java:84)
	at org.apache.maven.lifecycle.internal.LifecycleModuleBuilder.buildProject(LifecycleModuleBuilder.java:59)
	at org.apache.maven.lifecycle.internal.LifecycleStarter.singleThreadedBuild(LifecycleStarter.java:183)
	at org.apache.maven.lifecycle.internal.LifecycleStarter.execute(LifecycleStarter.java:161)
	at org.apache.maven.DefaultMaven.doExecute(DefaultMaven.java:320)
	at org.apache.maven.DefaultMaven.execute(DefaultMaven.java:156)
	at org.jvnet.hudson.maven3.launcher.Maven3Launcher.main(Maven3Launcher.java:79)
	... 18 more
Caused by: java.io.FileNotFoundException: /tmp/hudson-remoting7244889765830795046/hudson/maven/reporters/Messages.properties
(No such file or directory)
	at java.io.FileOutputStream.open(Native Method)
	at java.io.FileOutputStream.<init>(FileOutputStream.java:179)
	at java.io.FileOutputStream.<init>(FileOutputStream.java:131)
	at hudson.remoting.RemoteClassLoader.makeResource(RemoteClassLoader.java:309)
	at hudson.remoting.RemoteClassLoader.findResource(RemoteClassLoader.java:237)
	... 40 more

Mime
View raw message