directory-notifications mailing list archives

Site index · List index
Message view « Date » · « Thread »
Top « Date » · « Thread »
From Apache Jenkins Server <jenk...@builds.apache.org>
Subject Build failed in Jenkins: dir-apacheds-jdk16-win #435
Date Fri, 21 Jun 2013 04:07:35 GMT
See <https://builds.apache.org/job/dir-apacheds-jdk16-win/435/>

------------------------------------------
[...truncated 198 lines...]
Downloading: http://repo1.maven.org/maven2/org/apache/directory/project/project/30/project-30.pom
Downloading: http://repository.apache.org/snapshots/org/apache/directory/api/api-ldap-client-api/1.0.0-M18-SNAPSHOT/maven-metadata.xml
Downloaded: http://repository.apache.org/snapshots/org/apache/directory/api/api-ldap-client-api/1.0.0-M18-SNAPSHOT/maven-metadata.xml
(2 KB at 6.4 KB/sec)
Downloading: http://repository.apache.org/snapshots/org/apache/directory/api/api-ldap-client-api/1.0.0-M18-SNAPSHOT/api-ldap-client-api-1.0.0-M18-20130620.161059-48.pom
Downloaded: http://repository.apache.org/snapshots/org/apache/directory/api/api-ldap-client-api/1.0.0-M18-SNAPSHOT/api-ldap-client-api-1.0.0-M18-20130620.161059-48.pom
(4 KB at 37.0 KB/sec)
Downloading: http://repository.apache.org/snapshots/org/apache/directory/api/api-ldap-client-parent/1.0.0-M18-SNAPSHOT/maven-metadata.xml
Downloaded: http://repository.apache.org/snapshots/org/apache/directory/api/api-ldap-client-parent/1.0.0-M18-SNAPSHOT/maven-metadata.xml
(849 B at 2.9 KB/sec)
Downloading: http://repository.apache.org/snapshots/org/apache/directory/api/api-ldap-client-parent/1.0.0-M18-SNAPSHOT/api-ldap-client-parent-1.0.0-M18-20130620.161044-48.pom
Downloaded: http://repository.apache.org/snapshots/org/apache/directory/api/api-ldap-client-parent/1.0.0-M18-SNAPSHOT/api-ldap-client-parent-1.0.0-M18-20130620.161044-48.pom
(2 KB at 10.4 KB/sec)
Downloading: http://repository.apache.org/snapshots/org/apache/directory/api/api-ldap-parent/1.0.0-M18-SNAPSHOT/maven-metadata.xml
Downloaded: http://repository.apache.org/snapshots/org/apache/directory/api/api-ldap-parent/1.0.0-M18-SNAPSHOT/maven-metadata.xml
(842 B at 2.5 KB/sec)
Downloading: http://repository.apache.org/snapshots/org/apache/directory/api/api-ldap-parent/1.0.0-M18-SNAPSHOT/api-ldap-parent-1.0.0-M18-20130620.160547-50.pom
Downloaded: http://repository.apache.org/snapshots/org/apache/directory/api/api-ldap-parent/1.0.0-M18-SNAPSHOT/api-ldap-parent-1.0.0-M18-20130620.160547-50.pom
(2 KB at 21.9 KB/sec)
Downloading: http://repo1.maven.org/maven2/org/apache/directory/project/project/30/project-30.pom
Downloading: http://repository.apache.org/snapshots/org/apache/directory/api/api-ldap-codec-core/1.0.0-M18-SNAPSHOT/maven-metadata.xml
Downloaded: http://repository.apache.org/snapshots/org/apache/directory/api/api-ldap-codec-core/1.0.0-M18-SNAPSHOT/maven-metadata.xml
(2 KB at 5.6 KB/sec)
Downloading: http://repository.apache.org/snapshots/org/apache/directory/api/api-ldap-codec-core/1.0.0-M18-SNAPSHOT/api-ldap-codec-core-1.0.0-M18-20130620.160705-49.pom
Downloaded: http://repository.apache.org/snapshots/org/apache/directory/api/api-ldap-codec-core/1.0.0-M18-SNAPSHOT/api-ldap-codec-core-1.0.0-M18-20130620.160705-49.pom
(5 KB at 45.5 KB/sec)
Downloading: http://repository.apache.org/snapshots/org/apache/directory/api/api-ldap-codec-parent/1.0.0-M18-SNAPSHOT/maven-metadata.xml
Downloaded: http://repository.apache.org/snapshots/org/apache/directory/api/api-ldap-codec-parent/1.0.0-M18-SNAPSHOT/maven-metadata.xml
(848 B at 4.1 KB/sec)
Downloading: http://repository.apache.org/snapshots/org/apache/directory/api/api-ldap-codec-parent/1.0.0-M18-SNAPSHOT/api-ldap-codec-parent-1.0.0-M18-20130620.160647-49.pom
Downloaded: http://repository.apache.org/snapshots/org/apache/directory/api/api-ldap-codec-parent/1.0.0-M18-SNAPSHOT/api-ldap-codec-parent-1.0.0-M18-20130620.160647-49.pom
(2 KB at 24.6 KB/sec)
Downloading: http://repo1.maven.org/maven2/org/apache/directory/project/project/30/project-30.pom
Downloading: http://repository.apache.org/snapshots/org/apache/directory/api/api-ldap-extras-aci/1.0.0-M18-SNAPSHOT/maven-metadata.xml
Downloaded: http://repository.apache.org/snapshots/org/apache/directory/api/api-ldap-extras-aci/1.0.0-M18-SNAPSHOT/maven-metadata.xml
(2 KB at 3.0 KB/sec)
Downloading: http://repository.apache.org/snapshots/org/apache/directory/api/api-ldap-extras-aci/1.0.0-M18-SNAPSHOT/api-ldap-extras-aci-1.0.0-M18-20130620.160912-48.pom
Downloaded: http://repository.apache.org/snapshots/org/apache/directory/api/api-ldap-extras-aci/1.0.0-M18-SNAPSHOT/api-ldap-extras-aci-1.0.0-M18-20130620.160912-48.pom
(4 KB at 41.5 KB/sec)
Downloading: http://repository.apache.org/snapshots/org/apache/directory/api/api-ldap-extras-parent/1.0.0-M18-SNAPSHOT/maven-metadata.xml
Downloaded: http://repository.apache.org/snapshots/org/apache/directory/api/api-ldap-extras-parent/1.0.0-M18-SNAPSHOT/maven-metadata.xml
(849 B at 3.5 KB/sec)
Downloading: http://repository.apache.org/snapshots/org/apache/directory/api/api-ldap-extras-parent/1.0.0-M18-SNAPSHOT/api-ldap-extras-parent-1.0.0-M18-20130620.160853-48.pom
Downloaded: http://repository.apache.org/snapshots/org/apache/directory/api/api-ldap-extras-parent/1.0.0-M18-SNAPSHOT/api-ldap-extras-parent-1.0.0-M18-20130620.160853-48.pom
(2 KB at 9.1 KB/sec)
Downloading: http://repo1.maven.org/maven2/org/apache/directory/project/project/30/project-30.pom
Downloading: http://repository.apache.org/snapshots/org/apache/directory/api/api-ldap-extras-util/1.0.0-M18-SNAPSHOT/maven-metadata.xml
Downloaded: http://repository.apache.org/snapshots/org/apache/directory/api/api-ldap-extras-util/1.0.0-M18-SNAPSHOT/maven-metadata.xml
(2 KB at 6.9 KB/sec)
Downloading: http://repository.apache.org/snapshots/org/apache/directory/api/api-ldap-extras-util/1.0.0-M18-SNAPSHOT/api-ldap-extras-util-1.0.0-M18-20130620.161222-47.pom
Downloaded: http://repository.apache.org/snapshots/org/apache/directory/api/api-ldap-extras-util/1.0.0-M18-SNAPSHOT/api-ldap-extras-util-1.0.0-M18-20130620.161222-47.pom
(3 KB at 25.2 KB/sec)
Downloading: http://repo1.maven.org/maven2/org/apache/directory/project/project/30/project-30.pom
Downloading: http://repository.apache.org/snapshots/org/apache/directory/api/api-ldap-model/1.0.0-M18-SNAPSHOT/maven-metadata.xml
Downloaded: http://repository.apache.org/snapshots/org/apache/directory/api/api-ldap-model/1.0.0-M18-SNAPSHOT/maven-metadata.xml
(1022 B at 6.0 KB/sec)
Downloading: http://repository.apache.org/snapshots/org/apache/directory/api/api-ldap-model/1.0.0-M18-SNAPSHOT/api-ldap-model-1.0.0-M18-20130620.160611-50.pom
Downloaded: http://repository.apache.org/snapshots/org/apache/directory/api/api-ldap-model/1.0.0-M18-SNAPSHOT/api-ldap-model-1.0.0-M18-20130620.160611-50.pom
(5 KB at 74.3 KB/sec)
Downloading: http://repo1.maven.org/maven2/org/apache/directory/project/project/30/project-30.pom
Downloading: http://repository.apache.org/snapshots/org/apache/directory/api/api-ldap-schema-data/1.0.0-M18-SNAPSHOT/maven-metadata.xml
Downloaded: http://repository.apache.org/snapshots/org/apache/directory/api/api-ldap-schema-data/1.0.0-M18-SNAPSHOT/maven-metadata.xml
(2 KB at 2.2 KB/sec)
Downloading: http://repository.apache.org/snapshots/org/apache/directory/api/api-ldap-schema-data/1.0.0-M18-SNAPSHOT/api-ldap-schema-data-1.0.0-M18-20130620.161013-48.pom
Downloaded: http://repository.apache.org/snapshots/org/apache/directory/api/api-ldap-schema-data/1.0.0-M18-SNAPSHOT/api-ldap-schema-data-1.0.0-M18-20130620.161013-48.pom
(7 KB at 66.1 KB/sec)
Downloading: http://repository.apache.org/snapshots/org/apache/directory/api/api-ldap-schema-parent/1.0.0-M18-SNAPSHOT/maven-metadata.xml
Downloaded: http://repository.apache.org/snapshots/org/apache/directory/api/api-ldap-schema-parent/1.0.0-M18-SNAPSHOT/maven-metadata.xml
(633 B at 1.7 KB/sec)
Downloading: http://repository.apache.org/snapshots/org/apache/directory/api/api-ldap-schema-parent/1.0.0-M18-SNAPSHOT/api-ldap-schema-parent-1.0.0-M18-20130620.160930-48.pom
Downloaded: http://repository.apache.org/snapshots/org/apache/directory/api/api-ldap-schema-parent/1.0.0-M18-SNAPSHOT/api-ldap-schema-parent-1.0.0-M18-20130620.160930-48.pom
(2 KB at 25.0 KB/sec)
Downloading: http://repo1.maven.org/maven2/org/apache/directory/project/project/30/project-30.pom
Downloading: http://repository.apache.org/snapshots/org/apache/directory/api/api-util/1.0.0-M18-SNAPSHOT/maven-metadata.xml
Downloaded: http://repository.apache.org/snapshots/org/apache/directory/api/api-util/1.0.0-M18-SNAPSHOT/maven-metadata.xml
(1016 B at 7.3 KB/sec)
Downloading: http://repository.apache.org/snapshots/org/apache/directory/api/api-util/1.0.0-M18-SNAPSHOT/api-util-1.0.0-M18-20130620.160435-50.pom
Downloaded: http://repository.apache.org/snapshots/org/apache/directory/api/api-util/1.0.0-M18-SNAPSHOT/api-util-1.0.0-M18-20130620.160435-50.pom
(3 KB at 37.4 KB/sec)
Downloading: http://repo1.maven.org/maven2/org/apache/directory/project/project/30/project-30.pom
[INFO] ------------------------------------------------------------------------
[INFO] Reactor Summary:
[INFO] 
[INFO] ApacheDS .......................................... SUCCESS [5.006s]
[INFO] ApacheDS I18n ..................................... SUCCESS [5.374s]
[INFO] ApacheDS Core Constants ........................... SUCCESS [2.581s]
[INFO] ApacheDS Core API ................................. FAILURE [6.929s]
[INFO] ApacheDS Core Shared .............................. SKIPPED
[INFO] ApacheDS Interceptors ............................. SKIPPED
[INFO] ApacheDS AdministrativePoint Interceptor .......... SKIPPED
[INFO] ApacheDS Authentication Interceptor ............... SKIPPED
[INFO] ApacheDS Authorization Interceptor ................ SKIPPED
[INFO] ApacheDS ChangeLog Interceptor .................... SKIPPED
[INFO] ApacheDS Collective Attribute Interceptor ......... SKIPPED
[INFO] ApacheDS Event Interceptor ........................ SKIPPED
[INFO] ApacheDS Exception Interceptor .................... SKIPPED
[INFO] ApacheDS Journal Interceptor ...................... SKIPPED
[INFO] ApacheDS Normalization Interceptor ................ SKIPPED
[INFO] ApacheDS Operational Attribute Interceptor ........ SKIPPED
[INFO] ApacheDS Referral Interceptor ..................... SKIPPED
[INFO] ApacheDS Schema Interceptor ....................... SKIPPED
[INFO] ApacheDS Subtree Interceptor ...................... SKIPPED
[INFO] ApacheDS Triggers Interceptor ..................... SKIPPED
[INFO] ApacheDS Core ..................................... SKIPPED
[INFO] ApacheDS Core AVL ................................. SKIPPED
[INFO] ApacheDS Generalized (X) DBM Partition ............ SKIPPED
[INFO] ApacheDS LDIF Partition ........................... SKIPPED
[INFO] ApacheDS JDBM Partition ........................... SKIPPED
[INFO] ApacheDS Core Annotations ......................... SKIPPED
[INFO] ApacheDS Core JNDI ................................ SKIPPED
[INFO] ApacheDS Protocol Kerberos Codec .................. SKIPPED
[INFO] ApacheDS Interceptors for Kerberos ................ SKIPPED
[INFO] ApacheDS Protocol Dhcp ............................ SKIPPED
[INFO] ApacheDS Protocol Shared .......................... SKIPPED
[INFO] ApacheDS Protocol Dns ............................. SKIPPED
[INFO] ApacheDS Protocol Kerberos ........................ SKIPPED
[INFO] ApacheDS Protocol Ldap ............................ SKIPPED
[INFO] ApacheDS Protocol Ntp ............................. SKIPPED
[INFO] Apacheds Server Annotations ....................... SKIPPED
[INFO] ApacheDS Server Config ............................ SKIPPED
[INFO] ApacheDS Server JNDI .............................. SKIPPED
[INFO] ApacheDS Test Framework ........................... SKIPPED
[INFO] ApacheDS All ...................................... SKIPPED
[INFO] ApacheDS Logger Interceptor ....................... SKIPPED
[INFO] ApacheDS Password Hashing Interceptor ............. SKIPPED
[INFO] ApacheDS Core Integration ......................... SKIPPED
[INFO] ApacheDS Protocol Kerberos Test ................... SKIPPED
[INFO] ApacheDS Server Integration ....................... SKIPPED
[INFO] ApacheDS DirectoryService-WebApp bridge ........... SKIPPED
[INFO] ApacheDS Jetty HTTP Server Integration ............ SKIPPED
[INFO] ApacheDS Service Builder .......................... SKIPPED
[INFO] Apache Directory LDAP Client API test ............. SKIPPED
[INFO] kerberos-client ................................... SKIPPED
[INFO] ApacheDS Service .................................. SKIPPED
[INFO] ApacheDS Wrapper .................................. SKIPPED
[INFO] ApacheDS Installers Maven Plugin .................. SKIPPED
[INFO] ApacheDS Installers ............................... SKIPPED
[INFO] ------------------------------------------------------------------------
[INFO] BUILD FAILURE
[INFO] ------------------------------------------------------------------------
[INFO] Total time: 23.287s
[INFO] Finished at: Fri Jun 21 05:04:05 BST 2013
[INFO] Final Memory: 40M/244M
[INFO] ------------------------------------------------------------------------
[JENKINS] Archiving disabled
[JENKINS] Archiving disabled
[JENKINS] Archiving disabled
[JENKINS] Archiving disabled
[JENKINS] Archiving disabled
[JENKINS] Archiving disabled
[JENKINS] Archiving disabled
[JENKINS] Archiving disabled
[JENKINS] Archiving disabled
[JENKINS] Archiving disabled
[JENKINS] Archiving disabled
[JENKINS] Archiving disabled
[JENKINS] Archiving disabled
[JENKINS] Archiving disabled
[JENKINS] Archiving disabled
[JENKINS] Archiving disabled
[JENKINS] Archiving disabled
[JENKINS] Archiving disabled
[JENKINS] Archiving disabled
[JENKINS] Archiving disabled
[JENKINS] Archiving disabled
[JENKINS] Archiving disabled
[JENKINS] Archiving disabled
[JENKINS] Archiving disabled
[JENKINS] Archiving disabled
[JENKINS] Archiving disabled
[JENKINS] Archiving disabled
[JENKINS] Archiving disabled
[JENKINS] Archiving disabled
[JENKINS] Archiving disabled
[JENKINS] Archiving disabled
[JENKINS] Archiving disabled
[JENKINS] Archiving disabled
[JENKINS] Archiving disabled
[JENKINS] Archiving disabled
[JENKINS] Archiving disabled
[JENKINS] Archiving disabled
[JENKINS] Archiving disabled
[JENKINS] Archiving disabled
[JENKINS] Archiving disabled
[JENKINS] Archiving disabled
[JENKINS] Archiving disabled
[JENKINS] Archiving disabled
[JENKINS] Archiving disabled
[JENKINS] Archiving disabled
[JENKINS] Archiving disabled
[JENKINS] Archiving disabled
[JENKINS] Archiving disabled
[JENKINS] Archiving disabled
[JENKINS] Archiving disabled
[JENKINS] Archiving disabled
[JENKINS] Archiving disabled
[JENKINS] Archiving disabled
[JENKINS] Archiving disabled
Waiting for Jenkins to finish collecting data
mavenExecutionResult exceptions not empty
message : Failed to execute goal on project apacheds-core-api: Could not resolve dependencies
for project org.apache.directory.server:apacheds-core-api:bundle:2.0.0-M13-SNAPSHOT: Failed
to collect dependencies for [org.apache.directory.junit:junit-addons:jar:0.1 (test), commons-lang:commons-lang:jar:2.6
(compile), org.apache.directory.server:apacheds-core-constants:jar:2.0.0-M13-SNAPSHOT (compile),
org.apache.directory.server:apacheds-i18n:jar:2.0.0-M13-SNAPSHOT (compile), org.apache.directory.api:api-i18n:jar:1.0.0-M18-SNAPSHOT
(compile), org.apache.directory.api:api-asn1-api:jar:1.0.0-M18-SNAPSHOT (compile), org.apache.directory.api:api-ldap-client-api:jar:1.0.0-M18-SNAPSHOT
(compile), org.apache.directory.api:api-ldap-codec-core:jar:1.0.0-M18-SNAPSHOT (compile),
org.apache.directory.api:api-ldap-extras-aci:jar:1.0.0-M18-SNAPSHOT (compile), org.apache.directory.api:api-ldap-extras-util:jar:1.0.0-M18-SNAPSHOT
(compile), org.apache.directory.api:api-ldap-model:jar:1.0.0-M18-SNAPSHOT (compile), org.apache.directory.api:api-ldap-schema-data:jar:1.0.0-M18-SNAPSHOT
(compile), org.apache.directory.api:api-util:jar:1.0.0-M18-SNAPSHOT (compile), org.apache.mina:mina-core:jar:2.0.7
(compile), net.sf.ehcache:ehcache-core:jar:2.4.4 (compile), findbugs:annotations:jar:1.0.0
(provided), org.slf4j:slf4j-api:jar:1.7.5 (compile), org.slf4j:slf4j-log4j12:jar:1.7.5 (test),
junit:junit:jar:4.11 (test)]
cause : Could not resolve dependencies for project org.apache.directory.server:apacheds-core-api:bundle:2.0.0-M13-SNAPSHOT:
Failed to collect dependencies for [org.apache.directory.junit:junit-addons:jar:0.1 (test),
commons-lang:commons-lang:jar:2.6 (compile), org.apache.directory.server:apacheds-core-constants:jar:2.0.0-M13-SNAPSHOT
(compile), org.apache.directory.server:apacheds-i18n:jar:2.0.0-M13-SNAPSHOT (compile), org.apache.directory.api:api-i18n:jar:1.0.0-M18-SNAPSHOT
(compile), org.apache.directory.api:api-asn1-api:jar:1.0.0-M18-SNAPSHOT (compile), org.apache.directory.api:api-ldap-client-api:jar:1.0.0-M18-SNAPSHOT
(compile), org.apache.directory.api:api-ldap-codec-core:jar:1.0.0-M18-SNAPSHOT (compile),
org.apache.directory.api:api-ldap-extras-aci:jar:1.0.0-M18-SNAPSHOT (compile), org.apache.directory.api:api-ldap-extras-util:jar:1.0.0-M18-SNAPSHOT
(compile), org.apache.directory.api:api-ldap-model:jar:1.0.0-M18-SNAPSHOT (compile), org.apache.directory.api:api-ldap-schema-data:jar:1.0.0-M18-SNAPSHOT
(compile), org.apache.directory.api:api-util:jar:1.0.0-M18-SNAPSHOT (compile), org.apache.mina:mina-core:jar:2.0.7
(compile), net.sf.ehcache:ehcache-core:jar:2.4.4 (compile), findbugs:annotations:jar:1.0.0
(provided), org.slf4j:slf4j-api:jar:1.7.5 (compile), org.slf4j:slf4j-log4j12:jar:1.7.5 (test),
junit:junit:jar:4.11 (test)]
Stack trace : 
org.apache.maven.lifecycle.LifecycleExecutionException: Failed to execute goal on project
apacheds-core-api: Could not resolve dependencies for project org.apache.directory.server:apacheds-core-api:bundle:2.0.0-M13-SNAPSHOT:
Failed to collect dependencies for [org.apache.directory.junit:junit-addons:jar:0.1 (test),
commons-lang:commons-lang:jar:2.6 (compile), org.apache.directory.server:apacheds-core-constants:jar:2.0.0-M13-SNAPSHOT
(compile), org.apache.directory.server:apacheds-i18n:jar:2.0.0-M13-SNAPSHOT (compile), org.apache.directory.api:api-i18n:jar:1.0.0-M18-SNAPSHOT
(compile), org.apache.directory.api:api-asn1-api:jar:1.0.0-M18-SNAPSHOT (compile), org.apache.directory.api:api-ldap-client-api:jar:1.0.0-M18-SNAPSHOT
(compile), org.apache.directory.api:api-ldap-codec-core:jar:1.0.0-M18-SNAPSHOT (compile),
org.apache.directory.api:api-ldap-extras-aci:jar:1.0.0-M18-SNAPSHOT (compile), org.apache.directory.api:api-ldap-extras-util:jar:1.0.0-M18-SNAPSHOT
(compile), org.apache.directory.api:api-ldap-model:jar:1.0.0-M18-SNAPSHOT (compile), org.apache.directory.api:api-ldap-schema-data:jar:1.0.0-M18-SNAPSHOT
(compile), org.apache.directory.api:api-util:jar:1.0.0-M18-SNAPSHOT (compile), org.apache.mina:mina-core:jar:2.0.7
(compile), net.sf.ehcache:ehcache-core:jar:2.4.4 (compile), findbugs:annotations:jar:1.0.0
(provided), org.slf4j:slf4j-api:jar:1.7.5 (compile), org.slf4j:slf4j-log4j12:jar:1.7.5 (test),
junit:junit:jar:4.11 (test)]
	at org.apache.maven.lifecycle.internal.LifecycleDependencyResolver.getDependencies(LifecycleDependencyResolver.java:190)
	at org.apache.maven.lifecycle.internal.LifecycleDependencyResolver.resolveProjectDependencies(LifecycleDependencyResolver.java:104)
	at org.apache.maven.lifecycle.internal.MojoExecutor.ensureDependenciesAreResolved(MojoExecutor.java:258)
	at org.apache.maven.lifecycle.internal.MojoExecutor.execute(MojoExecutor.java:201)
	at org.apache.maven.lifecycle.internal.MojoExecutor.execute(MojoExecutor.java:153)
	at org.apache.maven.lifecycle.internal.MojoExecutor.execute(MojoExecutor.java:145)
	at org.apache.maven.lifecycle.internal.LifecycleModuleBuilder.buildProject(LifecycleModuleBuilder.java:84)
	at org.apache.maven.lifecycle.internal.LifecycleModuleBuilder.buildProject(LifecycleModuleBuilder.java:59)
	at org.apache.maven.lifecycle.internal.LifecycleStarter.singleThreadedBuild(LifecycleStarter.java:183)
	at org.apache.maven.lifecycle.internal.LifecycleStarter.execute(LifecycleStarter.java:161)
	at org.apache.maven.DefaultMaven.doExecute(DefaultMaven.java:319)
	at org.apache.maven.DefaultMaven.execute(DefaultMaven.java:156)
	at org.jvnet.hudson.maven3.launcher.Maven3Launcher.main(Maven3Launcher.java:79)
	at sun.reflect.NativeMethodAccessorImpl.invoke0(Native Method)
	at sun.reflect.NativeMethodAccessorImpl.invoke(NativeMethodAccessorImpl.java:39)
	at sun.reflect.DelegatingMethodAccessorImpl.invoke(DelegatingMethodAccessorImpl.java:25)
	at java.lang.reflect.Method.invoke(Method.java:597)
	at org.codehaus.plexus.classworlds.launcher.Launcher.launchStandard(Launcher.java:329)
	at org.codehaus.plexus.classworlds.launcher.Launcher.launch(Launcher.java:239)
	at org.jvnet.hudson.maven3.agent.Maven3Main.launch(Maven3Main.java:158)
	at hudson.maven.Maven3Builder.call(Maven3Builder.java:100)
	at hudson.maven.Maven3Builder.call(Maven3Builder.java:66)
	at hudson.remoting.UserRequest.perform(UserRequest.java:118)
	at hudson.remoting.UserRequest.perform(UserRequest.java:48)
	at hudson.remoting.Request$2.run(Request.java:326)
	at hudson.remoting.InterceptingExecutorService$1.call(InterceptingExecutorService.java:72)
	at java.util.concurrent.FutureTask$Sync.innerRun(FutureTask.java:303)
	at java.util.concurrent.FutureTask.run(FutureTask.java:138)
	at java.util.concurrent.ThreadPoolExecutor$Worker.runTask(ThreadPoolExecutor.java:886)
	at java.util.concurrent.ThreadPoolExecutor$Worker.run(ThreadPoolExecutor.java:908)
	at java.lang.Thread.run(Thread.java:662)
Caused by: org.apache.maven.project.DependencyResolutionException: Could not resolve dependencies
for project org.apache.directory.server:apacheds-core-api:bundle:2.0.0-M13-SNAPSHOT: Failed
to collect dependencies for [org.apache.directory.junit:junit-addons:jar:0.1 (test), commons-lang:commons-lang:jar:2.6
(compile), org.apache.directory.server:apacheds-core-constants:jar:2.0.0-M13-SNAPSHOT (compile),
org.apache.directory.server:apacheds-i18n:jar:2.0.0-M13-SNAPSHOT (compile), org.apache.directory.api:api-i18n:jar:1.0.0-M18-SNAPSHOT
(compile), org.apache.directory.api:api-asn1-api:jar:1.0.0-M18-SNAPSHOT (compile), org.apache.directory.api:api-ldap-client-api:jar:1.0.0-M18-SNAPSHOT
(compile), org.apache.directory.api:api-ldap-codec-core:jar:1.0.0-M18-SNAPSHOT (compile),
org.apache.directory.api:api-ldap-extras-aci:jar:1.0.0-M18-SNAPSHOT (compile), org.apache.directory.api:api-ldap-extras-util:jar:1.0.0-M18-SNAPSHOT
(compile), org.apache.directory.api:api-ldap-model:jar:1.0.0-M18-SNAPSHOT (compile), org.apache.directory.api:api-ldap-schema-data:jar:1.0.0-M18-SNAPSHOT
(compile), org.apache.directory.api:api-util:jar:1.0.0-M18-SNAPSHOT (compile), org.apache.mina:mina-core:jar:2.0.7
(compile), net.sf.ehcache:ehcache-core:jar:2.4.4 (compile), findbugs:annotations:jar:1.0.0
(provided), org.slf4j:slf4j-api:jar:1.7.5 (compile), org.slf4j:slf4j-log4j12:jar:1.7.5 (test),
junit:junit:jar:4.11 (test)]
	at org.apache.maven.project.DefaultProjectDependenciesResolver.resolve(DefaultProjectDependenciesResolver.java:127)
	at org.apache.maven.lifecycle.internal.LifecycleDependencyResolver.getDependencies(LifecycleDependencyResolver.java:165)
	... 30 more
Caused by: org.sonatype.aether.collection.DependencyCollectionException: Failed to collect
dependencies for [org.apache.directory.junit:junit-addons:jar:0.1 (test), commons-lang:commons-lang:jar:2.6
(compile), org.apache.directory.server:apacheds-core-constants:jar:2.0.0-M13-SNAPSHOT (compile),
org.apache.directory.server:apacheds-i18n:jar:2.0.0-M13-SNAPSHOT (compile), org.apache.directory.api:api-i18n:jar:1.0.0-M18-SNAPSHOT
(compile), org.apache.directory.api:api-asn1-api:jar:1.0.0-M18-SNAPSHOT (compile), org.apache.directory.api:api-ldap-client-api:jar:1.0.0-M18-SNAPSHOT
(compile), org.apache.directory.api:api-ldap-codec-core:jar:1.0.0-M18-SNAPSHOT (compile),
org.apache.directory.api:api-ldap-extras-aci:jar:1.0.0-M18-SNAPSHOT (compile), org.apache.directory.api:api-ldap-extras-util:jar:1.0.0-M18-SNAPSHOT
(compile), org.apache.directory.api:api-ldap-model:jar:1.0.0-M18-SNAPSHOT (compile), org.apache.directory.api:api-ldap-schema-data:jar:1.0.0-M18-SNAPSHOT
(compile), org.apache.directory.api:api-util:jar:1.0.0-M18-SNAPSHOT (compile), org.apache.mina:mina-core:jar:2.0.7
(compile), net.sf.ehcache:ehcache-core:jar:2.4.4 (compile), findbugs:annotations:jar:1.0.0
(provided), org.slf4j:slf4j-api:jar:1.7.5 (compile), org.slf4j:slf4j-log4j12:jar:1.7.5 (test),
junit:junit:jar:4.11 (test)]
	at org.sonatype.aether.impl.internal.DefaultDependencyCollector.collectDependencies(DefaultDependencyCollector.java:251)
	at org.sonatype.aether.impl.internal.DefaultRepositorySystem.collectDependencies(DefaultRepositorySystem.java:318)
	at org.apache.maven.project.DefaultProjectDependenciesResolver.resolve(DefaultProjectDependenciesResolver.java:119)
	... 31 more
Caused by: org.sonatype.aether.resolution.ArtifactDescriptorException: Failed to read artifact
descriptor for org.apache.directory.api:api-i18n:jar:1.0.0-M18-SNAPSHOT
	at org.apache.maven.repository.internal.DefaultArtifactDescriptorReader.loadPom(DefaultArtifactDescriptorReader.java:317)
	at org.apache.maven.repository.internal.DefaultArtifactDescriptorReader.readArtifactDescriptor(DefaultArtifactDescriptorReader.java:173)
	at org.sonatype.aether.impl.internal.DefaultDependencyCollector.process(DefaultDependencyCollector.java:419)
	at org.sonatype.aether.impl.internal.DefaultDependencyCollector.collectDependencies(DefaultDependencyCollector.java:233)
	... 33 more
Caused by: org.apache.maven.model.resolution.UnresolvableModelException: Could not find artifact
org.apache.directory.project:project:pom:30 in central (http://repo1.maven.org/maven2)
	at org.apache.maven.repository.internal.DefaultModelResolver.resolveModel(DefaultModelResolver.java:119)
	at org.apache.maven.model.building.DefaultModelBuilder.readParentExternally(DefaultModelBuilder.java:819)
	at org.apache.maven.model.building.DefaultModelBuilder.readParent(DefaultModelBuilder.java:670)
	at org.apache.maven.model.building.DefaultModelBuilder.build(DefaultModelBuilder.java:308)
	at org.apache.maven.model.building.DefaultModelBuilder.build(DefaultModelBuilder.java:232)
	at org.apache.maven.repository.internal.DefaultArtifactDescriptorReader.loadPom(DefaultArtifactDescriptorReader.java:308)
	... 36 more
Caused by: org.sonatype.aether.resolution.ArtifactResolutionException: Could not find artifact
org.apache.directory.project:project:pom:30 in central (http://repo1.maven.org/maven2)
	at org.sonatype.aether.impl.internal.DefaultArtifactResolver.resolveArtifacts(DefaultArtifactResolver.java:526)
	at org.sonatype.aether.impl.internal.DefaultArtifactResolver.resolveArtifact(DefaultArtifactResolver.java:214)
	at org.apache.maven.repository.internal.DefaultModelResolver.resolveModel(DefaultModelResolver.java:115)
	... 41 more
Caused by: org.sonatype.aether.transfer.ArtifactNotFoundException: Could not find artifact
org.apache.directory.project:project:pom:30 in central (http://repo1.maven.org/maven2)
	at org.sonatype.aether.connector.wagon.WagonRepositoryConnector$4.wrap(WagonRepositoryConnector.java:945)
	at org.sonatype.aether.connector.wagon.WagonRepositoryConnector$4.wrap(WagonRepositoryConnector.java:940)
	at org.sonatype.aether.connector.wagon.WagonRepositoryConnector$GetTask.flush(WagonRepositoryConnector.java:696)
	at org.sonatype.aether.connector.wagon.WagonRepositoryConnector$GetTask.flush(WagonRepositoryConnector.java:690)
	at org.sonatype.aether.connector.wagon.WagonRepositoryConnector.get(WagonRepositoryConnector.java:435)
	at org.sonatype.aether.impl.internal.DefaultArtifactResolver.resolveArtifacts(DefaultArtifactResolver.java:438)
	... 43 more
Sending e-mails to: notifications@directory.apache.org
channel stopped

Mime
View raw message