directory-notifications mailing list archives

Site index · List index
Message view « Date » · « Thread »
Top « Date » · « Thread »
From Apache Jenkins Server <jenk...@builds.apache.org>
Subject Build failed in Jenkins: dir-apacheds-jdk16-ubuntu-deploy #1034
Date Thu, 27 Jun 2013 04:13:36 GMT
See <https://builds.apache.org/job/dir-apacheds-jdk16-ubuntu-deploy/1034/changes>

Changes:

[elecharny] Added a test to check that we can replace an attributeType either with a null
value or with no value (in this case, the attribute will be removed)

[elecharny] Modified the test that check we can modify an existing entry by adding some attributes
with null values

[elecharny] Fixed the modification of null values when doing a modification

[pamarcelot] Moved the latest SNAPSHOT version of the project pom.

[kayyagari] bumped up the version

------------------------------------------
[...truncated 7436 lines...]
	at org.apache.maven.lifecycle.internal.LifecycleModuleBuilder.buildProject(LifecycleModuleBuilder.java:59)
	at org.apache.maven.lifecycle.internal.LifecycleStarter.singleThreadedBuild(LifecycleStarter.java:183)
	at org.apache.maven.lifecycle.internal.LifecycleStarter.execute(LifecycleStarter.java:161)
	at org.apache.maven.DefaultMaven.doExecute(DefaultMaven.java:320)
	at org.apache.maven.DefaultMaven.execute(DefaultMaven.java:156)
	at org.jvnet.hudson.maven3.launcher.Maven3Launcher.main(Maven3Launcher.java:79)
	at sun.reflect.NativeMethodAccessorImpl.invoke0(Native Method)
	at sun.reflect.NativeMethodAccessorImpl.invoke(NativeMethodAccessorImpl.java:39)
	at sun.reflect.DelegatingMethodAccessorImpl.invoke(DelegatingMethodAccessorImpl.java:25)
	at java.lang.reflect.Method.invoke(Method.java:597)
	at org.codehaus.plexus.classworlds.launcher.Launcher.launchStandard(Launcher.java:329)
	at org.codehaus.plexus.classworlds.launcher.Launcher.launch(Launcher.java:239)
	at org.jvnet.hudson.maven3.agent.Maven3Main.launch(Maven3Main.java:158)
	at hudson.maven.Maven3Builder.call(Maven3Builder.java:100)
	at hudson.maven.Maven3Builder.call(Maven3Builder.java:66)
	at hudson.remoting.UserRequest.perform(UserRequest.java:118)
	at hudson.remoting.UserRequest.perform(UserRequest.java:48)
	at hudson.remoting.Request$2.run(Request.java:326)
	at hudson.remoting.InterceptingExecutorService$1.call(InterceptingExecutorService.java:72)
	at java.util.concurrent.FutureTask$Sync.innerRun(FutureTask.java:303)
	at java.util.concurrent.FutureTask.run(FutureTask.java:138)
	at java.util.concurrent.ThreadPoolExecutor$Worker.runTask(ThreadPoolExecutor.java:895)
	at java.util.concurrent.ThreadPoolExecutor$Worker.run(ThreadPoolExecutor.java:918)
	at java.lang.Thread.run(Thread.java:662)
Caused by: org.xmlpull.v1.XmlPullParserException: unexpected type (position:END_DOCUMENT null@3:1
in java.io.InputStreamReader@14cbae4) 
	at org.kxml2.io.KXmlParser.exception(Unknown Source)
	at org.kxml2.io.KXmlParser.nextTag(Unknown Source)
	at org.apache.felix.bundlerepository.impl.PullParser.parseRepository(PullParser.java:43)
	at org.apache.felix.bundlerepository.impl.DataModelHelperImpl.repository(DataModelHelperImpl.java:147)
	at org.apache.felix.bundlerepository.impl.DataModelHelperImpl.repository(DataModelHelperImpl.java:118)
	at org.apache.felix.obrplugin.ObrUpdate.parseRepositoryXml(ObrUpdate.java:316)
	... 30 more

[INFO] --- maven-bundle-plugin:2.4.0:install (default-install) @ apacheds-protocol-dns ---
[INFO] Downloading: https://repository.apache.org/content/repositories/snapshots/org/apache/directory/server/apacheds-protocol-dns/2.0.0-M14-SNAPSHOT/maven-metadata.xml

[INFO] --- maven-deploy-plugin:2.7:deploy (default-deploy) @ apacheds-protocol-dns ---
Downloaded: https://repository.apache.org/content/repositories/snapshots/org/apache/directory/server/apacheds-protocol-dns/2.0.0-M14-SNAPSHOT/maven-metadata.xml
(2 KB at 4.8 KB/sec)
Uploading: https://repository.apache.org/content/repositories/snapshots/org/apache/directory/server/apacheds-protocol-dns/2.0.0-M14-SNAPSHOT/apacheds-protocol-dns-2.0.0-M14-20130627.040950-3.jar
Uploaded: https://repository.apache.org/content/repositories/snapshots/org/apache/directory/server/apacheds-protocol-dns/2.0.0-M14-SNAPSHOT/apacheds-protocol-dns-2.0.0-M14-20130627.040950-3.jar
(91 KB at 229.2 KB/sec)
Uploading: https://repository.apache.org/content/repositories/snapshots/org/apache/directory/server/apacheds-protocol-dns/2.0.0-M14-SNAPSHOT/apacheds-protocol-dns-2.0.0-M14-20130627.040950-3.pom
Uploaded: https://repository.apache.org/content/repositories/snapshots/org/apache/directory/server/apacheds-protocol-dns/2.0.0-M14-SNAPSHOT/apacheds-protocol-dns-2.0.0-M14-20130627.040950-3.pom
(4 KB at 12.0 KB/sec)
Downloading: https://repository.apache.org/content/repositories/snapshots/org/apache/directory/server/apacheds-protocol-dns/maven-metadata.xml
Downloaded: https://repository.apache.org/content/repositories/snapshots/org/apache/directory/server/apacheds-protocol-dns/maven-metadata.xml
(460 B at 1.1 KB/sec)
Uploading: https://repository.apache.org/content/repositories/snapshots/org/apache/directory/server/apacheds-protocol-dns/2.0.0-M14-SNAPSHOT/maven-metadata.xml
Uploaded: https://repository.apache.org/content/repositories/snapshots/org/apache/directory/server/apacheds-protocol-dns/2.0.0-M14-SNAPSHOT/maven-metadata.xml
(2 KB at 3.4 KB/sec)
Uploading: https://repository.apache.org/content/repositories/snapshots/org/apache/directory/server/apacheds-protocol-dns/maven-metadata.xml
Uploaded: https://repository.apache.org/content/repositories/snapshots/org/apache/directory/server/apacheds-protocol-dns/maven-metadata.xml
(460 B at 1.3 KB/sec)
Uploading: https://repository.apache.org/content/repositories/snapshots/org/apache/directory/server/apacheds-protocol-dns/2.0.0-M14-SNAPSHOT/apacheds-protocol-dns-2.0.0-M14-20130627.040950-3-sources.jar
Uploaded: https://repository.apache.org/content/repositories/snapshots/org/apache/directory/server/apacheds-protocol-dns/2.0.0-M14-SNAPSHOT/apacheds-protocol-dns-2.0.0-M14-20130627.040950-3-sources.jar
(117 KB at 277.1 KB/sec)
Uploading: https://repository.apache.org/content/repositories/snapshots/org/apache/directory/server/apacheds-protocol-dns/2.0.0-M14-SNAPSHOT/maven-metadata.xml
Uploaded: https://repository.apache.org/content/repositories/snapshots/org/apache/directory/server/apacheds-protocol-dns/2.0.0-M14-SNAPSHOT/maven-metadata.xml
(2 KB at 3.2 KB/sec)
[INFO] [INFO] Remote OBR update disabled (enable with -DremoteOBR)

[INFO] --- maven-bundle-plugin:2.4.0:deploy (default-deploy) @ apacheds-protocol-dns ---
[INFO]                                                                         
[INFO] ------------------------------------------------------------------------
[INFO] Building ApacheDS Protocol Kerberos 2.0.0-M14-SNAPSHOT
[INFO] ------------------------------------------------------------------------
[INFO] 
[INFO] --- maven-clean-plugin:2.4.1:clean (default-clean) @ apacheds-protocol-kerberos ---
[INFO] 
[INFO] --- maven-remote-resources-plugin:1.2.1:process (default) @ apacheds-protocol-kerberos
---
[INFO] [INFO] Using 'UTF-8' encoding to copy filtered resources.
[INFO] Copying 0 resource
[INFO] Copying 3 resources

[INFO] --- maven-resources-plugin:2.6:resources (default-resources) @ apacheds-protocol-kerberos
---
[INFO] 
[INFO] [INFO] Changes detected - recompiling the module!
--- maven-compiler-plugin:3.1:compile (default-compile) @ apacheds-protocol-kerberos ---
[INFO] Compiling 33 source files to <https://builds.apache.org/job/dir-apacheds-jdk16-ubuntu-deploy/ws/trunk/protocol-kerberos/target/classes>
[INFO] [INFO] Using 'UTF-8' encoding to copy filtered resources.
[INFO] Copying 2 resources
[INFO] Copying 3 resources

[INFO] --- maven-resources-plugin:2.6:testResources (default-testResources) @ apacheds-protocol-kerberos
---
[INFO] [INFO] Changes detected - recompiling the module!
[INFO] Compiling 11 source files to <https://builds.apache.org/job/dir-apacheds-jdk16-ubuntu-deploy/ws/trunk/protocol-kerberos/target/test-classes>

[INFO] --- maven-compiler-plugin:3.1:testCompile (default-testCompile) @ apacheds-protocol-kerberos
---
[INFO] Surefire report directory: <https://builds.apache.org/job/dir-apacheds-jdk16-ubuntu-deploy/ws/trunk/protocol-kerberos/target/surefire-reports>
[INFO] 
-------------------------------------------------------
 T E S T S
-------------------------------------------------------

[INFO] --- maven-surefire-plugin:2.15:test (default-test) @ apacheds-protocol-kerberos ---
Running org.apache.directory.server.kerberos.protocol.TicketGrantingServiceTest
Tests run: 37, Failures: 0, Errors: 0, Skipped: 2, Time elapsed: 1.273 sec - in org.apache.directory.server.kerberos.protocol.TicketGrantingServiceTest
Running org.apache.directory.server.kerberos.protocol.AuthenticationPolicyTest
Tests run: 7, Failures: 0, Errors: 0, Skipped: 0, Time elapsed: 0.009 sec - in org.apache.directory.server.kerberos.protocol.AuthenticationPolicyTest
Running org.apache.directory.server.kerberos.protocol.TicketGrantingEncryptionTypeTest
Tests run: 6, Failures: 0, Errors: 0, Skipped: 1, Time elapsed: 0.074 sec - in org.apache.directory.server.kerberos.protocol.TicketGrantingEncryptionTypeTest
Running org.apache.directory.server.kerberos.protocol.EncTktInSkeyTest
Tests run: 1, Failures: 0, Errors: 0, Skipped: 0, Time elapsed: 0.013 sec - in org.apache.directory.server.kerberos.protocol.EncTktInSkeyTest
Running org.apache.directory.server.kerberos.protocol.AuthenticationEncryptionTypeTest
Tests run: 4, Failures: 0, Errors: 0, Skipped: 1, Time elapsed: 0.04 sec - in org.apache.directory.server.kerberos.protocol.AuthenticationEncryptionTypeTest
Running org.apache.directory.server.kerberos.protocol.TicketGrantingPolicyTest
Tests run: 12, Failures: 0, Errors: 0, Skipped: 0, Time elapsed: 0.167 sec - in org.apache.directory.server.kerberos.protocol.TicketGrantingPolicyTest
Running org.apache.directory.server.kerberos.protocol.PreAuthenticationTest
Tests run: 4, Failures: 0, Errors: 0, Skipped: 0, Time elapsed: 0.037 sec - in org.apache.directory.server.kerberos.protocol.PreAuthenticationTest
Running org.apache.directory.server.kerberos.protocol.AuthenticationServiceTest
Tests run: 30, Failures: 0, Errors: 0, Skipped: 0, Time elapsed: 0.307 sec - in org.apache.directory.server.kerberos.protocol.AuthenticationServiceTest

Results :

Tests run: 101, Failures: 0, Errors: 0, Skipped: 4

[JENKINS] Recording test results
[INFO] 
[INFO] --- maven-bundle-plugin:2.4.0:bundle (default-bundle) @ apacheds-protocol-kerberos
---
[WARNING] Bundle org.apache.directory.server:apacheds-protocol-kerberos:bundle:2.0.0-M14-SNAPSHOT
: Split package, multiple jars provide the same package:org/apache/directory/server/kerberos/protocol/codec
Use Import/Export Package directive -split-package:=(merge-first|merge-last|error|first) to
get rid of this warning
Package found in   [Jar:., Jar:apacheds-kerberos-codec]
Class path         [Jar:., Jar:apacheds-core-api, Jar:commons-lang, Jar:apacheds-core-constants,
Jar:api-i18n, Jar:api-ldap-client-api, Jar:commons-pool, Jar:api-ldap-codec-core, Jar:api-ldap-extras-aci,
Jar:api-ldap-extras-util, Jar:api-ldap-schema-data, Jar:api-util, Jar:apacheds-i18n, Jar:apacheds-kerberos-codec,
Jar:api-asn1-ber, Jar:apacheds-protocol-shared, Jar:apacheds-core-shared, Jar:api-ldap-extras-codec-api,
Jar:api-asn1-api, Jar:api-ldap-model, Jar:antlr, Jar:commons-collections, Jar:mina-core, Jar:ehcache-core,
Jar:annotations, Jar:slf4j-api]
[INFO] 
[INFO] --- maven-site-plugin:3.3:attach-descriptor (attach-descriptor) @ apacheds-protocol-kerberos
---
[INFO] [INFO] Checking legal files in: apacheds-protocol-kerberos-2.0.0-M14-SNAPSHOT.jar

[INFO] --- tools-maven-plugin:1.4:verify-legal-files (verify-legal-files) @ apacheds-protocol-kerberos
---
Jun 27, 2013 4:09:59 AM hudson.maven.ExecutedMojo <init>
WARNING: Failed to getClass for org.apache.maven.plugin.source.SourceJarMojo
[INFO] [INFO] Building jar: <https://builds.apache.org/job/dir-apacheds-jdk16-ubuntu-deploy/ws/trunk/protocol-kerberos/target/apacheds-protocol-kerberos-2.0.0-M14-SNAPSHOT-sources.jar>

[INFO] --- maven-source-plugin:2.2.1:jar (attach-sources) @ apacheds-protocol-kerberos ---
[INFO] [INFO] Installing <https://builds.apache.org/job/dir-apacheds-jdk16-ubuntu-deploy/ws/trunk/protocol-kerberos/target/apacheds-protocol-kerberos-2.0.0-M14-SNAPSHOT.jar>
to /home/jenkins/jenkins-slave/maven-repositories/0/org/apache/directory/server/apacheds-protocol-kerberos/2.0.0-M14-SNAPSHOT/apacheds-protocol-kerberos-2.0.0-M14-SNAPSHOT.jar
[INFO] Installing <https://builds.apache.org/job/dir-apacheds-jdk16-ubuntu-deploy/ws/trunk/protocol-kerberos/pom.xml>
to /home/jenkins/jenkins-slave/maven-repositories/0/org/apache/directory/server/apacheds-protocol-kerberos/2.0.0-M14-SNAPSHOT/apacheds-protocol-kerberos-2.0.0-M14-SNAPSHOT.pom

[INFO] Installing <https://builds.apache.org/job/dir-apacheds-jdk16-ubuntu-deploy/ws/trunk/protocol-kerberos/target/apacheds-protocol-kerberos-2.0.0-M14-SNAPSHOT-sources.jar>
to /home/jenkins/jenkins-slave/maven-repositories/0/org/apache/directory/server/apacheds-protocol-kerberos/2.0.0-M14-SNAPSHOT/apacheds-protocol-kerberos-2.0.0-M14-SNAPSHOT-sources.jar
[INFO] --- maven-install-plugin:2.4:install (default-install) @ apacheds-protocol-kerberos
---
[INFO] [WARNING] Exception while updating local OBR: Unable to read repository xml: file:/home/jenkins/jenkins-slave/maven-repositories/0/repository.xml
org.apache.maven.plugin.MojoExecutionException: Unable to read repository xml: file:/home/jenkins/jenkins-slave/maven-repositories/0/repository.xml
	at org.apache.felix.obrplugin.ObrUpdate.parseRepositoryXml(ObrUpdate.java:324)
	at org.apache.felix.obrplugin.ObrInstall.execute(ObrInstall.java:143)
	at org.apache.maven.plugin.DefaultBuildPluginManager.executeMojo(DefaultBuildPluginManager.java:101)
	at org.apache.maven.lifecycle.internal.MojoExecutor.execute(MojoExecutor.java:209)
	at org.apache.maven.lifecycle.internal.MojoExecutor.execute(MojoExecutor.java:153)
	at org.apache.maven.lifecycle.internal.MojoExecutor.execute(MojoExecutor.java:145)
	at org.apache.maven.lifecycle.internal.LifecycleModuleBuilder.buildProject(LifecycleModuleBuilder.java:84)
	at org.apache.maven.lifecycle.internal.LifecycleModuleBuilder.buildProject(LifecycleModuleBuilder.java:59)
	at org.apache.maven.lifecycle.internal.LifecycleStarter.singleThreadedBuild(LifecycleStarter.java:183)
	at org.apache.maven.lifecycle.internal.LifecycleStarter.execute(LifecycleStarter.java:161)
	at org.apache.maven.DefaultMaven.doExecute(DefaultMaven.java:320)
	at org.apache.maven.DefaultMaven.execute(DefaultMaven.java:156)
	at org.jvnet.hudson.maven3.launcher.Maven3Launcher.main(Maven3Launcher.java:79)
	at sun.reflect.NativeMethodAccessorImpl.invoke0(Native Method)
	at sun.reflect.NativeMethodAccessorImpl.invoke(NativeMethodAccessorImpl.java:39)
	at sun.reflect.DelegatingMethodAccessorImpl.invoke(DelegatingMethodAccessorImpl.java:25)
	at java.lang.reflect.Method.invoke(Method.java:597)
	at org.codehaus.plexus.classworlds.launcher.Launcher.launchStandard(Launcher.java:329)
	at org.codehaus.plexus.classworlds.launcher.Launcher.launch(Launcher.java:239)
	at org.jvnet.hudson.maven3.agent.Maven3Main.launch(Maven3Main.java:158)
	at hudson.maven.Maven3Builder.call(Maven3Builder.java:100)
	at hudson.maven.Maven3Builder.call(Maven3Builder.java:66)
	at hudson.remoting.UserRequest.perform(UserRequest.java:118)
	at hudson.remoting.UserRequest.perform(UserRequest.java:48)
	at hudson.remoting.Request$2.run(Request.java:326)
	at hudson.remoting.InterceptingExecutorService$1.call(InterceptingExecutorService.java:72)
	at java.util.concurrent.FutureTask$Sync.innerRun(FutureTask.java:303)
	at java.util.concurrent.FutureTask.run(FutureTask.java:138)
	at java.util.concurrent.ThreadPoolExecutor$Worker.runTask(ThreadPoolExecutor.java:895)
	at java.util.concurrent.ThreadPoolExecutor$Worker.run(ThreadPoolExecutor.java:918)
	at java.lang.Thread.run(Thread.java:662)
Caused by: org.xmlpull.v1.XmlPullParserException: unexpected type (position:END_DOCUMENT null@3:1
in java.io.InputStreamReader@cf6fd6) 
	at org.kxml2.io.KXmlParser.exception(Unknown Source)
	at org.kxml2.io.KXmlParser.nextTag(Unknown Source)
	at org.apache.felix.bundlerepository.impl.PullParser.parseRepository(PullParser.java:43)
	at org.apache.felix.bundlerepository.impl.DataModelHelperImpl.repository(DataModelHelperImpl.java:147)
	at org.apache.felix.bundlerepository.impl.DataModelHelperImpl.repository(DataModelHelperImpl.java:118)
	at org.apache.felix.obrplugin.ObrUpdate.parseRepositoryXml(ObrUpdate.java:316)
	... 30 more

[INFO] --- maven-bundle-plugin:2.4.0:install (default-install) @ apacheds-protocol-kerberos
---
Downloading: https://repository.apache.org/content/repositories/snapshots/org/apache/directory/server/apacheds-protocol-kerberos/2.0.0-M14-SNAPSHOT/maven-metadata.xml
[INFO] 
[INFO] --- maven-deploy-plugin:2.7:deploy (default-deploy) @ apacheds-protocol-kerberos ---
Downloaded: https://repository.apache.org/content/repositories/snapshots/org/apache/directory/server/apacheds-protocol-kerberos/2.0.0-M14-SNAPSHOT/maven-metadata.xml
(2 KB at 5.0 KB/sec)
Uploading: https://repository.apache.org/content/repositories/snapshots/org/apache/directory/server/apacheds-protocol-kerberos/2.0.0-M14-SNAPSHOT/apacheds-protocol-kerberos-2.0.0-M14-20130627.041001-3.jar
Uploaded: https://repository.apache.org/content/repositories/snapshots/org/apache/directory/server/apacheds-protocol-kerberos/2.0.0-M14-SNAPSHOT/apacheds-protocol-kerberos-2.0.0-M14-20130627.041001-3.jar
(83 KB at 208.3 KB/sec)
Uploading: https://repository.apache.org/content/repositories/snapshots/org/apache/directory/server/apacheds-protocol-kerberos/2.0.0-M14-SNAPSHOT/apacheds-protocol-kerberos-2.0.0-M14-20130627.041001-3.pom
Uploaded: https://repository.apache.org/content/repositories/snapshots/org/apache/directory/server/apacheds-protocol-kerberos/2.0.0-M14-SNAPSHOT/apacheds-protocol-kerberos-2.0.0-M14-20130627.041001-3.pom
(5 KB at 12.4 KB/sec)
Downloading: https://repository.apache.org/content/repositories/snapshots/org/apache/directory/server/apacheds-protocol-kerberos/maven-metadata.xml
Downloaded: https://repository.apache.org/content/repositories/snapshots/org/apache/directory/server/apacheds-protocol-kerberos/maven-metadata.xml
(465 B at 2.1 KB/sec)
Uploading: https://repository.apache.org/content/repositories/snapshots/org/apache/directory/server/apacheds-protocol-kerberos/2.0.0-M14-SNAPSHOT/maven-metadata.xml
Uploaded: https://repository.apache.org/content/repositories/snapshots/org/apache/directory/server/apacheds-protocol-kerberos/2.0.0-M14-SNAPSHOT/maven-metadata.xml
(2 KB at 3.7 KB/sec)
Uploading: https://repository.apache.org/content/repositories/snapshots/org/apache/directory/server/apacheds-protocol-kerberos/maven-metadata.xml
Uploaded: https://repository.apache.org/content/repositories/snapshots/org/apache/directory/server/apacheds-protocol-kerberos/maven-metadata.xml
(465 B at 1.4 KB/sec)
Uploading: https://repository.apache.org/content/repositories/snapshots/org/apache/directory/server/apacheds-protocol-kerberos/2.0.0-M14-SNAPSHOT/apacheds-protocol-kerberos-2.0.0-M14-20130627.041001-3-sources.jar
Uploaded: https://repository.apache.org/content/repositories/snapshots/org/apache/directory/server/apacheds-protocol-kerberos/2.0.0-M14-SNAPSHOT/apacheds-protocol-kerberos-2.0.0-M14-20130627.041001-3-sources.jar
(69 KB at 175.0 KB/sec)
Uploading: https://repository.apache.org/content/repositories/snapshots/org/apache/directory/server/apacheds-protocol-kerberos/2.0.0-M14-SNAPSHOT/maven-metadata.xml
Uploaded: https://repository.apache.org/content/repositories/snapshots/org/apache/directory/server/apacheds-protocol-kerberos/2.0.0-M14-SNAPSHOT/maven-metadata.xml
(2 KB at 3.0 KB/sec)
[INFO] Remote OBR update disabled (enable with -DremoteOBR)
[INFO] 
[INFO] --- maven-bundle-plugin:2.4.0:deploy (default-deploy) @ apacheds-protocol-kerberos
---
[INFO] Downloading: http://repository.apache.org/snapshots/org/apache/directory/api/api-ldap-extras-sp/1.0.0-M19-SNAPSHOT/maven-metadata.xml
                                                                        
[INFO] ------------------------------------------------------------------------
[INFO] Building ApacheDS Protocol Ldap 2.0.0-M14-SNAPSHOT
[INFO] ------------------------------------------------------------------------
Downloaded: http://repository.apache.org/snapshots/org/apache/directory/api/api-ldap-extras-sp/1.0.0-M19-SNAPSHOT/maven-metadata.xml
(1022 B at 2.5 KB/sec)
Downloading: http://repository.apache.org/snapshots/org/apache/directory/api/api-ldap-extras-sp/1.0.0-M19-SNAPSHOT/api-ldap-extras-sp-1.0.0-M19-20130627.031238-5.pom
Downloaded: http://repository.apache.org/snapshots/org/apache/directory/api/api-ldap-extras-sp/1.0.0-M19-SNAPSHOT/api-ldap-extras-sp-1.0.0-M19-20130627.031238-5.pom
(4 KB at 30.0 KB/sec)
Downloading: http://repository.apache.org/snapshots/org/apache/directory/api/api-ldap-extras-sp/1.0.0-M19-SNAPSHOT/api-ldap-extras-sp-1.0.0-M19-20130627.031238-5.jar
Downloaded: http://repository.apache.org/snapshots/org/apache/directory/api/api-ldap-extras-sp/1.0.0-M19-SNAPSHOT/api-ldap-extras-sp-1.0.0-M19-20130627.031238-5.jar
(13 KB at 93.1 KB/sec)
[INFO] 
[INFO] --- maven-clean-plugin:2.4.1:clean (default-clean) @ apacheds-protocol-ldap ---
[INFO] 
[INFO] --- maven-remote-resources-plugin:1.2.1:process (default) @ apacheds-protocol-ldap
---
[INFO] Using 'UTF-8' encoding to copy filtered resources.
[INFO] 
[INFO] --- maven-resources-plugin:2.6:resources (default-resources) @ apacheds-protocol-ldap
---
[INFO] Copying 0 resource
[INFO] Copying 3 resources
[INFO] [INFO] Changes detected - recompiling the module!

[INFO] --- maven-compiler-plugin:3.1:compile (default-compile) @ apacheds-protocol-ldap ---
[INFO] Compiling 80 source files to <https://builds.apache.org/job/dir-apacheds-jdk16-ubuntu-deploy/ws/trunk/protocol-ldap/target/classes>
[WARNING] Note: Some input files use unchecked or unsafe operations.
[WARNING] Note: Recompile with -Xlint:unchecked for details.
[INFO] [INFO] Using 'UTF-8' encoding to copy filtered resources.
[INFO] Copying 1 resource
[INFO] Copying 3 resources

[INFO] --- maven-resources-plugin:2.6:testResources (default-testResources) @ apacheds-protocol-ldap
---
[INFO] [INFO] Changes detected - recompiling the module!
[INFO] Compiling 3 source files to <https://builds.apache.org/job/dir-apacheds-jdk16-ubuntu-deploy/ws/trunk/protocol-ldap/target/test-classes>

[INFO] --- maven-compiler-plugin:3.1:testCompile (default-testCompile) @ apacheds-protocol-ldap
---
[INFO] Surefire report directory: <https://builds.apache.org/job/dir-apacheds-jdk16-ubuntu-deploy/ws/trunk/protocol-ldap/target/surefire-reports>
[INFO] 
-------------------------------------------------------
 T E S T S
-------------------------------------------------------

[INFO] --- maven-surefire-plugin:2.15:test (default-test) @ apacheds-protocol-ldap ---
Running org.apache.directory.server.ldap.SettingAlternativeHandlersTest
Tests run: 2, Failures: 0, Errors: 0, Skipped: 0, Time elapsed: 0.174 sec - in org.apache.directory.server.ldap.SettingAlternativeHandlersTest
Running org.apache.directory.server.ldap.JournalTest
Tests run: 3, Failures: 0, Errors: 0, Skipped: 1, Time elapsed: 122.62 sec - in org.apache.directory.server.ldap.JournalTest
Running org.apache.directory.server.ldap.LdapServerSettingsTest
Tests run: 3, Failures: 0, Errors: 0, Skipped: 0, Time elapsed: 0.031 sec - in org.apache.directory.server.ldap.LdapServerSettingsTest

Results :

Tests run: 8, Failures: 0, Errors: 0, Skipped: 1

ERROR: Maven JVM terminated unexpectedly with exit code 143


Mime
View raw message