directory-notifications mailing list archives

Site index · List index
Message view « Date » · « Thread »
Top « Date » · « Thread »
From Apache Jenkins Server <jenk...@builds.apache.org>
Subject Build failed in Jenkins: dir-apacheds-jdk16-ubuntu-deploy #1021
Date Fri, 14 Jun 2013 05:24:41 GMT
See <https://builds.apache.org/job/dir-apacheds-jdk16-ubuntu-deploy/1021/changes>

Changes:

[elecharny] Removed the extra logs for CollectveAttributes : I have got what I wanted

[kayyagari] reverted the changes to allow debug logs from collective attribute interceptor

[elecharny] Removed some System.out.println

------------------------------------------
[...truncated 4128 lines...]
[INFO] Downloading: https://repository.apache.org/content/repositories/snapshots/org/apache/directory/server/apacheds-kerberos-test/2.0.0-M13-SNAPSHOT/maven-metadata.xml

[INFO] --- maven-deploy-plugin:2.7:deploy (default-deploy) @ apacheds-kerberos-test ---
Downloaded: https://repository.apache.org/content/repositories/snapshots/org/apache/directory/server/apacheds-kerberos-test/2.0.0-M13-SNAPSHOT/maven-metadata.xml
(2 KB at 3.2 KB/sec)
Uploading: https://repository.apache.org/content/repositories/snapshots/org/apache/directory/server/apacheds-kerberos-test/2.0.0-M13-SNAPSHOT/apacheds-kerberos-test-2.0.0-M13-20130614.045902-24.jar
Uploaded: https://repository.apache.org/content/repositories/snapshots/org/apache/directory/server/apacheds-kerberos-test/2.0.0-M13-SNAPSHOT/apacheds-kerberos-test-2.0.0-M13-20130614.045902-24.jar
(7 KB at 23.5 KB/sec)
Uploading: https://repository.apache.org/content/repositories/snapshots/org/apache/directory/server/apacheds-kerberos-test/2.0.0-M13-SNAPSHOT/apacheds-kerberos-test-2.0.0-M13-20130614.045902-24.pom
Uploaded: https://repository.apache.org/content/repositories/snapshots/org/apache/directory/server/apacheds-kerberos-test/2.0.0-M13-SNAPSHOT/apacheds-kerberos-test-2.0.0-M13-20130614.045902-24.pom
(5 KB at 13.2 KB/sec)
Downloading: https://repository.apache.org/content/repositories/snapshots/org/apache/directory/server/apacheds-kerberos-test/maven-metadata.xml
Downloaded: https://repository.apache.org/content/repositories/snapshots/org/apache/directory/server/apacheds-kerberos-test/maven-metadata.xml
(417 B at 1.4 KB/sec)
Uploading: https://repository.apache.org/content/repositories/snapshots/org/apache/directory/server/apacheds-kerberos-test/2.0.0-M13-SNAPSHOT/maven-metadata.xml
Uploaded: https://repository.apache.org/content/repositories/snapshots/org/apache/directory/server/apacheds-kerberos-test/2.0.0-M13-SNAPSHOT/maven-metadata.xml
(2 KB at 4.4 KB/sec)
Uploading: https://repository.apache.org/content/repositories/snapshots/org/apache/directory/server/apacheds-kerberos-test/maven-metadata.xml
Uploaded: https://repository.apache.org/content/repositories/snapshots/org/apache/directory/server/apacheds-kerberos-test/maven-metadata.xml
(417 B at 1.2 KB/sec)
Uploading: https://repository.apache.org/content/repositories/snapshots/org/apache/directory/server/apacheds-kerberos-test/2.0.0-M13-SNAPSHOT/apacheds-kerberos-test-2.0.0-M13-20130614.045902-24-tests.jar
Uploaded: https://repository.apache.org/content/repositories/snapshots/org/apache/directory/server/apacheds-kerberos-test/2.0.0-M13-SNAPSHOT/apacheds-kerberos-test-2.0.0-M13-20130614.045902-24-tests.jar
(31 KB at 83.2 KB/sec)
Uploading: https://repository.apache.org/content/repositories/snapshots/org/apache/directory/server/apacheds-kerberos-test/2.0.0-M13-SNAPSHOT/maven-metadata.xml
Uploaded: https://repository.apache.org/content/repositories/snapshots/org/apache/directory/server/apacheds-kerberos-test/2.0.0-M13-SNAPSHOT/maven-metadata.xml
(2 KB at 3.9 KB/sec)
Uploading: https://repository.apache.org/content/repositories/snapshots/org/apache/directory/server/apacheds-kerberos-test/2.0.0-M13-SNAPSHOT/apacheds-kerberos-test-2.0.0-M13-20130614.045902-24-sources.jar
Uploaded: https://repository.apache.org/content/repositories/snapshots/org/apache/directory/server/apacheds-kerberos-test/2.0.0-M13-SNAPSHOT/apacheds-kerberos-test-2.0.0-M13-20130614.045902-24-sources.jar
(7 KB at 17.7 KB/sec)
Uploading: https://repository.apache.org/content/repositories/snapshots/org/apache/directory/server/apacheds-kerberos-test/2.0.0-M13-SNAPSHOT/maven-metadata.xml
Uploaded: https://repository.apache.org/content/repositories/snapshots/org/apache/directory/server/apacheds-kerberos-test/2.0.0-M13-SNAPSHOT/maven-metadata.xml
(2 KB at 3.7 KB/sec)
[INFO]                                                                         
[INFO] ------------------------------------------------------------------------
[INFO] Building ApacheDS Server Integration 2.0.0-M13-SNAPSHOT
[INFO] ------------------------------------------------------------------------
Downloading: http://repository.apache.org/snapshots/org/apache/directory/api/api-dsml-engine/1.0.0-M18-SNAPSHOT/maven-metadata.xml
Downloaded: http://repository.apache.org/snapshots/org/apache/directory/api/api-dsml-engine/1.0.0-M18-SNAPSHOT/maven-metadata.xml
(1023 B at 3.1 KB/sec)
Downloading: http://repository.apache.org/snapshots/org/apache/directory/api/api-dsml-engine/1.0.0-M18-SNAPSHOT/api-dsml-engine-1.0.0-M18-20130614.031440-40.pom
Downloaded: http://repository.apache.org/snapshots/org/apache/directory/api/api-dsml-engine/1.0.0-M18-SNAPSHOT/api-dsml-engine-1.0.0-M18-20130614.031440-40.pom
(3 KB at 23.9 KB/sec)
Downloading: http://repository.apache.org/snapshots/org/apache/directory/api/api-dsml-parent/1.0.0-M18-SNAPSHOT/maven-metadata.xml
Downloaded: http://repository.apache.org/snapshots/org/apache/directory/api/api-dsml-parent/1.0.0-M18-SNAPSHOT/maven-metadata.xml
(842 B at 4.0 KB/sec)
Downloading: http://repository.apache.org/snapshots/org/apache/directory/api/api-dsml-parent/1.0.0-M18-SNAPSHOT/api-dsml-parent-1.0.0-M18-20130614.031310-41.pom
Downloaded: http://repository.apache.org/snapshots/org/apache/directory/api/api-dsml-parent/1.0.0-M18-SNAPSHOT/api-dsml-parent-1.0.0-M18-20130614.031310-41.pom
(2 KB at 11.5 KB/sec)
Downloading: http://repository.apache.org/snapshots/org/apache/directory/api/api-dsml-parser/1.0.0-M18-SNAPSHOT/maven-metadata.xml
Downloaded: http://repository.apache.org/snapshots/org/apache/directory/api/api-dsml-parser/1.0.0-M18-SNAPSHOT/maven-metadata.xml
(1023 B at 7.6 KB/sec)
Downloading: http://repository.apache.org/snapshots/org/apache/directory/api/api-dsml-parser/1.0.0-M18-SNAPSHOT/api-dsml-parser-1.0.0-M18-20130614.031325-41.pom
Downloaded: http://repository.apache.org/snapshots/org/apache/directory/api/api-dsml-parser/1.0.0-M18-SNAPSHOT/api-dsml-parser-1.0.0-M18-20130614.031325-41.pom
(4 KB at 32.9 KB/sec)
Downloading: http://repository.apache.org/snapshots/org/apache/directory/api/api-dsml-engine/1.0.0-M18-SNAPSHOT/api-dsml-engine-1.0.0-M18-20130614.031440-40.jar
Downloading: http://repository.apache.org/snapshots/org/apache/directory/api/api-dsml-parser/1.0.0-M18-SNAPSHOT/api-dsml-parser-1.0.0-M18-20130614.031325-41.jar
Downloaded: http://repository.apache.org/snapshots/org/apache/directory/api/api-dsml-engine/1.0.0-M18-SNAPSHOT/api-dsml-engine-1.0.0-M18-20130614.031440-40.jar
(16 KB at 100.8 KB/sec)
Downloaded: http://repository.apache.org/snapshots/org/apache/directory/api/api-dsml-parser/1.0.0-M18-SNAPSHOT/api-dsml-parser-1.0.0-M18-20130614.031325-41.jar
(204 KB at 556.5 KB/sec)
[INFO] 
[INFO] --- maven-clean-plugin:2.4.1:clean (default-clean) @ apacheds-server-integ ---
[INFO] 
[INFO] --- maven-remote-resources-plugin:1.2.1:process (default) @ apacheds-server-integ ---
[INFO] [debug] execute contextualize
[INFO] Using 'UTF-8' encoding to copy filtered resources.

[INFO] --- maven-resources-plugin:2.5:resources (default-resources) @ apacheds-server-integ
---
[INFO] Copying 0 resource
[INFO] Copying 3 resources
[INFO] 
[INFO] --- maven-compiler-plugin:2.5.1:compile (default-compile) @ apacheds-server-integ ---
[INFO] Compiling 1 source file to <https://builds.apache.org/job/dir-apacheds-jdk16-ubuntu-deploy/ws/trunk/server-integ/target/classes>
[INFO] [INFO] Configured Artifact: org.apache.directory.api:api-ldap-extras-codec:?:jar
[INFO] Copying api-ldap-extras-codec-1.0.0-M18-SNAPSHOT.jar to <https://builds.apache.org/job/dir-apacheds-jdk16-ubuntu-deploy/ws/trunk/server-integ/target/pluginDirectory/api-ldap-extras-codec-1.0.0-M18-20130614.031503-40.jar>

[INFO] --- maven-dependency-plugin:2.5:copy (copy) @ apacheds-server-integ ---
[debug] execute contextualize
[INFO] [INFO] Using 'UTF-8' encoding to copy filtered resources.

[INFO] --- maven-resources-plugin:2.5:testResources (default-testResources) @ apacheds-server-integ
---
[INFO] Copying 7 resources
[INFO] Copying 3 resources
[INFO] 
[INFO] --- maven-compiler-plugin:2.5.1:testCompile (default-testCompile) @ apacheds-server-integ
---
[INFO] Compiling 74 source files to <https://builds.apache.org/job/dir-apacheds-jdk16-ubuntu-deploy/ws/trunk/server-integ/target/test-classes>
[INFO] Surefire report directory: <https://builds.apache.org/job/dir-apacheds-jdk16-ubuntu-deploy/ws/trunk/server-integ/target/surefire-reports>
[INFO] 
-------------------------------------------------------
 T E S T S
-------------------------------------------------------

[INFO] --- maven-surefire-plugin:2.12.2:test (default-test) @ apacheds-server-integ ---
Running org.apache.directory.server.replication.ClientInitialRefreshIT
Tests run: 4, Failures: 0, Errors: 0, Skipped: 0, Time elapsed: 60.111 sec
Running org.apache.directory.server.replication.ClientServerReplicationIT
Tests run: 5, Failures: 0, Errors: 0, Skipped: 1, Time elapsed: 179.024 sec
Running org.apache.directory.server.replication.StaleEventLogDetectionIT

NbAdded every 100ms : 
0, 11Tests run: 1, Failures: 0, Errors: 0, Skipped: 0, Time elapsed: 50.009 sec
Running org.apache.directory.server.admin.AdministrativePointModifyIT
Tests run: 1, Failures: 0, Errors: 0, Skipped: 0, Time elapsed: 52.121 sec
Running org.apache.directory.server.admin.AdministrativePointAddIT
Tests run: 2, Failures: 0, Errors: 0, Skipped: 0, Time elapsed: 66.115 sec
Running org.apache.directory.server.admin.AdministrativePointModifyDelIT
Tests run: 3, Failures: 0, Errors: 0, Skipped: 1, Time elapsed: 53.727 sec
Running org.apache.directory.server.admin.AdministrativePointPersistentIT
Tests run: 1, Failures: 0, Errors: 0, Skipped: 0, Time elapsed: 29.546 sec
Running org.apache.directory.server.operations.modify.ModifyAddIT
Tests run: 16, Failures: 0, Errors: 0, Skipped: 0, Time elapsed: 57.649 sec
Running org.apache.directory.server.operations.modify.ModifyReplaceIT
Tests run: 7, Failures: 0, Errors: 0, Skipped: 0, Time elapsed: 30.989 sec
Running org.apache.directory.server.operations.modify.ModifyRemoveIT
Tests run: 16, Failures: 0, Errors: 0, Skipped: 0, Time elapsed: 70.365 sec
Running org.apache.directory.server.operations.modify.ModifyMultipleChangesIT
Tests run: 2, Failures: 0, Errors: 0, Skipped: 0, Time elapsed: 24.923 sec
Running org.apache.directory.server.operations.modify.ModifyReferralIT
Tests run: 4, Failures: 0, Errors: 0, Skipped: 0, Time elapsed: 17.879 sec
Running org.apache.directory.server.operations.modify.IllegalModificationIT
Tests run: 2, Failures: 0, Errors: 0, Skipped: 0, Time elapsed: 20.147 sec
Running org.apache.directory.server.operations.compare.CompareIT
Tests run: 7, Failures: 0, Errors: 0, Skipped: 0, Time elapsed: 38.076 sec
Running org.apache.directory.server.operations.compare.MatchingRuleCompareIT
Tests run: 2, Failures: 0, Errors: 0, Skipped: 0, Time elapsed: 19.254 sec
Running org.apache.directory.server.operations.lookup.LookupIT
Tests run: 3, Failures: 0, Errors: 0, Skipped: 0, Time elapsed: 32.072 sec
Running org.apache.directory.server.operations.delete.DeleteIT
Tests run: 8, Failures: 0, Errors: 0, Skipped: 0, Time elapsed: 29.212 sec
Running org.apache.directory.server.operations.delete.DeleteAliasIT
Tests run: 2, Failures: 0, Errors: 0, Skipped: 0, Time elapsed: 27.319 sec
Running org.apache.directory.server.operations.add.AddingEntriesWithSpecialCharactersInRDNIT
Tests run: 9, Failures: 0, Errors: 0, Skipped: 0, Time elapsed: 79.303 sec
Running org.apache.directory.server.operations.add.AddAliasIT
Tests run: 3, Failures: 0, Errors: 0, Skipped: 0, Time elapsed: 57.858 sec
Running org.apache.directory.server.operations.add.AddIT
Tests run: 31, Failures: 0, Errors: 0, Skipped: 0, Time elapsed: 198.83 sec
Running org.apache.directory.server.operations.ldapsdk.BindIT
Tests run: 5, Failures: 0, Errors: 0, Skipped: 0, Time elapsed: 44.818 sec
Running org.apache.directory.server.operations.ldapsdk.CompareIT
Tests run: 7, Failures: 0, Errors: 0, Skipped: 0, Time elapsed: 17.89 sec
Running org.apache.directory.server.operations.ldapsdk.ModifyDnReferralIT
Tests run: 7, Failures: 0, Errors: 0, Skipped: 0, Time elapsed: 14.97 sec
Running org.apache.directory.server.operations.ldapsdk.DeleteIT
Tests run: 8, Failures: 0, Errors: 0, Skipped: 0, Time elapsed: 16.312 sec
Running org.apache.directory.server.operations.ldapsdk.ModifyReferralIT
Tests run: 4, Failures: 0, Errors: 0, Skipped: 0, Time elapsed: 10.919 sec
Running org.apache.directory.server.operations.ldapsdk.IllegalModificationIT
Tests run: 2, Failures: 0, Errors: 0, Skipped: 0, Time elapsed: 6.481 sec
Running org.apache.directory.server.operations.ldapsdk.AddIT
Tests run: 30, Failures: 0, Errors: 0, Skipped: 0, Time elapsed: 80.466 sec
Running org.apache.directory.server.operations.bind.BindIT
Tests run: 5, Failures: 0, Errors: 0, Skipped: 0, Time elapsed: 13.77 sec
Running org.apache.directory.server.operations.bind.DelegatedAuthOverSslIT
Tests run: 1, Failures: 0, Errors: 0, Skipped: 0, Time elapsed: 14.845 sec
Running org.apache.directory.server.operations.bind.SaslBindIT
		No encryption was performed by peer.
		No encryption was performed by peer.
Tests run: 17, Failures: 0, Errors: 0, Skipped: 4, Time elapsed: 26.798 sec
Running org.apache.directory.server.operations.bind.DelegatedAuthOverTlsIT
Tests run: 1, Failures: 0, Errors: 0, Skipped: 0, Time elapsed: 13.61 sec
Running org.apache.directory.server.operations.bind.MiscBindIT
Tests run: 6, Failures: 0, Errors: 0, Skipped: 0, Time elapsed: 16.25 sec
Running org.apache.directory.server.operations.bind.SimpleBindIT
Tests run: 10, Failures: 2, Errors: 2, Skipped: 0, Time elapsed: 18.051 sec <<< FAILURE!
Running org.apache.directory.server.operations.bind.DelegatedAuthIT
Tests run: 1, Failures: 0, Errors: 1, Skipped: 0, Time elapsed: 4.75 sec <<< FAILURE!
Running org.apache.directory.server.operations.search.IndexedNegationSearchIT
Tests run: 1, Failures: 0, Errors: 1, Skipped: 0, Time elapsed: 0.006 sec <<< FAILURE!
Running org.apache.directory.server.operations.search.ReferralSearchMoveAndRenameIT
Tests run: 1, Failures: 0, Errors: 1, Skipped: 0, Time elapsed: 0.007 sec <<< FAILURE!
Running org.apache.directory.server.operations.search.ReferralSearchIT
Tests run: 1, Failures: 0, Errors: 1, Skipped: 0, Time elapsed: 0.018 sec <<< FAILURE!
Running org.apache.directory.server.operations.search.NegationSearchIT
Tests run: 1, Failures: 0, Errors: 1, Skipped: 0, Time elapsed: 0.005 sec <<< FAILURE!
Running org.apache.directory.server.operations.search.PagedSearchIT
Tests run: 1, Failures: 0, Errors: 1, Skipped: 0, Time elapsed: 0.02 sec <<< FAILURE!
Running org.apache.directory.server.operations.search.ReferralSearchNoRevertIT
Tests run: 1, Failures: 0, Errors: 1, Skipped: 0, Time elapsed: 0.006 sec <<< FAILURE!
Running org.apache.directory.server.operations.search.PersistentSearchIT
Tests run: 1, Failures: 0, Errors: 1, Skipped: 0, Time elapsed: 0.002 sec <<< FAILURE!
Running org.apache.directory.server.operations.search.SchemaSearchIT
Tests run: 1, Failures: 0, Errors: 1, Skipped: 0, Time elapsed: 0.005 sec <<< FAILURE!
Running org.apache.directory.server.operations.search.SearchIT
Tests run: 1, Failures: 0, Errors: 1, Skipped: 0, Time elapsed: 0.025 sec <<< FAILURE!
Running org.apache.directory.server.operations.search.SearchLimitsIT
Tests run: 1, Failures: 0, Errors: 1, Skipped: 0, Time elapsed: 0.048 sec <<< FAILURE!
Running org.apache.directory.server.operations.extended.StoredProcedureIT
Tests run: 1, Failures: 0, Errors: 1, Skipped: 0, Time elapsed: 0.021 sec <<< FAILURE!
Running org.apache.directory.server.operations.extended.ExtendedIT
Tests run: 1, Failures: 0, Errors: 1, Skipped: 0, Time elapsed: 0.033 sec <<< FAILURE!
Running org.apache.directory.server.operations.extended.PwdModifyIT
Tests run: 1, Failures: 0, Errors: 1, Skipped: 0, Time elapsed: 0.014 sec <<< FAILURE!
Running org.apache.directory.server.operations.modifydn.ModifyDnReferralIT
Tests run: 1, Failures: 0, Errors: 1, Skipped: 0, Time elapsed: 0.016 sec <<< FAILURE!
Running org.apache.directory.server.operations.modifydn.ModifyRdnIT
Tests run: 1, Failures: 0, Errors: 1, Skipped: 0, Time elapsed: 0.026 sec <<< FAILURE!
Running org.apache.directory.server.operations.modifydn.MoveIT
Tests run: 1, Failures: 0, Errors: 1, Skipped: 0, Time elapsed: 0.051 sec <<< FAILURE!
Running org.apache.directory.server.schema.SchemaIT
Tests run: 1, Failures: 0, Errors: 1, Skipped: 0, Time elapsed: 0.041 sec <<< FAILURE!
Running org.apache.directory.server.ssl.LdapsUpdateCertificateIT
Tests run: 1, Failures: 0, Errors: 1, Skipped: 0, Time elapsed: 0.018 sec <<< FAILURE!
Running org.apache.directory.server.ssl.StartTlsIT
Tests run: 1, Failures: 0, Errors: 1, Skipped: 0, Time elapsed: 0.026 sec <<< FAILURE!
Running org.apache.directory.server.ssl.StartTlsUpdateCertificateIT
Tests run: 1, Failures: 0, Errors: 1, Skipped: 0, Time elapsed: 0.023 sec <<< FAILURE!
Running org.apache.directory.server.ssl.StartTlsConfidentialityIT
Tests run: 1, Failures: 0, Errors: 1, Skipped: 0, Time elapsed: 0.012 sec <<< FAILURE!
Running org.apache.directory.server.ssl.LdapsIT
Tests run: 1, Failures: 0, Errors: 1, Skipped: 0, Time elapsed: 0.017 sec <<< FAILURE!
Running org.apache.directory.server.ppolicy.PasswordPolicyIT
Tests run: 1, Failures: 0, Errors: 1, Skipped: 0, Time elapsed: 0.033 sec <<< FAILURE!
Running org.apache.directory.server.kerberos.KeyDerivationServiceIT
Tests run: 1, Failures: 0, Errors: 1, Skipped: 0, Time elapsed: 0.037 sec <<< FAILURE!
Running org.apache.directory.server.kerberos.PasswordPolicyServiceIT
Tests run: 1, Failures: 0, Errors: 0, Skipped: 1, Time elapsed: 0.001 sec
Running org.apache.directory.dsml.engine.Dsmlv2EngineIT
Tests run: 1, Failures: 0, Errors: 1, Skipped: 0, Time elapsed: 0.064 sec <<< FAILURE!
Running org.apache.directory.IndexIT
Tests run: 1, Failures: 0, Errors: 1, Skipped: 0, Time elapsed: 0.028 sec <<< FAILURE!

Results :

Failed tests:   testAnonymousRootDseSearch(org.apache.directory.server.operations.bind.SimpleBindIT):
Should not have caught exception.
  testSimpleBindNoPrincipalNoPassword(org.apache.directory.server.operations.bind.SimpleBindIT):
Should not have caught exception.

Tests in error: 
  testBindSimpleAuthenticatorDisabled(org.apache.directory.server.operations.bind.SimpleBindIT):
Cannot connect on the server: Too many open files
  testBindWithDoubleQuote(org.apache.directory.server.operations.bind.SimpleBindIT): Failed
to create a new instance of org.apache.mina.transport.socket.nio.NioProcessor:null
  org.apache.directory.server.operations.bind.DelegatedAuthIT: Failed to initialize.
  org.apache.directory.server.operations.search.IndexedNegationSearchIT: java.io.FileNotFoundException:
/tmp/server-work-default9681b436-9a87-417b-a476-195fc57d355d/cache/kdcReplayCache.data (Too
many open files)
  org.apache.directory.server.operations.search.ReferralSearchMoveAndRenameIT: java.io.FileNotFoundException:
/tmp/server-work-default5e52dcd9-7fe6-436f-83b2-d86627670113/cache/groupCache.data (Too many
open files)
  org.apache.directory.server.operations.search.ReferralSearchIT: java.io.FileNotFoundException:
/tmp/server-work-default3584c8d1-1bfc-4430-895e-40311404121e/cache/ou=system.data (Too many
open files)
  org.apache.directory.server.operations.search.NegationSearchIT: java.io.FileNotFoundException:
/tmp/server-work-default490cfcec-c860-40ea-bda0-b7cbb49b8211/cache/groupCache.data (Too many
open files)
  org.apache.directory.server.operations.search.PagedSearchIT: java.io.FileNotFoundException:
/tmp/server-work-default78e0cbb4-4e75-4900-b705-d42b4b7d5b9d/cache/changePwdReplayCache.data
(Too many open files)
  org.apache.directory.server.operations.search.ReferralSearchNoRevertIT: java.io.FileNotFoundException:
/tmp/server-work-ReferralSearchNoReertDS/cache/changePwdReplayCache.data (Too many open files)
  initializationError(org.apache.directory.server.operations.search.PersistentSearchIT): Lorg/apache/directory/server/operations/search/PersistentSearchIT$PSearchListener;
  org.apache.directory.server.operations.search.SchemaSearchIT: java.io.FileNotFoundException:
/tmp/server-work-default4789396b-8ec0-472f-8955-b4110e8c38d6/cache/changePwdReplayCache.data
(Too many open files)
  org.apache.directory.server.operations.search.SearchIT: java.io.FileNotFoundException: /tmp/server-work-default7f70ecd7-d846-4063-b8ea-d18df800ff34/cache/changePwdReplayCache.data
(Too many open files)
  org.apache.directory.server.operations.search.SearchLimitsIT: java.io.FileNotFoundException:
/tmp/server-work-default0b677f86-bf1f-4ab4-a11e-dd82303f56c9/cache/ou=system.data (Too many
open files)
  org.apache.directory.server.operations.extended.StoredProcedureIT: java.io.FileNotFoundException:
/tmp/server-work-default2792d662-67a0-4553-b45c-b6aa9217dd9a/cache/changePwdReplayCache.data
(Too many open files)
  org.apache.directory.server.operations.extended.ExtendedIT: java.io.FileNotFoundException:
/tmp/server-work-defaultf62485ee-2dd4-42ad-bf58-861e47140715/cache/kdcReplayCache.data (Too
many open files)
  org.apache.directory.server.operations.extended.PwdModifyIT: java.io.FileNotFoundException:
/tmp/server-work-PasswordPolicyTest/cache/changePwdReplayCache.data (Too many open files)
  org.apache.directory.server.operations.modifydn.ModifyDnReferralIT: java.io.FileNotFoundException:
/tmp/server-work-defaultde7b0cad-5aff-4498-a0ed-0d271cb0251a/cache/kdcReplayCache.data (Too
many open files)
  org.apache.directory.server.operations.modifydn.ModifyRdnIT: java.io.FileNotFoundException:
/tmp/server-work-ModifyRdnIT-class/cache/groupCache.data (Too many open files)
  org.apache.directory.server.operations.modifydn.MoveIT: java.io.FileNotFoundException: /tmp/server-work-default7b7b065c-915e-49d8-a5c4-3ec4d6309c90/cache/groupCache.data
(Too many open files)
  org.apache.directory.server.schema.SchemaIT: java.io.FileNotFoundException: /tmp/server-work-SchemaIT-class/cache/groupCache.data
(Too many open files)
  org.apache.directory.server.ssl.LdapsUpdateCertificateIT: java.io.FileNotFoundException:
/tmp/server-work-LdapsUpdateCertificateIT-class/cache/kdcReplayCache.data (Too many open files)
  org.apache.directory.server.ssl.StartTlsIT: java.io.FileNotFoundException: /tmp/server-work-StartTlsIT-class/cache/groupCache.data
(Too many open files)
  org.apache.directory.server.ssl.StartTlsUpdateCertificateIT: java.io.FileNotFoundException:
/tmp/server-work-StartTlsUpdateCertificateIT-class/cache/changePwdReplayCache.data (Too many
open files)
  org.apache.directory.server.ssl.StartTlsConfidentialityIT: java.io.FileNotFoundException:
/tmp/server-work-StartTlsConfidentialityIT-class/cache/kdcReplayCache.data (Too many open
files)
  org.apache.directory.server.ssl.LdapsIT: java.io.FileNotFoundException: /tmp/server-work-LdapsIT-class/cache/ou=system.data
(Too many open files)
  org.apache.directory.server.ppolicy.PasswordPolicyIT: java.io.FileNotFoundException: /tmp/server-work-PasswordPolicyTest/cache/ehcache_auto_created_1371187447482/kdcReplayCache.data
(Too many open files)
  org.apache.directory.server.kerberos.KeyDerivationServiceIT: java.io.FileNotFoundException:
/tmp/server-work-KeyDerivationServiceIT-class/cache/changePwdReplayCache.data (Too many open
files)
  org.apache.directory.dsml.engine.Dsmlv2EngineIT: java.io.FileNotFoundException: /tmp/server-work-Dsmlv2EngineTest-DS/cache/ou=system.data
(Too many open files)
  org.apache.directory.IndexIT: <https://builds.apache.org/job/dir-apacheds-jdk16-ubuntu-deploy/ws/trunk/server-integ/target/schema/ou=schema/cn=apachemeta/ou=matchingrules/m-oid=1.3.6.1.4.1.18060.0.4.0.1.3.ldif>
(Too many open files)

Tests run: 260, Failures: 2, Errors: 29, Skipped: 7

[ERROR] There are test failures.

Please refer to <https://builds.apache.org/job/dir-apacheds-jdk16-ubuntu-deploy/ws/trunk/server-integ/target/surefire-reports>
for the individual test results.
Sending e-mails to: notifications@directory.apache.org
Sending e-mails to: notifications@directory.apache.org
ERROR: Maven JVM terminated unexpectedly with exit code 143


Mime
View raw message