directory-notifications mailing list archives

Site index · List index
Message view « Date » · « Thread »
Top « Date » · « Thread »
From Apache Jenkins Server <jenk...@builds.apache.org>
Subject Build failed in Jenkins: dir-studio-jdk16-ubuntu-deploy #1036
Date Thu, 27 Jun 2013 04:01:40 GMT
See <https://builds.apache.org/job/dir-studio-jdk16-ubuntu-deploy/1036/changes>

Changes:

[pamarcelot] Reverted previous commit for this class (shouldn't have been committed).

[pamarcelot] Moved the latest SNAPSHOT version of the project pom.

------------------------------------------
Started by timer
Building remotely on ubuntu1 in workspace <https://builds.apache.org/job/dir-studio-jdk16-ubuntu-deploy/ws/>
Updating https://svn.apache.org/repos/asf/directory/studio/trunk
U         plugins/aciitemeditor/src/main/java/org/apache/directory/studio/aciitemeditor/widgets/ACIItemTabFolderComposite.java
U         plugins/aciitemeditor/src/main/java/org/apache/directory/studio/aciitemeditor/widgets/ACIItemSourceEditorComposite.java
U         plugins/aciitemeditor/src/main/java/org/apache/directory/studio/aciitemeditor/widgets/ACIItemVisualEditorComposite.java
U         plugins/ldapservers.apacheds.v200/src/main/java/org/apache/directory/studio/ldapservers/apacheds/v200/ApacheDS200LdapServerAdapter.java
U         plugins/ldapservers.apacheds.v200/pom.xml
U         plugins/apacheds.configuration.v2/src/main/java/org/apache/directory/studio/apacheds/configuration/v2/editor/LdapLdapsServersPage.java
U         plugins/apacheds.configuration.v2/src/main/java/org/apache/directory/studio/apacheds/configuration/v2/editor/PasswordPolicyDetailsPage.java
U         plugins/apacheds.configuration.v2/src/main/java/org/apache/directory/studio/apacheds/configuration/v2/editor/PasswordPoliciesPage.java
U         plugins/apacheds.configuration.v2/src/main/resources/org/apache/directory/studio/apacheds/configuration/v2/config.ldif
U         plugins/valueeditors/src/main/java/org/apache/directory/studio/valueeditors/password/PasswordDialog.java
U         plugins/schemaeditor/pom.xml
U         plugins/schemaeditor/resources/schemas/apacheds/adsconfig.xml
U         plugins/ldapbrowser.common/src/main/java/org/apache/directory/studio/ldapbrowser/common/dialogs/HexDialog.java
U         plugins/ldapbrowser.common/src/main/java/org/apache/directory/studio/ldapbrowser/common/dialogs/messages_fr.properties
U         plugins/ldapbrowser.common/src/main/java/org/apache/directory/studio/ldapbrowser/common/dialogs/messages.properties
U         plugins/ldapbrowser.common/src/main/java/org/apache/directory/studio/ldapbrowser/common/dialogs/messages_de.properties
U         plugins/ldapbrowser.common/src/main/java/org/apache/directory/studio/valueeditors/AbstractDialogBinaryValueEditor.java
U         pom.xml
U         NOTICE.txt
U         application/docs/NOTICE.txt
D         helps/help-pom.xml
U         helps/apacheds.help/pom.xml
U         helps/apacheds.configuration.help/pom.xml
U         helps/ldapbrowser.help/pom.xml
U         helps/rcp.help/pom.xml
U         helps/ldifeditor.help/pom.xml
U         helps/schemaeditor.help/pom.xml
U         libraries/org.dom4j.dom4j/pom.xml
U         libraries/org.slf4j.api/pom.xml
U         libraries/org.apache.httpcomponents.httpcore/pom.xml
U         libraries/org.antlr.antlr/pom.xml
U         libraries/org.apache.commons.io/pom.xml
U         libraries/org.bouncycastle.bcprov.jdk15/pom.xml
U         libraries/org.apache.commons.pool/pom.xml
U         libraries/org.slf4j.log4j12/pom.xml
U         libraries/pom.xml
U         libraries/org.apache.commons.codec/pom.xml
U         libraries/org.apache.commons.collections/pom.xml
U         libraries/org.apache.commons.lang/pom.xml
U         libraries/net.sf.ehcache.core/pom.xml
U         libraries/org.apache.commons.logging/pom.xml
U         libraries/org.apache.httpcomponents.httpclient/pom.xml
U         libraries/org.xpp3.xpp3/pom.xml
U         libraries/org.apache.logging.log4j/pom.xml
At revision 1497206
Parsing POMs
Failed to transfer Could not find metadata org.apache.directory.project:project:31-SNAPSHOT/maven-metadata.xml
in studio.repository (file://${project.basedir})
Failed to transfer Could not find artifact org.apache.directory.project:project:pom:31-SNAPSHOT
in studio.repository (file://${project.basedir})
ERROR: Failed to parse POMs
hudson.util.IOException2: remote file operation failed: <https://builds.apache.org/job/dir-studio-jdk16-ubuntu-deploy/ws/trunk>
at hudson.remoting.Channel@6694d346:ubuntu1
	at hudson.FilePath.act(FilePath.java:861)
	at hudson.FilePath.act(FilePath.java:838)
	at hudson.maven.MavenModuleSetBuild$MavenModuleSetBuildExecution.parsePoms(MavenModuleSetBuild.java:862)
	at hudson.maven.MavenModuleSetBuild$MavenModuleSetBuildExecution.doRun(MavenModuleSetBuild.java:620)
	at hudson.model.AbstractBuild$AbstractBuildExecution.run(AbstractBuild.java:592)
	at hudson.model.Run.execute(Run.java:1568)
	at hudson.maven.MavenModuleSetBuild.run(MavenModuleSetBuild.java:477)
	at hudson.model.ResourceController.execute(ResourceController.java:88)
	at hudson.model.Executor.run(Executor.java:236)
Caused by: hudson.remoting.ProxyException: hudson.maven.MavenModuleSetBuild$MavenExecutionException:
org.apache.maven.project.ProjectBuildingException: Some problems were encountered while processing
the POMs:
[FATAL] Non-resolvable parent POM: Could not find artifact org.apache.directory.project:project:pom:31-SNAPSHOT
in studio.repository (file://${project.basedir}) and 'parent.relativePath' points at wrong
local POM @ line 23, column 11

	at hudson.maven.MavenModuleSetBuild$PomParser.invoke(MavenModuleSetBuild.java:1229)
	at hudson.maven.MavenModuleSetBuild$PomParser.invoke(MavenModuleSetBuild.java:997)
	at hudson.FilePath$FileCallableWrapper.call(FilePath.java:2348)
	at hudson.remoting.UserRequest.perform(UserRequest.java:118)
	at hudson.remoting.UserRequest.perform(UserRequest.java:48)
	at hudson.remoting.Request$2.run(Request.java:326)
	at hudson.remoting.InterceptingExecutorService$1.call(InterceptingExecutorService.java:72)
	at java.util.concurrent.FutureTask$Sync.innerRun(FutureTask.java:334)
	at java.util.concurrent.FutureTask.run(FutureTask.java:166)
	at java.util.concurrent.ThreadPoolExecutor.runWorker(ThreadPoolExecutor.java:1146)
	at java.util.concurrent.ThreadPoolExecutor$Worker.run(ThreadPoolExecutor.java:615)
	at java.lang.Thread.run(Thread.java:679)
Caused by: hudson.remoting.ProxyException: org.apache.maven.project.ProjectBuildingException:
Some problems were encountered while processing the POMs:
[FATAL] Non-resolvable parent POM: Could not find artifact org.apache.directory.project:project:pom:31-SNAPSHOT
in studio.repository (file://${project.basedir}) and 'parent.relativePath' points at wrong
local POM @ line 23, column 11

	at org.apache.maven.project.DefaultProjectBuilder.build(DefaultProjectBuilder.java:363)
	at hudson.maven.MavenEmbedder.buildProjects(MavenEmbedder.java:361)
	at hudson.maven.MavenEmbedder.readProjects(MavenEmbedder.java:331)
	at hudson.maven.MavenModuleSetBuild$PomParser.invoke(MavenModuleSetBuild.java:1179)
	... 11 more

Mime
View raw message