directory-notifications mailing list archives

Site index · List index
Message view « Date » · « Thread »
Top « Date » · « Thread »
From Apache Jenkins Server <jenk...@builds.apache.org>
Subject Build failed in Jenkins: dir-studio-jdk16-win #870
Date Fri, 21 Jun 2013 04:12:50 GMT
See <https://builds.apache.org/job/dir-studio-jdk16-win/870/changes>

Changes:

[pamarcelot] Revert the 'org.apache.xmlgraphics.fop' version for the generation of the help
documentation plugins to work.

[pamarcelot] Fixed various graphical glitches in the ACI Editor with the use of the Tab Folder.

[elecharny] Bumped up some dependencies

------------------------------------------
[...truncated 4649 lines...]
Downloading: file://F:\hudson\hudson-slave\workspace\dir-studio-jdk16-win\trunk\plugins\schemaeditor/org/apache/directory/project/project/30/project-30.pom
[INFO] Downloading: http://repo1.maven.org/maven2/org/apache/directory/project/project/30/project-30.pom
--- studio-maven-plugin:1.0.5:prepare-jar-package (default) @ common.core ---Downloading:
file://F:\hudson\hudson-slave\workspace\dir-studio-jdk16-win\trunk\plugins\schemaeditor/org/apache/directory/project/project/30/project-30.pom
Downloading: http://repo1.maven.org/maven2/org/apache/directory/project/project/30/project-30.pom
Downloading: file://F:\hudson\hudson-slave\workspace\dir-studio-jdk16-win\trunk\plugins\schemaeditor/org/apache/directory/project/project/30/project-30.pom
Downloading: http://repo1.maven.org/maven2/org/apache/directory/project/project/30/project-30.pom

Downloading: file://F:\hudson\hudson-slave\workspace\dir-studio-jdk16-win\trunk\plugins\schemaeditor/org/apache/directory/project/project/30/project-30.pom
Downloading: http://repo1.maven.org/maven2/org/apache/directory/project/project/30/project-30.pom
[WARNING] The following dependencies could not be resolved at this point of the build but
seem to be part of the reactor:
[WARNING] Try running the build up to the lifecycle phase "package"
[INFO] 
[INFO] --- maven-compiler-plugin:2.5.1:compile (default-compile) @ common.core ---
[INFO] Compiling 7 source files to F:\hudson\hudson-slave\workspace\dir-studio-jdk16-win\trunk\plugins\common.core\target\classes
[INFO] 
[INFO] --- maven-bundle-plugin:2.3.7:manifest (generate-manifest) @ common.core ---
[WARNING] Manifest org.apache.directory.studio:common.core:jar:2.0.0-SNAPSHOT : Did not find
matching referal for !
[INFO] [debug] execute contextualize
[INFO] Using 'UTF-8' encoding to copy filtered resources.

[INFO] --- maven-resources-plugin:2.5:testResources (default-testResources) @ common.core
---
[INFO] Copying 0 resource
[INFO] Copying 3 resources
[INFO] 
[INFO] --- maven-compiler-plugin:2.5.1:testCompile (default-testCompile) @ common.core ---
[INFO] Nothing to compile - all classes are up to date
[INFO] [INFO] Tests are skipped.

[INFO] --- maven-surefire-plugin:2.12.2:test (default-test) @ common.core ---
[INFO] 
[INFO] --- maven-jar-plugin:2.4:jar (default-jar) @ common.core ---
[INFO] Building jar: F:\hudson\hudson-slave\workspace\dir-studio-jdk16-win\trunk\plugins\common.core\target\common.core-2.0.0-SNAPSHOT.jar
[INFO] 
[INFO] --- maven-site-plugin:3.1:attach-descriptor (attach-descriptor) @ common.core ---
[INFO] [INFO] Checking legal files in: common.core-2.0.0-SNAPSHOT.jar

[INFO] --- tools-maven-plugin:1.4:verify-legal-files (verify-legal-files) @ common.core ---
[INFO] [INFO] Installing F:\hudson\hudson-slave\workspace\dir-studio-jdk16-win\trunk\plugins\common.core\target\common.core-2.0.0-SNAPSHOT.jar
to f:\hudson\hudson-slave\maven-repositories\0\org\apache\directory\studio\common.core\2.0.0-SNAPSHOT\common.core-2.0.0-SNAPSHOT.jar

[INFO] --- maven-install-plugin:2.3.1:install (default-install) @ common.core ---
[INFO] Installing F:\hudson\hudson-slave\workspace\dir-studio-jdk16-win\trunk\plugins\common.core\pom.xml
to f:\hudson\hudson-slave\maven-repositories\0\org\apache\directory\studio\common.core\2.0.0-SNAPSHOT\common.core-2.0.0-SNAPSHOT.pom
[INFO]                                                                         
[INFO] ------------------------------------------------------------------------
[INFO] Building Apache Directory Studio LDIF Parser 2.0.0-SNAPSHOT
[INFO] ------------------------------------------------------------------------
Downloading: file://F:\hudson\hudson-slave\workspace\dir-studio-jdk16-win\trunk\plugins\ldifparser/org/apache/directory/project/project/30/project-30.pom
Downloading: http://repo1.maven.org/maven2/org/apache/directory/project/project/30/project-30.pom
[INFO] ------------------------------------------------------------------------
[INFO] Reactor Summary:
[INFO] 
[INFO] Apache Directory Studio ........................... SUCCESS [4.118s]
[INFO] Apache Directory Studio Repository ................ SUCCESS [17.932s]
[INFO] Apache Directory Studio Libraries Plugins ......... SUCCESS [0.220s]
[INFO] SLF4J API Module (for Apache Directory Studio) .... SUCCESS [21.275s]
[INFO] Ehcache Core (for Apache Directory Studio) ........ SUCCESS [3.479s]
[INFO] AntLR Parser Generator (for Apache Directory Studio)  SUCCESS [2.363s]
[INFO] Apache Commons Codec (for Apache Directory Studio)  SUCCESS [2.071s]
[INFO] Apache Commons Collections (for Apache Directory Studio)  SUCCESS [2.350s]
[INFO] Apache Commons IO (for Apache Directory Studio) ... SUCCESS [2.511s]
[INFO] Apache Commons Lang (for Apache Directory Studio) . SUCCESS [2.212s]
[INFO] Apache Commons Logging (for Apache Directory Studio)  SUCCESS [1.887s]
[INFO] Apache Commons Pool (for Apache Directory Studio) . SUCCESS [2.382s]
[INFO] Apache HttpComponents Core (for Apache Directory Studio)  SUCCESS [2.033s]
[INFO] Apache HttpComponents Client (for Apache Directory Studio)  SUCCESS [2.176s]
[INFO] Log4j (for Apache Directory Studio) ............... SUCCESS [2.009s]
[INFO] Legion of the Bouncy Castle Java Cryptography APIs (for Apache Directory Studio)  SUCCESS
[2.453s]
[INFO] dom4j (for Apache Directory Studio) ............... SUCCESS [1.881s]
[INFO] SLF4J LOG4J-12 Binding (for Apache Directory Studio)  SUCCESS [1.834s]
[INFO] XPP3 (for Apache Directory Studio) ................ SUCCESS [2.134s]
[INFO] Apache Directory Studio Plugins ................... SUCCESS [0.115s]
[INFO] Apache Directory Studio Common UI ................. SUCCESS [3.067s]
[INFO] Apache Directory Studio Common Core ............... SUCCESS [2.774s]
[INFO] Apache Directory Studio LDIF Parser ............... FAILURE [0.033s]
[INFO] Apache Directory Studio Connection Core ........... SKIPPED
[INFO] Apache Directory Studio Connection UI ............. SKIPPED
[INFO] Apache Directory Studio LDAP Browser Core ......... SKIPPED
[INFO] Apache Directory Studio LDAP Browser Common ....... SKIPPED
[INFO] Apache Directory Studio Value Editors ............. SKIPPED
[INFO] Apache Directory Studio ACI Item Editor ........... SKIPPED
[INFO] Apache Directory Studio ApacheDS Launcher ......... SKIPPED
[INFO] Apache Directory Studio ApacheDS Configuration .... SKIPPED
[INFO] Apache Directory Studio ApacheDS 2.0 Configuration  SKIPPED
[INFO] Apache Directory Studio LDIF Editor ............... SKIPPED
[INFO] Apache Directory Studio LDAP Browser UI ........... SKIPPED
[INFO] Apache Directory Studio LDAP Servers .............. SKIPPED
[INFO] Apache Directory Studio ApacheDS 1.5.3 LDAP Server Adapter  SKIPPED
[INFO] Apache Directory Studio ApacheDS 1.5.4 LDAP Server Adapter  SKIPPED
[INFO] Apache Directory Studio ApacheDS 1.5.5 LDAP Server Adapter  SKIPPED
[INFO] Apache Directory Studio ApacheDS 1.5.6 LDAP Server Adapter  SKIPPED
[INFO] Apache Directory Studio ApacheDS 1.5.7 LDAP Server Adapter  SKIPPED
[INFO] Apache Directory Studio ApacheDS 2.0.0 LDAP Server Adapter  SKIPPED
[INFO] Apache Directory Studio RCP ....................... SKIPPED
[INFO] Apache Directory Studio Schema Editor ............. SKIPPED
[INFO] Apache Directory Studio Apache DS Help ............ SKIPPED
[INFO] Apache Directory Studio Apache DS Configuration Help  SKIPPED
[INFO] Apache Directory Studio LDAP Browser Help ......... SKIPPED
[INFO] Apache Directory Studio LDIF Editor Help .......... SKIPPED
[INFO] Apache Directory Studio RCP Help .................. SKIPPED
[INFO] Apache Directory Studio Schema Editor Help ........ SKIPPED
[INFO] Apache Directory Studio Help Plugins .............. SKIPPED
[INFO] Apache Directory Studio Feature Plugins ........... SKIPPED
[INFO] Apache Directory Studio ApacheDS Configuration Feature  SKIPPED
[INFO] Apache Directory Studio ApacheDS 2.0 Configuration Feature  SKIPPED
[INFO] Apache Directory Studio ApacheDS Feature .......... SKIPPED
[INFO] Apache Directory Studio LDAP Browser Feature ...... SKIPPED
[INFO] Apache Directory Studio LDAP Servers Feature ...... SKIPPED
[INFO] Apache Directory Studio LDIF Editor Feature ....... SKIPPED
[INFO] Apache Directory Studio RCP Feature ............... SKIPPED
[INFO] Apache Directory Studio Schema Editor Feature ..... SKIPPED
[INFO] ------------------------------------------------------------------------
[INFO] BUILD FAILURE
[INFO] ------------------------------------------------------------------------
[INFO] Total time: 1:26.624s
[INFO] Finished at: Fri Jun 21 05:10:45 BST 2013
[INFO] Final Memory: 57M/236M
[INFO] ------------------------------------------------------------------------
[JENKINS] Archiving disabled
[JENKINS] Archiving disabled
[JENKINS] Archiving disabled
[JENKINS] Archiving disabled
[JENKINS] Archiving disabled
[JENKINS] Archiving disabled
[JENKINS] Archiving disabled
[JENKINS] Archiving disabled
[JENKINS] Archiving disabled
[JENKINS] Archiving disabled
[JENKINS] Archiving disabled
[JENKINS] Archiving disabled
[JENKINS] Archiving disabled
[JENKINS] Archiving disabled
[JENKINS] Archiving disabled
[JENKINS] Archiving disabled
[JENKINS] Archiving disabled
[JENKINS] Archiving disabled
[JENKINS] Archiving disabled
[JENKINS] Archiving disabled
[JENKINS] Archiving disabled
[JENKINS] Archiving disabled
[JENKINS] Archiving disabled
[JENKINS] Archiving disabled
[JENKINS] Archiving disabled
[JENKINS] Archiving disabled
[JENKINS] Archiving disabled
[JENKINS] Archiving disabled
[JENKINS] Archiving disabled
[JENKINS] Archiving disabled
[JENKINS] Archiving disabled
[JENKINS] Archiving disabled
[JENKINS] Archiving disabled
[JENKINS] Archiving disabled
[JENKINS] Archiving disabled
[JENKINS] Archiving disabled
[JENKINS] Archiving disabled
[JENKINS] Archiving disabled
[JENKINS] Archiving disabled
[JENKINS] Archiving disabled
[JENKINS] Archiving disabled
[JENKINS] Archiving disabled
[JENKINS] Archiving disabled
[JENKINS] Archiving disabled
[JENKINS] Archiving disabled
[JENKINS] Archiving disabled
[JENKINS] Archiving disabled
[JENKINS] Archiving disabled
[JENKINS] Archiving disabled
[JENKINS] Archiving disabled
[JENKINS] Archiving disabled
[JENKINS] Archiving disabled
[JENKINS] Archiving disabled
[JENKINS] Archiving disabled
[JENKINS] Archiving disabled
[JENKINS] Archiving disabled
[JENKINS] Archiving disabled
[JENKINS] Archiving disabled
[JENKINS] Archiving disabled
Waiting for Jenkins to finish collecting data
mavenExecutionResult exceptions not empty
message : Failed to execute goal on project ldifparser: Could not resolve dependencies for
project org.apache.directory.studio:ldifparser:jar:2.0.0-SNAPSHOT: Failed to collect dependencies
for [org.apache.directory.studio:org.apache.commons.codec:jar:1.8 (provided), org.apache.directory.api:api-ldap-model:jar:1.0.0-M18-SNAPSHOT
(provided), junit:junit:jar:4.11 (test), org.slf4j:slf4j-log4j12:jar:1.7.5 (test), findbugs:annotations:jar:1.0.0
(provided)]
cause : Could not resolve dependencies for project org.apache.directory.studio:ldifparser:jar:2.0.0-SNAPSHOT:
Failed to collect dependencies for [org.apache.directory.studio:org.apache.commons.codec:jar:1.8
(provided), org.apache.directory.api:api-ldap-model:jar:1.0.0-M18-SNAPSHOT (provided), junit:junit:jar:4.11
(test), org.slf4j:slf4j-log4j12:jar:1.7.5 (test), findbugs:annotations:jar:1.0.0 (provided)]
Stack trace : 
org.apache.maven.lifecycle.LifecycleExecutionException: Failed to execute goal on project
ldifparser: Could not resolve dependencies for project org.apache.directory.studio:ldifparser:jar:2.0.0-SNAPSHOT:
Failed to collect dependencies for [org.apache.directory.studio:org.apache.commons.codec:jar:1.8
(provided), org.apache.directory.api:api-ldap-model:jar:1.0.0-M18-SNAPSHOT (provided), junit:junit:jar:4.11
(test), org.slf4j:slf4j-log4j12:jar:1.7.5 (test), findbugs:annotations:jar:1.0.0 (provided)]
	at org.apache.maven.lifecycle.internal.LifecycleDependencyResolver.getDependencies(LifecycleDependencyResolver.java:190)
	at org.apache.maven.lifecycle.internal.LifecycleDependencyResolver.resolveProjectDependencies(LifecycleDependencyResolver.java:104)
	at org.apache.maven.lifecycle.internal.MojoExecutor.ensureDependenciesAreResolved(MojoExecutor.java:258)
	at org.apache.maven.lifecycle.internal.MojoExecutor.execute(MojoExecutor.java:201)
	at org.apache.maven.lifecycle.internal.MojoExecutor.execute(MojoExecutor.java:153)
	at org.apache.maven.lifecycle.internal.MojoExecutor.execute(MojoExecutor.java:145)
	at org.apache.maven.lifecycle.internal.LifecycleModuleBuilder.buildProject(LifecycleModuleBuilder.java:84)
	at org.apache.maven.lifecycle.internal.LifecycleModuleBuilder.buildProject(LifecycleModuleBuilder.java:59)
	at org.apache.maven.lifecycle.internal.LifecycleStarter.singleThreadedBuild(LifecycleStarter.java:183)
	at org.apache.maven.lifecycle.internal.LifecycleStarter.execute(LifecycleStarter.java:161)
	at org.apache.maven.DefaultMaven.doExecute(DefaultMaven.java:319)
	at org.apache.maven.DefaultMaven.execute(DefaultMaven.java:156)
	at org.jvnet.hudson.maven3.launcher.Maven3Launcher.main(Maven3Launcher.java:79)
	at sun.reflect.NativeMethodAccessorImpl.invoke0(Native Method)
	at sun.reflect.NativeMethodAccessorImpl.invoke(NativeMethodAccessorImpl.java:39)
	at sun.reflect.DelegatingMethodAccessorImpl.invoke(DelegatingMethodAccessorImpl.java:25)
	at java.lang.reflect.Method.invoke(Method.java:597)
	at org.codehaus.plexus.classworlds.launcher.Launcher.launchStandard(Launcher.java:329)
	at org.codehaus.plexus.classworlds.launcher.Launcher.launch(Launcher.java:239)
	at org.jvnet.hudson.maven3.agent.Maven3Main.launch(Maven3Main.java:158)
	at hudson.maven.Maven3Builder.call(Maven3Builder.java:100)
	at hudson.maven.Maven3Builder.call(Maven3Builder.java:66)
	at hudson.remoting.UserRequest.perform(UserRequest.java:118)
	at hudson.remoting.UserRequest.perform(UserRequest.java:48)
	at hudson.remoting.Request$2.run(Request.java:326)
	at hudson.remoting.InterceptingExecutorService$1.call(InterceptingExecutorService.java:72)
	at java.util.concurrent.FutureTask$Sync.innerRun(FutureTask.java:303)
	at java.util.concurrent.FutureTask.run(FutureTask.java:138)
	at java.util.concurrent.ThreadPoolExecutor$Worker.runTask(ThreadPoolExecutor.java:886)
	at java.util.concurrent.ThreadPoolExecutor$Worker.run(ThreadPoolExecutor.java:908)
	at java.lang.Thread.run(Thread.java:662)
Caused by: org.apache.maven.project.DependencyResolutionException: Could not resolve dependencies
for project org.apache.directory.studio:ldifparser:jar:2.0.0-SNAPSHOT: Failed to collect dependencies
for [org.apache.directory.studio:org.apache.commons.codec:jar:1.8 (provided), org.apache.directory.api:api-ldap-model:jar:1.0.0-M18-SNAPSHOT
(provided), junit:junit:jar:4.11 (test), org.slf4j:slf4j-log4j12:jar:1.7.5 (test), findbugs:annotations:jar:1.0.0
(provided)]
	at org.apache.maven.project.DefaultProjectDependenciesResolver.resolve(DefaultProjectDependenciesResolver.java:127)
	at org.apache.maven.lifecycle.internal.LifecycleDependencyResolver.getDependencies(LifecycleDependencyResolver.java:165)
	... 30 more
Caused by: org.sonatype.aether.collection.DependencyCollectionException: Failed to collect
dependencies for [org.apache.directory.studio:org.apache.commons.codec:jar:1.8 (provided),
org.apache.directory.api:api-ldap-model:jar:1.0.0-M18-SNAPSHOT (provided), junit:junit:jar:4.11
(test), org.slf4j:slf4j-log4j12:jar:1.7.5 (test), findbugs:annotations:jar:1.0.0 (provided)]
	at org.sonatype.aether.impl.internal.DefaultDependencyCollector.collectDependencies(DefaultDependencyCollector.java:251)
	at org.sonatype.aether.impl.internal.DefaultRepositorySystem.collectDependencies(DefaultRepositorySystem.java:318)
	at org.apache.maven.project.DefaultProjectDependenciesResolver.resolve(DefaultProjectDependenciesResolver.java:119)
	... 31 more
Caused by: org.sonatype.aether.resolution.ArtifactDescriptorException: Failed to read artifact
descriptor for org.apache.directory.api:api-ldap-model:jar:1.0.0-M18-SNAPSHOT
	at org.apache.maven.repository.internal.DefaultArtifactDescriptorReader.loadPom(DefaultArtifactDescriptorReader.java:317)
	at org.apache.maven.repository.internal.DefaultArtifactDescriptorReader.readArtifactDescriptor(DefaultArtifactDescriptorReader.java:173)
	at org.sonatype.aether.impl.internal.DefaultDependencyCollector.process(DefaultDependencyCollector.java:419)
	at org.sonatype.aether.impl.internal.DefaultDependencyCollector.collectDependencies(DefaultDependencyCollector.java:233)
	... 33 more
Caused by: org.apache.maven.model.resolution.UnresolvableModelException: Could not find artifact
org.apache.directory.project:project:pom:30 in studio.repository (file://F:\hudson\hudson-slave\workspace\dir-studio-jdk16-win\trunk\plugins\ldifparser)
	at org.apache.maven.repository.internal.DefaultModelResolver.resolveModel(DefaultModelResolver.java:119)
	at org.apache.maven.model.building.DefaultModelBuilder.readParentExternally(DefaultModelBuilder.java:819)
	at org.apache.maven.model.building.DefaultModelBuilder.readParent(DefaultModelBuilder.java:670)
	at org.apache.maven.model.building.DefaultModelBuilder.build(DefaultModelBuilder.java:308)
	at org.apache.maven.model.building.DefaultModelBuilder.build(DefaultModelBuilder.java:232)
	at org.apache.maven.repository.internal.DefaultArtifactDescriptorReader.loadPom(DefaultArtifactDescriptorReader.java:308)
	... 36 more
Caused by: org.sonatype.aether.resolution.ArtifactResolutionException: Could not find artifact
org.apache.directory.project:project:pom:30 in studio.repository (file://F:\hudson\hudson-slave\workspace\dir-studio-jdk16-win\trunk\plugins\ldifparser)
	at org.sonatype.aether.impl.internal.DefaultArtifactResolver.resolveArtifacts(DefaultArtifactResolver.java:526)
	at org.sonatype.aether.impl.internal.DefaultArtifactResolver.resolveArtifact(DefaultArtifactResolver.java:214)
	at org.apache.maven.repository.internal.DefaultModelResolver.resolveModel(DefaultModelResolver.java:115)
	... 41 more
Caused by: org.sonatype.aether.transfer.ArtifactNotFoundException: Could not find artifact
org.apache.directory.project:project:pom:30 in studio.repository (file://F:\hudson\hudson-slave\workspace\dir-studio-jdk16-win\trunk\plugins\ldifparser)
	at org.sonatype.aether.connector.wagon.WagonRepositoryConnector$4.wrap(WagonRepositoryConnector.java:945)
	at org.sonatype.aether.connector.wagon.WagonRepositoryConnector$4.wrap(WagonRepositoryConnector.java:940)
	at org.sonatype.aether.connector.wagon.WagonRepositoryConnector$GetTask.flush(WagonRepositoryConnector.java:696)
	at org.sonatype.aether.connector.wagon.WagonRepositoryConnector$GetTask.flush(WagonRepositoryConnector.java:690)
	at org.sonatype.aether.connector.wagon.WagonRepositoryConnector.get(WagonRepositoryConnector.java:435)
	at org.sonatype.aether.impl.internal.DefaultArtifactResolver.resolveArtifacts(DefaultArtifactResolver.java:438)
	... 43 more
channel stopped

Mime
View raw message