directory-notifications mailing list archives

Site index · List index
Message view « Date » · « Thread »
Top « Date » · « Thread »
From Apache Jenkins Server <jenk...@builds.apache.org>
Subject Build failed in Jenkins: dir-apacheds-jdk16-ubuntu-deploy #1037
Date Sun, 30 Jun 2013 05:16:14 GMT
See <https://builds.apache.org/job/dir-apacheds-jdk16-ubuntu-deploy/1037/>

------------------------------------------
[...truncated 4197 lines...]
[INFO]                                                                         
[INFO] ------------------------------------------------------------------------
[INFO] Building ApacheDS Server Integration 2.0.0-M15-SNAPSHOT
[INFO] ------------------------------------------------------------------------
Downloading: http://repository.apache.org/snapshots/org/apache/directory/api/api-dsml-engine/1.0.0-M20-SNAPSHOT/maven-metadata.xml
Downloaded: http://repository.apache.org/snapshots/org/apache/directory/api/api-dsml-engine/1.0.0-M20-SNAPSHOT/maven-metadata.xml
(1019 B at 0.4 KB/sec)
Downloading: http://repository.apache.org/snapshots/org/apache/directory/api/api-dsml-engine/1.0.0-M20-SNAPSHOT/api-dsml-engine-1.0.0-M20-20130630.030614-3.pom
Downloaded: http://repository.apache.org/snapshots/org/apache/directory/api/api-dsml-engine/1.0.0-M20-SNAPSHOT/api-dsml-engine-1.0.0-M20-20130630.030614-3.pom
(3 KB at 22.2 KB/sec)
Downloading: http://repository.apache.org/snapshots/org/apache/directory/api/api-dsml-parent/1.0.0-M20-SNAPSHOT/maven-metadata.xml
Downloaded: http://repository.apache.org/snapshots/org/apache/directory/api/api-dsml-parent/1.0.0-M20-SNAPSHOT/maven-metadata.xml
(839 B at 2.9 KB/sec)
Downloading: http://repository.apache.org/snapshots/org/apache/directory/api/api-dsml-parent/1.0.0-M20-SNAPSHOT/api-dsml-parent-1.0.0-M20-20130630.030523-3.pom
Downloaded: http://repository.apache.org/snapshots/org/apache/directory/api/api-dsml-parent/1.0.0-M20-SNAPSHOT/api-dsml-parent-1.0.0-M20-20130630.030523-3.pom
(2 KB at 15.0 KB/sec)
Downloading: http://repository.apache.org/snapshots/org/apache/directory/api/api-dsml-parser/1.0.0-M20-SNAPSHOT/maven-metadata.xml
Downloaded: http://repository.apache.org/snapshots/org/apache/directory/api/api-dsml-parser/1.0.0-M20-SNAPSHOT/maven-metadata.xml
(1019 B at 2.7 KB/sec)
Downloading: http://repository.apache.org/snapshots/org/apache/directory/api/api-dsml-parser/1.0.0-M20-SNAPSHOT/api-dsml-parser-1.0.0-M20-20130630.030531-3.pom
Downloaded: http://repository.apache.org/snapshots/org/apache/directory/api/api-dsml-parser/1.0.0-M20-SNAPSHOT/api-dsml-parser-1.0.0-M20-20130630.030531-3.pom
(4 KB at 35.9 KB/sec)
Downloading: http://repository.apache.org/snapshots/org/apache/directory/api/api-dsml-engine/1.0.0-M20-SNAPSHOT/api-dsml-engine-1.0.0-M20-20130630.030614-3.jar
Downloading: http://repository.apache.org/snapshots/org/apache/directory/api/api-dsml-parser/1.0.0-M20-SNAPSHOT/api-dsml-parser-1.0.0-M20-20130630.030531-3.jar
Downloaded: http://repository.apache.org/snapshots/org/apache/directory/api/api-dsml-engine/1.0.0-M20-SNAPSHOT/api-dsml-engine-1.0.0-M20-20130630.030614-3.jar
(16 KB at 65.2 KB/sec)
Downloaded: http://repository.apache.org/snapshots/org/apache/directory/api/api-dsml-parser/1.0.0-M20-SNAPSHOT/api-dsml-parser-1.0.0-M20-20130630.030531-3.jar
(210 KB at 464.9 KB/sec)
[INFO] [INFO] Deleting <https://builds.apache.org/job/dir-apacheds-jdk16-ubuntu-deploy/ws/trunk/server-integ/target>

[INFO] --- maven-clean-plugin:2.4.1:clean (default-clean) @ apacheds-server-integ ---
[INFO] 
[INFO] --- maven-remote-resources-plugin:1.2.1:process (default) @ apacheds-server-integ ---
[INFO] Using 'UTF-8' encoding to copy filtered resources.
[INFO] [INFO] Copying 0 resource
[INFO] Copying 3 resources

[INFO] --- maven-resources-plugin:2.6:resources (default-resources) @ apacheds-server-integ
---
[INFO] [INFO] Changes detected - recompiling the module!
[INFO] Compiling 1 source file to <https://builds.apache.org/job/dir-apacheds-jdk16-ubuntu-deploy/ws/trunk/server-integ/target/classes>

[INFO] --- maven-compiler-plugin:3.1:compile (default-compile) @ apacheds-server-integ ---
[INFO] Configured Artifact: org.apache.directory.api:api-ldap-extras-codec:?:jar
[INFO] [INFO] Copying api-ldap-extras-codec-1.0.0-M20-SNAPSHOT.jar to <https://builds.apache.org/job/dir-apacheds-jdk16-ubuntu-deploy/ws/trunk/server-integ/target/pluginDirectory/api-ldap-extras-codec-1.0.0-M20-20130630.030627-3.jar>

[INFO] --- maven-dependency-plugin:2.8:copy (copy) @ apacheds-server-integ ---
[INFO] Using 'UTF-8' encoding to copy filtered resources.
[INFO] [INFO] Copying 7 resources
[INFO] Copying 3 resources

[INFO] --- maven-resources-plugin:2.6:testResources (default-testResources) @ apacheds-server-integ
---
[INFO] 
[INFO] --- maven-compiler-plugin:3.1:testCompile (default-testCompile) @ apacheds-server-integ
---
[INFO] Changes detected - recompiling the module!
[INFO] Compiling 74 source files to <https://builds.apache.org/job/dir-apacheds-jdk16-ubuntu-deploy/ws/trunk/server-integ/target/test-classes>
[WARNING] Note: <https://builds.apache.org/job/dir-apacheds-jdk16-ubuntu-deploy/ws/trunk/server-integ/src/test/java/org/apache/directory/server/operations/bind/SaslBindIT.java>
uses unchecked or unsafe operations.
[WARNING] Note: Recompile with -Xlint:unchecked for details.
[INFO] Surefire report directory: <https://builds.apache.org/job/dir-apacheds-jdk16-ubuntu-deploy/ws/trunk/server-integ/target/surefire-reports>
[INFO] 
-------------------------------------------------------
 T E S T S
-------------------------------------------------------

[INFO] --- maven-surefire-plugin:2.15:test (default-test) @ apacheds-server-integ ---
Running org.apache.directory.server.replication.ClientInitialRefreshIT
Tests run: 4, Failures: 0, Errors: 0, Skipped: 0, Time elapsed: 49.837 sec - in org.apache.directory.server.replication.ClientInitialRefreshIT
Running org.apache.directory.server.replication.ClientServerReplicationIT
-----------> Dumping the server <-----------
-----------> Looking for 2.5.4.3=user5,0.9.2342.19200300.100.1.25=example,0.9.2342.19200300.100.1.25=com
<-----------
Entry 2.5.4.3=user1renamedmovedandrenamed,0.9.2342.19200300.100.1.25=example,0.9.2342.19200300.100.1.25=com
exists, entrtyUuid = entryUUID: 336b6b5c-4c01-4012-b718-ac9d00db51ce

The searched entry exists !!!
found Entry 2.5.4.3=user5,0.9.2342.19200300.100.1.25=example,0.9.2342.19200300.100.1.25=com
exists, entrtyUuid = entryUUID: 135ff35c-665b-4c13-a583-8c78a7529d1d

Entry 0.9.2342.19200300.100.1.25=example,0.9.2342.19200300.100.1.25=com exists, entrtyUuid
= entryUUID: ebb4521b-d87d-4cc2-bf3b-fa27d9cfb37b

-----------> Dump done <-----------
-----------> Dumping the server <-----------
-----------> Looking for 2.5.4.3=user7,0.9.2342.19200300.100.1.25=example,0.9.2342.19200300.100.1.25=com
<-----------
Entry 2.5.4.3=user1renamedmovedandrenamed,0.9.2342.19200300.100.1.25=example,0.9.2342.19200300.100.1.25=com
exists, entrtyUuid = entryUUID: 336b6b5c-4c01-4012-b718-ac9d00db51ce

Entry 2.5.4.3=user5,0.9.2342.19200300.100.1.25=example,0.9.2342.19200300.100.1.25=com exists,
entrtyUuid = entryUUID: 135ff35c-665b-4c13-a583-8c78a7529d1d

Entry 0.9.2342.19200300.100.1.25=example,0.9.2342.19200300.100.1.25=com exists, entrtyUuid
= entryUUID: ebb4521b-d87d-4cc2-bf3b-fa27d9cfb37b

-----------> Dump done <-----------
-----------> Dumping the server <-----------
-----------> Looking for 2.5.4.3=user8,0.9.2342.19200300.100.1.25=example,0.9.2342.19200300.100.1.25=com
<-----------
Entry 2.5.4.3=user1renamedmovedandrenamed,0.9.2342.19200300.100.1.25=example,0.9.2342.19200300.100.1.25=com
exists, entrtyUuid = entryUUID: 336b6b5c-4c01-4012-b718-ac9d00db51ce

Entry 2.5.4.3=user5,0.9.2342.19200300.100.1.25=example,0.9.2342.19200300.100.1.25=com exists,
entrtyUuid = entryUUID: 135ff35c-665b-4c13-a583-8c78a7529d1d

Entry 0.9.2342.19200300.100.1.25=example,0.9.2342.19200300.100.1.25=com exists, entrtyUuid
= entryUUID: ebb4521b-d87d-4cc2-bf3b-fa27d9cfb37b

-----------> Dump done <-----------
Tests run: 5, Failures: 3, Errors: 0, Skipped: 1, Time elapsed: 152.535 sec <<< FAILURE!
- in org.apache.directory.server.replication.ClientServerReplicationIT
testRebootConsumer(org.apache.directory.server.replication.ClientServerReplicationIT)  Time
elapsed: 92.012 sec  <<< FAILURE!
java.lang.AssertionError: null
	at org.junit.Assert.fail(Assert.java:86)
	at org.junit.Assert.assertTrue(Assert.java:41)
	at org.junit.Assert.assertTrue(Assert.java:52)
	at org.apache.directory.server.replication.ClientServerReplicationIT.restartConsumer(ClientServerReplicationIT.java:464)
	at org.apache.directory.server.replication.ClientServerReplicationIT.testRebootConsumer(ClientServerReplicationIT.java:491)

testDelete(org.apache.directory.server.replication.ClientServerReplicationIT)  Time elapsed:
11.001 sec  <<< FAILURE!
java.lang.AssertionError: null
	at org.junit.Assert.fail(Assert.java:86)
	at org.junit.Assert.assertTrue(Assert.java:41)
	at org.junit.Assert.assertTrue(Assert.java:52)
	at org.apache.directory.server.replication.ClientServerReplicationIT.testDelete(ClientServerReplicationIT.java:425)

testModify(org.apache.directory.server.replication.ClientServerReplicationIT)  Time elapsed:
11.001 sec  <<< FAILURE!
java.lang.AssertionError: null
	at org.junit.Assert.fail(Assert.java:86)
	at org.junit.Assert.assertTrue(Assert.java:41)
	at org.junit.Assert.assertTrue(Assert.java:52)
	at org.apache.directory.server.replication.ClientServerReplicationIT.testModify(ClientServerReplicationIT.java:270)

Running org.apache.directory.server.replication.StaleEventLogDetectionIT

NbAdded every 100ms : 
0, 11Tests run: 1, Failures: 0, Errors: 0, Skipped: 0, Time elapsed: 35.033 sec - in org.apache.directory.server.replication.StaleEventLogDetectionIT
Running org.apache.directory.server.admin.AdministrativePointModifyIT
Tests run: 1, Failures: 0, Errors: 0, Skipped: 0, Time elapsed: 19.809 sec - in org.apache.directory.server.admin.AdministrativePointModifyIT
Running org.apache.directory.server.admin.AdministrativePointAddIT
Tests run: 2, Failures: 0, Errors: 0, Skipped: 0, Time elapsed: 27.303 sec - in org.apache.directory.server.admin.AdministrativePointAddIT
Running org.apache.directory.server.admin.AdministrativePointModifyDelIT
Tests run: 3, Failures: 0, Errors: 0, Skipped: 1, Time elapsed: 22.653 sec - in org.apache.directory.server.admin.AdministrativePointModifyDelIT
Running org.apache.directory.server.admin.AdministrativePointPersistentIT
Tests run: 1, Failures: 0, Errors: 0, Skipped: 0, Time elapsed: 14.11 sec - in org.apache.directory.server.admin.AdministrativePointPersistentIT
Running org.apache.directory.server.operations.modify.ModifyAddIT
Tests run: 18, Failures: 0, Errors: 0, Skipped: 0, Time elapsed: 35.424 sec - in org.apache.directory.server.operations.modify.ModifyAddIT
Running org.apache.directory.server.operations.modify.ModifyReplaceIT
Tests run: 7, Failures: 0, Errors: 0, Skipped: 0, Time elapsed: 17.415 sec - in org.apache.directory.server.operations.modify.ModifyReplaceIT
Running org.apache.directory.server.operations.modify.ModifyRemoveIT
Tests run: 16, Failures: 0, Errors: 0, Skipped: 0, Time elapsed: 50.954 sec - in org.apache.directory.server.operations.modify.ModifyRemoveIT
Running org.apache.directory.server.operations.modify.ModifyMultipleChangesIT
Tests run: 2, Failures: 0, Errors: 0, Skipped: 0, Time elapsed: 9.575 sec - in org.apache.directory.server.operations.modify.ModifyMultipleChangesIT
Running org.apache.directory.server.operations.modify.ModifyReferralIT
Tests run: 4, Failures: 0, Errors: 0, Skipped: 0, Time elapsed: 10.998 sec - in org.apache.directory.server.operations.modify.ModifyReferralIT
Running org.apache.directory.server.operations.modify.IllegalModificationIT
Tests run: 2, Failures: 0, Errors: 0, Skipped: 0, Time elapsed: 9.396 sec - in org.apache.directory.server.operations.modify.IllegalModificationIT
Running org.apache.directory.server.operations.compare.CompareIT
Tests run: 7, Failures: 0, Errors: 0, Skipped: 0, Time elapsed: 21.432 sec - in org.apache.directory.server.operations.compare.CompareIT
Running org.apache.directory.server.operations.compare.MatchingRuleCompareIT
Tests run: 2, Failures: 0, Errors: 0, Skipped: 0, Time elapsed: 18.373 sec - in org.apache.directory.server.operations.compare.MatchingRuleCompareIT
Running org.apache.directory.server.operations.lookup.LookupIT
Tests run: 3, Failures: 0, Errors: 0, Skipped: 0, Time elapsed: 9.179 sec - in org.apache.directory.server.operations.lookup.LookupIT
Running org.apache.directory.server.operations.delete.DeleteIT
Tests run: 8, Failures: 0, Errors: 0, Skipped: 0, Time elapsed: 25.268 sec - in org.apache.directory.server.operations.delete.DeleteIT
Running org.apache.directory.server.operations.delete.DeleteAliasIT
Tests run: 2, Failures: 0, Errors: 0, Skipped: 0, Time elapsed: 9.942 sec - in org.apache.directory.server.operations.delete.DeleteAliasIT
Running org.apache.directory.server.operations.add.AddingEntriesWithSpecialCharactersInRDNIT
Tests run: 9, Failures: 0, Errors: 0, Skipped: 0, Time elapsed: 23.857 sec - in org.apache.directory.server.operations.add.AddingEntriesWithSpecialCharactersInRDNIT
Running org.apache.directory.server.operations.add.AddAliasIT
Tests run: 3, Failures: 0, Errors: 0, Skipped: 0, Time elapsed: 15.792 sec - in org.apache.directory.server.operations.add.AddAliasIT
Running org.apache.directory.server.operations.add.AddIT
Tests run: 33, Failures: 0, Errors: 0, Skipped: 0, Time elapsed: 63.302 sec - in org.apache.directory.server.operations.add.AddIT
Running org.apache.directory.server.operations.ldapsdk.BindIT
Tests run: 5, Failures: 0, Errors: 0, Skipped: 0, Time elapsed: 15.26 sec - in org.apache.directory.server.operations.ldapsdk.BindIT
Running org.apache.directory.server.operations.ldapsdk.CompareIT
Tests run: 7, Failures: 0, Errors: 0, Skipped: 0, Time elapsed: 15.61 sec - in org.apache.directory.server.operations.ldapsdk.CompareIT
Running org.apache.directory.server.operations.ldapsdk.ModifyDnReferralIT
Tests run: 7, Failures: 0, Errors: 0, Skipped: 0, Time elapsed: 14.298 sec - in org.apache.directory.server.operations.ldapsdk.ModifyDnReferralIT
Running org.apache.directory.server.operations.ldapsdk.DeleteIT
Tests run: 8, Failures: 0, Errors: 0, Skipped: 0, Time elapsed: 16.8 sec - in org.apache.directory.server.operations.ldapsdk.DeleteIT
Running org.apache.directory.server.operations.ldapsdk.ModifyReferralIT
Tests run: 4, Failures: 0, Errors: 0, Skipped: 0, Time elapsed: 15.848 sec - in org.apache.directory.server.operations.ldapsdk.ModifyReferralIT
Running org.apache.directory.server.operations.ldapsdk.IllegalModificationIT
Tests run: 2, Failures: 0, Errors: 0, Skipped: 0, Time elapsed: 10.547 sec - in org.apache.directory.server.operations.ldapsdk.IllegalModificationIT
Running org.apache.directory.server.operations.ldapsdk.AddIT
Tests run: 30, Failures: 0, Errors: 0, Skipped: 0, Time elapsed: 103.103 sec - in org.apache.directory.server.operations.ldapsdk.AddIT
Running org.apache.directory.server.operations.bind.BindIT
Tests run: 5, Failures: 0, Errors: 0, Skipped: 0, Time elapsed: 13.667 sec - in org.apache.directory.server.operations.bind.BindIT
Running org.apache.directory.server.operations.bind.DelegatedAuthOverSslIT
Tests run: 1, Failures: 0, Errors: 0, Skipped: 0, Time elapsed: 17.598 sec - in org.apache.directory.server.operations.bind.DelegatedAuthOverSslIT
Running org.apache.directory.server.operations.bind.SaslBindIT
		No encryption was performed by peer.
		No encryption was performed by peer.
Tests run: 17, Failures: 0, Errors: 0, Skipped: 4, Time elapsed: 29.964 sec - in org.apache.directory.server.operations.bind.SaslBindIT
Running org.apache.directory.server.operations.bind.DelegatedAuthOverTlsIT
Tests run: 1, Failures: 0, Errors: 0, Skipped: 0, Time elapsed: 17.943 sec - in org.apache.directory.server.operations.bind.DelegatedAuthOverTlsIT
Running org.apache.directory.server.operations.bind.MiscBindIT
Tests run: 6, Failures: 0, Errors: 0, Skipped: 0, Time elapsed: 19.289 sec - in org.apache.directory.server.operations.bind.MiscBindIT
Running org.apache.directory.server.operations.bind.SimpleBindIT
Tests run: 10, Failures: 0, Errors: 0, Skipped: 0, Time elapsed: 18.313 sec - in org.apache.directory.server.operations.bind.SimpleBindIT
Running org.apache.directory.server.operations.bind.DelegatedAuthIT
Tests run: 2, Failures: 0, Errors: 0, Skipped: 0, Time elapsed: 24.825 sec - in org.apache.directory.server.operations.bind.DelegatedAuthIT
Running org.apache.directory.server.operations.search.IndexedNegationSearchIT
Tests run: 3, Failures: 0, Errors: 0, Skipped: 0, Time elapsed: 17.523 sec - in org.apache.directory.server.operations.search.IndexedNegationSearchIT
Running org.apache.directory.server.operations.search.ReferralSearchMoveAndRenameIT
Tests run: 1, Failures: 0, Errors: 0, Skipped: 0, Time elapsed: 12.218 sec - in org.apache.directory.server.operations.search.ReferralSearchMoveAndRenameIT
Running org.apache.directory.server.operations.search.ReferralSearchIT
Tests run: 7, Failures: 0, Errors: 0, Skipped: 0, Time elapsed: 28.586 sec - in org.apache.directory.server.operations.search.ReferralSearchIT
Running org.apache.directory.server.operations.search.NegationSearchIT
Tests run: 2, Failures: 0, Errors: 0, Skipped: 0, Time elapsed: 12.483 sec - in org.apache.directory.server.operations.search.NegationSearchIT
Running org.apache.directory.server.operations.search.PagedSearchIT
Tests run: 37, Failures: 0, Errors: 0, Skipped: 0, Time elapsed: 49.264 sec - in org.apache.directory.server.operations.search.PagedSearchIT
Running org.apache.directory.server.operations.search.ReferralSearchNoRevertIT
Tests run: 1, Failures: 0, Errors: 0, Skipped: 0, Time elapsed: 16.385 sec - in org.apache.directory.server.operations.search.ReferralSearchNoRevertIT
Running org.apache.directory.server.operations.search.PersistentSearchIT
Tests run: 9, Failures: 0, Errors: 0, Skipped: 0, Time elapsed: 24.016 sec - in org.apache.directory.server.operations.search.PersistentSearchIT
Running org.apache.directory.server.operations.search.SchemaSearchIT
Tests run: 5, Failures: 0, Errors: 0, Skipped: 0, Time elapsed: 11.462 sec - in org.apache.directory.server.operations.search.SchemaSearchIT
Running org.apache.directory.server.operations.search.SearchIT
Tests run: 41, Failures: 0, Errors: 0, Skipped: 1, Time elapsed: 132.663 sec - in org.apache.directory.server.operations.search.SearchIT
Running org.apache.directory.server.operations.search.SearchLimitsIT
Tests run: 15, Failures: 0, Errors: 0, Skipped: 0, Time elapsed: 29.39 sec - in org.apache.directory.server.operations.search.SearchLimitsIT
Running org.apache.directory.server.operations.extended.StoredProcedureIT
Tests run: 2, Failures: 0, Errors: 0, Skipped: 2, Time elapsed: 6.96 sec - in org.apache.directory.server.operations.extended.StoredProcedureIT
Running org.apache.directory.server.operations.extended.ExtendedIT
Tests run: 1, Failures: 0, Errors: 0, Skipped: 0, Time elapsed: 7.422 sec - in org.apache.directory.server.operations.extended.ExtendedIT
Running org.apache.directory.server.operations.extended.PwdModifyIT
Tests run: 4, Failures: 0, Errors: 0, Skipped: 0, Time elapsed: 15.834 sec - in org.apache.directory.server.operations.extended.PwdModifyIT
Running org.apache.directory.server.operations.modifydn.ModifyDnReferralIT
Tests run: 7, Failures: 0, Errors: 0, Skipped: 0, Time elapsed: 16.782 sec - in org.apache.directory.server.operations.modifydn.ModifyDnReferralIT
Running org.apache.directory.server.operations.modifydn.ModifyRdnIT
Tests run: 19, Failures: 0, Errors: 0, Skipped: 2, Time elapsed: 37.549 sec - in org.apache.directory.server.operations.modifydn.ModifyRdnIT
Running org.apache.directory.server.operations.modifydn.MoveIT
Tests run: 4, Failures: 0, Errors: 0, Skipped: 0, Time elapsed: 16.127 sec - in org.apache.directory.server.operations.modifydn.MoveIT
Running org.apache.directory.server.schema.SchemaIT
Tests run: 3, Failures: 0, Errors: 0, Skipped: 0, Time elapsed: 37.992 sec - in org.apache.directory.server.schema.SchemaIT
Running org.apache.directory.server.ssl.LdapsUpdateCertificateIT
Tests run: 1, Failures: 0, Errors: 0, Skipped: 0, Time elapsed: 9.903 sec - in org.apache.directory.server.ssl.LdapsUpdateCertificateIT
Running org.apache.directory.server.ssl.StartTlsIT
Tests run: 1, Failures: 0, Errors: 0, Skipped: 0, Time elapsed: 9.508 sec - in org.apache.directory.server.ssl.StartTlsIT
Running org.apache.directory.server.ssl.StartTlsUpdateCertificateIT
Tests run: 1, Failures: 0, Errors: 0, Skipped: 0, Time elapsed: 7.223 sec - in org.apache.directory.server.ssl.StartTlsUpdateCertificateIT
Running org.apache.directory.server.ssl.StartTlsConfidentialityIT
Tests run: 1, Failures: 0, Errors: 0, Skipped: 0, Time elapsed: 12.227 sec - in org.apache.directory.server.ssl.StartTlsConfidentialityIT
Running org.apache.directory.server.ssl.LdapsIT
Tests run: 1, Failures: 0, Errors: 0, Skipped: 0, Time elapsed: 12.331 sec - in org.apache.directory.server.ssl.LdapsIT
Running org.apache.directory.server.ppolicy.PasswordPolicyIT
Tests run: 19, Failures: 0, Errors: 0, Skipped: 1, Time elapsed: 88.099 sec - in org.apache.directory.server.ppolicy.PasswordPolicyIT
Running org.apache.directory.server.kerberos.KeyDerivationServiceIT
Tests run: 4, Failures: 0, Errors: 0, Skipped: 0, Time elapsed: 26.451 sec - in org.apache.directory.server.kerberos.KeyDerivationServiceIT
Running org.apache.directory.server.kerberos.PasswordPolicyServiceIT
Tests run: 1, Failures: 0, Errors: 0, Skipped: 1, Time elapsed: 0 sec - in org.apache.directory.server.kerberos.PasswordPolicyServiceIT
Running org.apache.directory.dsml.engine.Dsmlv2EngineIT
Tests run: 2, Failures: 0, Errors: 0, Skipped: 0, Time elapsed: 12.507 sec - in org.apache.directory.dsml.engine.Dsmlv2EngineIT
Running org.apache.directory.IndexIT
Tests run: 2, Failures: 0, Errors: 0, Skipped: 1, Time elapsed: 0.822 sec - in org.apache.directory.IndexIT

Results :

Failed tests: 
  ClientServerReplicationIT.testRebootConsumer:491->restartConsumer:464 null
  ClientServerReplicationIT.testDelete:425 null
  ClientServerReplicationIT.testModify:270 null

Tests run: 432, Failures: 3, Errors: 0, Skipped: 14

[ERROR] There are test failures.

Please refer to <https://builds.apache.org/job/dir-apacheds-jdk16-ubuntu-deploy/ws/trunk/server-integ/target/surefire-reports>
for the individual test results.
ERROR: Maven JVM terminated unexpectedly with exit code 143


Mime
View raw message