directory-notifications mailing list archives

Site index · List index
Message view « Date » · « Thread »
Top « Date » · « Thread »
From Apache Jenkins Server <jenk...@builds.apache.org>
Subject Build failed in Jenkins: dir-apacheds-jdk16-win #387
Date Fri, 10 May 2013 05:14:52 GMT
See <https://builds.apache.org/job/dir-apacheds-jdk16-win/387/>

------------------------------------------
[...truncated 12598 lines...]
------------------------------------- Stop consumer
------------------------------------- Start consumer
------------------------------------- Stop consumer
------------------------------------- Start consumer
------------------------------------- Stop consumer
------------------------------------- Start consumer
------------------------------------- Stop consumer
------------------------------------- Start consumer
------------------------------------- Stop consumer
------------------------------------- Start consumer
>--------------------------------------- Adding Entry
    dn[n]: cn=user14,dc=example,dc=com
    objectclass: person
    cn: user14
    sn: user14

>--------------------------------------- Added 
>--------------------------------------- Modifying MessageType : MODIFY_REQUEST
Message ID : -1
    Modify Request
        Object : 'cn=user14,dc=example,dc=com'
            Modification[0]
                Operation :  add
                Modification
userPassword: secret
org.apache.directory.api.ldap.model.message.ModifyRequestImpl@ba3b521a
>--------------------------------------- Modified 
org.apache.directory.api.ldap.model.exception.LdapOperationErrorException: ERR_538 RecordManager
has been closed
	at org.apache.directory.server.core.partition.impl.btree.AbstractBTreePartition.modify(AbstractBTreePartition.java:1170)
	at org.apache.directory.server.core.shared.partition.DefaultPartitionNexus.sync(DefaultPartitionNexus.java:335)
	at org.apache.directory.server.core.DefaultDirectoryService.shutdown(DefaultDirectoryService.java:1325)
	at org.apache.directory.server.replication.ClientServerReplicationIT.tearDown(ClientServerReplicationIT.java:113)
	at sun.reflect.NativeMethodAccessorImpl.invoke0(Native Method)
	at sun.reflect.NativeMethodAccessorImpl.invoke(NativeMethodAccessorImpl.java:39)
	at sun.reflect.DelegatingMethodAccessorImpl.invoke(DelegatingMethodAccessorImpl.java:25)
	at java.lang.reflect.Method.invoke(Method.java:597)
	at org.junit.runners.model.FrameworkMethod$1.runReflectiveCall(FrameworkMethod.java:47)
	at org.junit.internal.runners.model.ReflectiveCallable.run(ReflectiveCallable.java:12)
	at org.junit.runners.model.FrameworkMethod.invokeExplosively(FrameworkMethod.java:44)
	at org.junit.internal.runners.statements.RunAfters.evaluate(RunAfters.java:33)
	at org.junit.runners.ParentRunner.run(ParentRunner.java:309)
	at org.apache.maven.surefire.junit4.JUnit4Provider.execute(JUnit4Provider.java:252)
	at org.apache.maven.surefire.junit4.JUnit4Provider.executeTestSet(JUnit4Provider.java:141)
	at org.apache.maven.surefire.junit4.JUnit4Provider.invoke(JUnit4Provider.java:112)
	at sun.reflect.NativeMethodAccessorImpl.invoke0(Native Method)
	at sun.reflect.NativeMethodAccessorImpl.invoke(NativeMethodAccessorImpl.java:39)
	at sun.reflect.DelegatingMethodAccessorImpl.invoke(DelegatingMethodAccessorImpl.java:25)
	at java.lang.reflect.Method.invoke(Method.java:597)
	at org.apache.maven.surefire.util.ReflectionUtils.invokeMethodWithArray(ReflectionUtils.java:189)
	at org.apache.maven.surefire.booter.ProviderFactory$ProviderProxy.invoke(ProviderFactory.java:165)
	at org.apache.maven.surefire.booter.ProviderFactory.invokeProvider(ProviderFactory.java:85)
	at org.apache.maven.surefire.booter.ForkedBooter.runSuitesInProcess(ForkedBooter.java:113)
	at org.apache.maven.surefire.booter.ForkedBooter.main(ForkedBooter.java:75)
Caused by: org.apache.directory.api.ldap.model.exception.LdapException: ERR_538 RecordManager
has been closed
	at org.apache.directory.server.core.partition.impl.btree.AbstractBTreePartition.getEntryId(AbstractBTreePartition.java:2203)
	at org.apache.directory.server.core.partition.impl.btree.AbstractBTreePartition.modify(AbstractBTreePartition.java:1180)
	at org.apache.directory.server.core.partition.impl.btree.AbstractBTreePartition.modify(AbstractBTreePartition.java:1160)
	... 24 more
Caused by: java.lang.IllegalStateException: ERR_538 RecordManager has been closed
	at jdbm.recman.CacheRecordManager.checkIfClosed(CacheRecordManager.java:399)
	at jdbm.recman.CacheRecordManager.fetch(CacheRecordManager.java:257)
	at jdbm.btree.BTree.getRoot(BTree.java:552)
	at jdbm.btree.BTree.find(BTree.java:405)
	at org.apache.directory.server.core.partition.impl.btree.jdbm.JdbmTable.get(JdbmTable.java:325)
	at org.apache.directory.server.core.partition.impl.btree.jdbm.JdbmIndex.forwardLookup(JdbmIndex.java:353)
	at org.apache.directory.server.core.partition.impl.btree.jdbm.JdbmIndex.forwardLookup(JdbmIndex.java:59)
	at org.apache.directory.server.core.partition.impl.btree.AbstractBTreePartition.getEntryId(AbstractBTreePartition.java:2185)
	... 26 more
Tests run: 6, Failures: 0, Errors: 1, Skipped: 1, Time elapsed: 63.045 sec <<< FAILURE!
Running org.apache.directory.server.replication.StaleEventLogDetectionIT
Tests run: 2, Failures: 0, Errors: 2, Skipped: 0, Time elapsed: 4.314 sec <<< FAILURE!
Running org.apache.directory.server.schema.SchemaIT

Results :

Tests in error: 
  org.apache.directory.server.replication.ClientServerReplicationIT: ERR_265 Grouping many
exceptions on root nexus sync()
  org.apache.directory.server.replication.StaleEventLogDetectionIT: the working directory
C:\Users\hudson\AppData\Local\Temp\server-work-provider-replication\run has been locked by
another directory service.
  org.apache.directory.server.replication.StaleEventLogDetectionIT

Tests run: 420, Failures: 0, Errors: 3, Skipped: 14

[WARNING] Could not delete temp direcotry F:\hudson\hudson-slave\workspace\dir-apacheds-jdk16-win\trunk\server-integ\target\surefire
because File F:\hudson\hudson-slave\workspace\dir-apacheds-jdk16-win\trunk\server-integ\target\surefire\surefirebooter8288260608782494036.jar
unable to be deleted.
[JENKINS] Recording test results
[INFO] ------------------------------------------------------------------------
[INFO] Reactor Summary:
[INFO] 
[INFO] ApacheDS .......................................... SUCCESS [5.537s]
[INFO] ApacheDS I18n ..................................... SUCCESS [6.032s]
[INFO] ApacheDS Core Constants ........................... SUCCESS [2.073s]
[INFO] ApacheDS Core API ................................. SUCCESS [24.469s]
[INFO] ApacheDS Core Shared .............................. SUCCESS [3.540s]
[INFO] ApacheDS Interceptors ............................. SUCCESS [0.139s]
[INFO] ApacheDS AdministrativePoint Interceptor .......... SUCCESS [2.499s]
[INFO] ApacheDS Authentication Interceptor ............... SUCCESS [4.494s]
[INFO] ApacheDS Authorization Interceptor ................ SUCCESS [6.026s]
[INFO] ApacheDS ChangeLog Interceptor .................... SUCCESS [3.371s]
[INFO] ApacheDS Collective Attribute Interceptor ......... SUCCESS [1.881s]
[INFO] ApacheDS Event Interceptor ........................ SUCCESS [1.490s]
[INFO] ApacheDS Exception Interceptor .................... SUCCESS [1.514s]
[INFO] ApacheDS Journal Interceptor ...................... SUCCESS [1.692s]
[INFO] ApacheDS Normalization Interceptor ................ SUCCESS [3.282s]
[INFO] ApacheDS Operational Attribute Interceptor ........ SUCCESS [1.596s]
[INFO] ApacheDS Referral Interceptor ..................... SUCCESS [1.678s]
[INFO] ApacheDS Schema Interceptor ....................... SUCCESS [7.610s]
[INFO] ApacheDS Subtree Interceptor ...................... SUCCESS [8.522s]
[INFO] ApacheDS Triggers Interceptor ..................... SUCCESS [2.068s]
[INFO] ApacheDS Core ..................................... SUCCESS [5.165s]
[INFO] ApacheDS Core AVL ................................. SUCCESS [8.866s]
[INFO] ApacheDS Generalized (X) DBM Partition ............ SUCCESS [19.880s]
[INFO] ApacheDS LDIF Partition ........................... SUCCESS [11.952s]
[INFO] ApacheDS JDBM Partition ........................... SUCCESS [38.641s]
[INFO] ApacheDS Core Annotations ......................... SUCCESS [55.069s]
[INFO] ApacheDS Core JNDI ................................ SUCCESS [3.310s]
[INFO] ApacheDS Protocol Kerberos Codec .................. SUCCESS [18.028s]
[INFO] ApacheDS Interceptors for Kerberos ................ SUCCESS [2.582s]
[INFO] ApacheDS Protocol Dhcp ............................ SUCCESS [3.322s]
[INFO] ApacheDS Protocol Shared .......................... SUCCESS [2.719s]
[INFO] ApacheDS Protocol Dns ............................. SUCCESS [4.692s]
[INFO] ApacheDS Protocol Kerberos ........................ SUCCESS [14.742s]
[INFO] ApacheDS Protocol Ldap ............................ SUCCESS [1:07.954s]
[INFO] ApacheDS Protocol Ntp ............................. SUCCESS [20.732s]
[INFO] Apacheds Server Annotations ....................... SUCCESS [56.846s]
[INFO] ApacheDS Server Config ............................ SUCCESS [31.991s]
[INFO] ApacheDS Server JNDI .............................. SUCCESS [7.650s]
[INFO] ApacheDS Test Framework ........................... SUCCESS [2:14.372s]
[INFO] ApacheDS All ...................................... SUCCESS [8.629s]
[INFO] ApacheDS Logger Interceptor ....................... SUCCESS [3.769s]
[INFO] ApacheDS Password Hashing Interceptor ............. SUCCESS [2.275s]
[INFO] ApacheDS Core Integration ......................... SUCCESS [29:37.485s]
[INFO] ApacheDS Server Integration ....................... FAILURE [31:06.776s]
[INFO] ApacheDS DirectoryService-WebApp bridge ........... SKIPPED
[INFO] ApacheDS Jetty HTTP Server Integration ............ SKIPPED
[INFO] ApacheDS Service Builder .......................... SKIPPED
[INFO] ApacheDS Protocol Kerberos Test ................... SKIPPED
[INFO] Apache Directory LDAP Client API test ............. SKIPPED
[INFO] kerberos-client ................................... SKIPPED
[INFO] ApacheDS Service .................................. SKIPPED
[INFO] ApacheDS Wrapper .................................. SKIPPED
[INFO] ApacheDS Installers Maven Plugin .................. SKIPPED
[INFO] ApacheDS Installers ............................... SKIPPED
[INFO] ------------------------------------------------------------------------
[INFO] BUILD FAILURE
[INFO] ------------------------------------------------------------------------
[INFO] Total time: 1:11:07.387s
[INFO] Finished at: Fri May 10 06:13:54 BST 2013
[INFO] Final Memory: 53M/283M
[INFO] ------------------------------------------------------------------------
[JENKINS] Archiving disabled
[JENKINS] Archiving disabled
[JENKINS] Archiving disabled
[JENKINS] Archiving disabled
[JENKINS] Archiving disabled
[JENKINS] Archiving disabled
[JENKINS] Archiving disabled
[JENKINS] Archiving disabled
[JENKINS] Archiving disabled
[JENKINS] Archiving disabled
[JENKINS] Archiving disabled
[JENKINS] Archiving disabled
[JENKINS] Archiving disabled
[JENKINS] Archiving disabled
[JENKINS] Archiving disabled
[JENKINS] Archiving disabled
[JENKINS] Archiving disabled
[JENKINS] Archiving disabled
[JENKINS] Archiving disabled
[JENKINS] Archiving disabled
[JENKINS] Archiving disabled
[JENKINS] Archiving disabled
[JENKINS] Archiving disabled
[JENKINS] Archiving disabled
[JENKINS] Archiving disabled
[JENKINS] Archiving disabled
[JENKINS] Archiving disabled
[JENKINS] Archiving disabled
[JENKINS] Archiving disabled
[JENKINS] Archiving disabled
[JENKINS] Archiving disabled
[JENKINS] Archiving disabled
[JENKINS] Archiving disabled
[JENKINS] Archiving disabled
[JENKINS] Archiving disabled
[JENKINS] Archiving disabled
[JENKINS] Archiving disabled
[JENKINS] Archiving disabled
[JENKINS] Archiving disabled
[JENKINS] Archiving disabled
[JENKINS] Archiving disabled
[JENKINS] Archiving disabled
[JENKINS] Archiving disabled
[JENKINS] Archiving disabled
[JENKINS] Archiving disabled
[JENKINS] Archiving disabled
[JENKINS] Archiving disabled
[JENKINS] Archiving disabled
[JENKINS] Archiving disabled
[JENKINS] Archiving disabled
[JENKINS] Archiving disabled
[JENKINS] Archiving disabled
[JENKINS] Archiving disabled
[JENKINS] Archiving disabled
Waiting for Jenkins to finish collecting data
mavenExecutionResult exceptions not empty
message : Failed to execute goal org.apache.maven.plugins:maven-surefire-plugin:2.12.2:test
(default-test) on project apacheds-server-integ: Failure or timeout
cause : Failure or timeout
Stack trace : 
org.apache.maven.lifecycle.LifecycleExecutionException: Failed to execute goal org.apache.maven.plugins:maven-surefire-plugin:2.12.2:test
(default-test) on project apacheds-server-integ: Failure or timeout
	at org.apache.maven.lifecycle.internal.MojoExecutor.execute(MojoExecutor.java:217)
	at org.apache.maven.lifecycle.internal.MojoExecutor.execute(MojoExecutor.java:153)
	at org.apache.maven.lifecycle.internal.MojoExecutor.execute(MojoExecutor.java:145)
	at org.apache.maven.lifecycle.internal.LifecycleModuleBuilder.buildProject(LifecycleModuleBuilder.java:84)
	at org.apache.maven.lifecycle.internal.LifecycleModuleBuilder.buildProject(LifecycleModuleBuilder.java:59)
	at org.apache.maven.lifecycle.internal.LifecycleStarter.singleThreadedBuild(LifecycleStarter.java:183)
	at org.apache.maven.lifecycle.internal.LifecycleStarter.execute(LifecycleStarter.java:161)
	at org.apache.maven.DefaultMaven.doExecute(DefaultMaven.java:319)
	at org.apache.maven.DefaultMaven.execute(DefaultMaven.java:156)
	at org.jvnet.hudson.maven3.launcher.Maven3Launcher.main(Maven3Launcher.java:79)
	at sun.reflect.NativeMethodAccessorImpl.invoke0(Native Method)
	at sun.reflect.NativeMethodAccessorImpl.invoke(NativeMethodAccessorImpl.java:39)
	at sun.reflect.DelegatingMethodAccessorImpl.invoke(DelegatingMethodAccessorImpl.java:25)
	at java.lang.reflect.Method.invoke(Method.java:597)
	at org.codehaus.plexus.classworlds.launcher.Launcher.launchStandard(Launcher.java:329)
	at org.codehaus.plexus.classworlds.launcher.Launcher.launch(Launcher.java:239)
	at org.jvnet.hudson.maven3.agent.Maven3Main.launch(Maven3Main.java:158)
	at hudson.maven.Maven3Builder.call(Maven3Builder.java:100)
	at hudson.maven.Maven3Builder.call(Maven3Builder.java:66)
	at hudson.remoting.UserRequest.perform(UserRequest.java:118)
	at hudson.remoting.UserRequest.perform(UserRequest.java:48)
	at hudson.remoting.Request$2.run(Request.java:326)
	at hudson.remoting.InterceptingExecutorService$1.call(InterceptingExecutorService.java:72)
	at java.util.concurrent.FutureTask$Sync.innerRun(FutureTask.java:303)
	at java.util.concurrent.FutureTask.run(FutureTask.java:138)
	at java.util.concurrent.ThreadPoolExecutor$Worker.runTask(ThreadPoolExecutor.java:886)
	at java.util.concurrent.ThreadPoolExecutor$Worker.run(ThreadPoolExecutor.java:908)
	at java.lang.Thread.run(Thread.java:662)
Caused by: org.apache.maven.plugin.MojoExecutionException: Failure or timeout
	at org.apache.maven.plugin.surefire.SurefirePlugin.assertNoFailureOrTimeout(SurefirePlugin.java:177)
	at org.apache.maven.plugin.surefire.SurefirePlugin.handleSummary(SurefirePlugin.java:158)
	at org.apache.maven.plugin.surefire.AbstractSurefireMojo.executeAfterPreconditionsChecked(AbstractSurefireMojo.java:626)
	at org.apache.maven.plugin.surefire.AbstractSurefireMojo.execute(AbstractSurefireMojo.java:587)
	at org.apache.maven.plugin.DefaultBuildPluginManager.executeMojo(DefaultBuildPluginManager.java:107)
	at org.apache.maven.lifecycle.internal.MojoExecutor.execute(MojoExecutor.java:209)
	... 27 more
Maven failed with error.
Sending e-mails to: notifications@directory.apache.org
Sending e-mails to: notifications@directory.apache.org
Sending e-mails to: notifications@directory.apache.org
channel stopped

Mime
View raw message