directory-notifications mailing list archives

Site index · List index
Message view « Date » · « Thread »
Top « Date » · « Thread »
From Apache Jenkins Server <jenk...@builds.apache.org>
Subject Build failed in Jenkins: dir-apacheds-jdk16-win » ApacheDS Server Integration #401
Date Tue, 21 May 2013 21:12:14 GMT
See <https://builds.apache.org/job/dir-apacheds-jdk16-win/org.apache.directory.server$apacheds-server-integ/401/>

------------------------------------------
[...truncated 49 lines...]
Tests run: 1, Failures: 0, Errors: 0, Skipped: 0, Time elapsed: 10.71 sec
Running org.apache.directory.server.kerberos.KeyDerivationServiceIT
Tests run: 4, Failures: 0, Errors: 0, Skipped: 0, Time elapsed: 18.69 sec
Running org.apache.directory.server.kerberos.PasswordPolicyServiceIT
Tests run: 1, Failures: 0, Errors: 0, Skipped: 1, Time elapsed: 0.001 sec
Running org.apache.directory.server.operations.add.AddAliasIT
Tests run: 3, Failures: 0, Errors: 0, Skipped: 0, Time elapsed: 14.45 sec
Running org.apache.directory.server.operations.add.AddingEntriesWithSpecialCharactersInRDNIT
Tests run: 9, Failures: 0, Errors: 0, Skipped: 0, Time elapsed: 19.525 sec
Running org.apache.directory.server.operations.add.AddIT
Tests run: 31, Failures: 0, Errors: 0, Skipped: 0, Time elapsed: 41.356 sec
Running org.apache.directory.server.operations.bind.BindIT
Tests run: 5, Failures: 0, Errors: 0, Skipped: 0, Time elapsed: 13.137 sec
Running org.apache.directory.server.operations.bind.DelegatedAuthIT
Tests run: 2, Failures: 0, Errors: 0, Skipped: 0, Time elapsed: 24.187 sec
Running org.apache.directory.server.operations.bind.DelegatedAuthOverSslIT
Tests run: 1, Failures: 0, Errors: 0, Skipped: 0, Time elapsed: 16.506 sec
Running org.apache.directory.server.operations.bind.DelegatedAuthOverTlsIT
Tests run: 1, Failures: 0, Errors: 0, Skipped: 0, Time elapsed: 17.155 sec
Running org.apache.directory.server.operations.bind.MiscBindIT
Tests run: 6, Failures: 0, Errors: 0, Skipped: 0, Time elapsed: 20.275 sec
Running org.apache.directory.server.operations.bind.SaslBindIT
javax.security.sasl.SaslException: GSS initiate failed [Caused by GSSException: No valid credentials
provided (Mechanism level: Server not found in Kerberos database (7) - Server not found in
Kerberos database)]
	at com.sun.security.sasl.gsskerb.GssKrb5Client.evaluateChallenge(GssKrb5Client.java:194)
	at org.apache.directory.ldap.client.api.LdapNetworkConnection.bindSasl(LdapNetworkConnection.java:3808)
	at org.apache.directory.ldap.client.api.LdapNetworkConnection.access$200(LdapNetworkConnection.java:178)
	at org.apache.directory.ldap.client.api.LdapNetworkConnection$2.run(LdapNetworkConnection.java:1529)
	at java.security.AccessController.doPrivileged(Native Method)
	at javax.security.auth.Subject.doAs(Subject.java:396)
	at org.apache.directory.ldap.client.api.LdapNetworkConnection.bindAsync(LdapNetworkConnection.java:1525)
	at org.apache.directory.ldap.client.api.LdapNetworkConnection.bind(LdapNetworkConnection.java:1427)
	at org.apache.directory.server.operations.bind.SaslBindIT.testSaslGssApiBind(SaslBindIT.java:521)
	at sun.reflect.NativeMethodAccessorImpl.invoke0(Native Method)
	at sun.reflect.NativeMethodAccessorImpl.invoke(NativeMethodAccessorImpl.java:39)
	at sun.reflect.DelegatingMethodAccessorImpl.invoke(DelegatingMethodAccessorImpl.java:25)
	at java.lang.reflect.Method.invoke(Method.java:597)
	at org.junit.runners.model.FrameworkMethod$1.runReflectiveCall(FrameworkMethod.java:47)
	at org.junit.internal.runners.model.ReflectiveCallable.run(ReflectiveCallable.java:12)
	at org.junit.runners.model.FrameworkMethod.invokeExplosively(FrameworkMethod.java:44)
	at org.junit.internal.runners.statements.InvokeMethod.evaluate(InvokeMethod.java:17)
	at org.apache.directory.junit.tools.MultiThreadedMultiInvoker$1$1.run(MultiThreadedMultiInvoker.java:160)
	at java.util.concurrent.ThreadPoolExecutor$Worker.runTask(ThreadPoolExecutor.java:886)
	at java.util.concurrent.ThreadPoolExecutor$Worker.run(ThreadPoolExecutor.java:908)
	at java.lang.Thread.run(Thread.java:662)
Caused by: GSSException: No valid credentials provided (Mechanism level: Server not found
in Kerberos database (7) - Server not found in Kerberos database)
	at sun.security.jgss.krb5.Krb5Context.initSecContext(Krb5Context.java:663)
	at sun.security.jgss.GSSContextImpl.initSecContext(GSSContextImpl.java:230)
	at sun.security.jgss.GSSContextImpl.initSecContext(GSSContextImpl.java:162)
	at com.sun.security.sasl.gsskerb.GssKrb5Client.evaluateChallenge(GssKrb5Client.java:175)
	... 20 more
Caused by: KrbException: Server not found in Kerberos database (7) - Server not found in Kerberos
database
	at sun.security.krb5.KrbTgsRep.<init>(KrbTgsRep.java:64)
	at sun.security.krb5.KrbTgsReq.getReply(KrbTgsReq.java:185)
	at sun.security.krb5.internal.CredentialsUtil.serviceCreds(CredentialsUtil.java:294)
	at sun.security.krb5.internal.CredentialsUtil.acquireServiceCreds(CredentialsUtil.java:106)
	at sun.security.krb5.Credentials.acquireServiceCreds(Credentials.java:557)
	at sun.security.jgss.krb5.Krb5Context.initSecContext(Krb5Context.java:594)
	... 23 more
Caused by: KrbException: Identifier doesn't match expected value (906)
	at sun.security.krb5.internal.KDCRep.init(KDCRep.java:133)
	at sun.security.krb5.internal.TGSRep.init(TGSRep.java:58)
	at sun.security.krb5.internal.TGSRep.<init>(TGSRep.java:53)
	at sun.security.krb5.KrbTgsRep.<init>(KrbTgsRep.java:46)
	... 28 more
Tests run: 17, Failures: 0, Errors: 1, Skipped: 4, Time elapsed: 27.562 sec <<< FAILURE!
Running org.apache.directory.server.operations.bind.SimpleBindIT
Tests run: 10, Failures: 0, Errors: 0, Skipped: 0, Time elapsed: 17.332 sec
Running org.apache.directory.server.operations.compare.CompareIT
Tests run: 7, Failures: 0, Errors: 0, Skipped: 0, Time elapsed: 14.49 sec
Running org.apache.directory.server.operations.compare.MatchingRuleCompareIT
Tests run: 2, Failures: 0, Errors: 0, Skipped: 0, Time elapsed: 9.871 sec
Running org.apache.directory.server.operations.delete.DeleteAliasIT
Tests run: 2, Failures: 0, Errors: 0, Skipped: 0, Time elapsed: 9.081 sec
Running org.apache.directory.server.operations.delete.DeleteIT
Tests run: 8, Failures: 0, Errors: 0, Skipped: 0, Time elapsed: 16.342 sec
Running org.apache.directory.server.operations.extended.ExtendedIT
Tests run: 1, Failures: 0, Errors: 0, Skipped: 0, Time elapsed: 7.772 sec
Running org.apache.directory.server.operations.extended.PwdModifyIT
Tests run: 4, Failures: 0, Errors: 0, Skipped: 0, Time elapsed: 10.41 sec
Running org.apache.directory.server.operations.extended.StoredProcedureIT
Tests run: 2, Failures: 0, Errors: 0, Skipped: 2, Time elapsed: 8.254 sec
Running org.apache.directory.server.operations.ldapsdk.AddIT
Tests run: 30, Failures: 0, Errors: 0, Skipped: 0, Time elapsed: 57.662 sec
Running org.apache.directory.server.operations.ldapsdk.BindIT
Tests run: 5, Failures: 0, Errors: 0, Skipped: 0, Time elapsed: 12.691 sec
Running org.apache.directory.server.operations.ldapsdk.CompareIT
Tests run: 7, Failures: 0, Errors: 0, Skipped: 0, Time elapsed: 16.777 sec
Running org.apache.directory.server.operations.ldapsdk.DeleteIT
Tests run: 8, Failures: 0, Errors: 0, Skipped: 0, Time elapsed: 16.669 sec
Running org.apache.directory.server.operations.ldapsdk.IllegalModificationIT
Tests run: 2, Failures: 0, Errors: 0, Skipped: 0, Time elapsed: 7.309 sec
Running org.apache.directory.server.operations.ldapsdk.ModifyDnReferralIT
Tests run: 7, Failures: 0, Errors: 0, Skipped: 0, Time elapsed: 15.047 sec
Running org.apache.directory.server.operations.ldapsdk.ModifyReferralIT
Tests run: 4, Failures: 0, Errors: 0, Skipped: 0, Time elapsed: 11.837 sec
Running org.apache.directory.server.operations.lookup.LookupIT
Tests run: 3, Failures: 0, Errors: 0, Skipped: 0, Time elapsed: 10.602 sec
Running org.apache.directory.server.operations.modify.IllegalModificationIT
Tests run: 2, Failures: 0, Errors: 0, Skipped: 0, Time elapsed: 11.344 sec
Running org.apache.directory.server.operations.modify.ModifyAddIT
Tests run: 16, Failures: 0, Errors: 0, Skipped: 0, Time elapsed: 26.037 sec
Running org.apache.directory.server.operations.modify.ModifyMultipleChangesIT
Tests run: 2, Failures: 0, Errors: 0, Skipped: 0, Time elapsed: 9.923 sec
Running org.apache.directory.server.operations.modify.ModifyReferralIT
Tests run: 4, Failures: 0, Errors: 0, Skipped: 0, Time elapsed: 12.031 sec
Running org.apache.directory.server.operations.modify.ModifyRemoveIT
Tests run: 16, Failures: 0, Errors: 0, Skipped: 0, Time elapsed: 27.316 sec
Running org.apache.directory.server.operations.modify.ModifyReplaceIT
Tests run: 7, Failures: 0, Errors: 0, Skipped: 0, Time elapsed: 15.149 sec
Running org.apache.directory.server.operations.modifydn.ModifyDnReferralIT
Tests run: 7, Failures: 0, Errors: 0, Skipped: 0, Time elapsed: 15.219 sec
Running org.apache.directory.server.operations.modifydn.ModifyRdnIT
Tests run: 19, Failures: 0, Errors: 0, Skipped: 2, Time elapsed: 27.986 sec
Running org.apache.directory.server.operations.modifydn.MoveIT
Tests run: 4, Failures: 0, Errors: 0, Skipped: 0, Time elapsed: 12.358 sec
Running org.apache.directory.server.operations.search.IndexedNegationSearchIT
Tests run: 3, Failures: 0, Errors: 0, Skipped: 0, Time elapsed: 11.944 sec
Running org.apache.directory.server.operations.search.NegationSearchIT
Tests run: 2, Failures: 0, Errors: 0, Skipped: 0, Time elapsed: 10.178 sec
Running org.apache.directory.server.operations.search.PagedSearchIT
Tests run: 37, Failures: 0, Errors: 0, Skipped: 0, Time elapsed: 46.767 sec
Running org.apache.directory.server.operations.search.PersistentSearchIT
Tests run: 9, Failures: 0, Errors: 0, Skipped: 0, Time elapsed: 22.523 sec
Running org.apache.directory.server.operations.search.ReferralSearchIT
Tests run: 7, Failures: 0, Errors: 0, Skipped: 0, Time elapsed: 18.305 sec
Running org.apache.directory.server.operations.search.ReferralSearchMoveAndRenameIT
Tests run: 1, Failures: 0, Errors: 0, Skipped: 0, Time elapsed: 10.52 sec
Running org.apache.directory.server.operations.search.ReferralSearchNoRevertIT
Tests run: 1, Failures: 0, Errors: 0, Skipped: 0, Time elapsed: 11.498 sec
Running org.apache.directory.server.operations.search.SchemaSearchIT
Tests run: 5, Failures: 0, Errors: 0, Skipped: 0, Time elapsed: 12.128 sec
Running org.apache.directory.server.operations.search.SearchIT
Tests run: 41, Failures: 0, Errors: 0, Skipped: 1, Time elapsed: 655.783 sec
Running org.apache.directory.server.operations.search.SearchLimitsIT
Tests run: 15, Failures: 0, Errors: 0, Skipped: 0, Time elapsed: 27.668 sec
Running org.apache.directory.server.ppolicy.PasswordPolicyIT
pwdFailureTime: 20130521210835.401Z

pwdFailureTime: 20130521210835.401Z
pwdFailureTime: 20130521210836.558Z

pwdFailureTime: 20130521210836.558Z
pwdFailureTime: 20130521210837.740Z

pwdFailureTime: 20130521210837.740Z
pwdFailureTime: 20130521210838.909Z

Tests run: 19, Failures: 0, Errors: 0, Skipped: 1, Time elapsed: 85.512 sec
Running org.apache.directory.server.replication.ClientInitialRefreshIT

---> Running testInitialRefreshLoadAndAdd

NbAdded every 100ms : 
0, 11
NbAdded every 100ms : 
0, 1
<-- Done

---> Running testInitialRefreshStopAndGo

Completed so far : 
(consumer1 completed) 

NbAdded every 100ms : 
0, 10
<-- Done

--->Running testInitialRefresh4Consumers

Completed so far : 
(consumer1 completed) 
(consumer3 completed) 
(consumer2 completed) 
(consumer4 completed) 

<-- Done

---> Running testInitialRefreshLoad

NbAdded every 100ms : 
0, 11
<-- Done
Tests run: 4, Failures: 0, Errors: 0, Skipped: 0, Time elapsed: 24.345 sec
Running org.apache.directory.server.replication.ClientServerReplicationIT
------------------------------------- Stop consumer
------------------------------------- Start consumer
------------------------------------- Stop consumer
------------------------------------- Start consumer
------------------------------------- Stop consumer
------------------------------------- Start consumer
------------------------------------- Stop consumer
------------------------------------- Start consumer
------------------------------------- Stop consumer
------------------------------------- Start consumer
------------------------------------- Stop consumer
------------------------------------- Start consumer
------------------------------------- Stop consumer
------------------------------------- Start consumer
------------------------------------- Stop consumer
------------------------------------- Start consumer
------------------------------------- Stop consumer
------------------------------------- Start consumer
------------------------------------- Stop consumer
------------------------------------- Start consumer
>--------------------------------------- Adding Entry
    dn[n]: cn=user14,dc=example,dc=com
    objectclass: person
    cn: user14
    sn: user14

>--------------------------------------- Added 
>--------------------------------------- Modifying MessageType : MODIFY_REQUEST
Message ID : -1
    Modify Request
        Object : 'cn=user14,dc=example,dc=com'
            Modification[0]
                Operation :  add
                Modification
userPassword: secret
org.apache.directory.api.ldap.model.message.ModifyRequestImpl@a9024862
>--------------------------------------- Modified 
Tests run: 5, Failures: 0, Errors: 0, Skipped: 1, Time elapsed: 49.592 sec
Running org.apache.directory.server.replication.StaleEventLogDetectionIT

---> Running testDeleteStaleEventLog

NbAdded every 100ms : 
0, 11
<-- Done
Tests run: 1, Failures: 0, Errors: 0, Skipped: 0, Time elapsed: 27.701 sec
Running org.apache.directory.server.schema.SchemaIT
Tests run: 3, Failures: 0, Errors: 0, Skipped: 0, Time elapsed: 30.471 sec
Running org.apache.directory.server.ssl.LdapsIT
Tests run: 1, Failures: 0, Errors: 0, Skipped: 0, Time elapsed: 8.065 sec
Running org.apache.directory.server.ssl.LdapsUpdateCertificateIT
Tests run: 1, Failures: 0, Errors: 0, Skipped: 0, Time elapsed: 9.582 sec
Running org.apache.directory.server.ssl.StartTlsConfidentialityIT
Tests run: 1, Failures: 0, Errors: 0, Skipped: 0, Time elapsed: 8.677 sec
Running org.apache.directory.server.ssl.StartTlsIT

Results :

Tests in error: 
  testSaslGssApiBind(org.apache.directory.server.operations.bind.SaslBindIT): java.security.PrivilegedActionException:
org.apache.directory.api.ldap.model.exception.LdapException: javax.security.sasl.SaslException:
GSS initiate failed [Caused by GSSException: No valid credentials provided (Mechanism level:
Server not found in Kerberos database (7) - Server not found in Kerberos database)]

Tests run: 426, Failures: 0, Errors: 1, Skipped: 14

[WARNING] Could not delete temp direcotry F:\hudson\hudson-slave\workspace\dir-apacheds-jdk16-win\trunk\server-integ\target\surefire
because File F:\hudson\hudson-slave\workspace\dir-apacheds-jdk16-win\trunk\server-integ\target\surefire\surefirebooter6241652362880968528.jar
unable to be deleted.
[JENKINS] Recording test results

Mime
View raw message