directory-notifications mailing list archives

Site index · List index
Message view « Date » · « Thread »
Top « Date » · « Thread »
From Apache Jenkins Server <jenk...@builds.apache.org>
Subject Build failed in Jenkins: dir-apacheds-jdk16-win #384
Date Tue, 07 May 2013 05:15:27 GMT
See <https://builds.apache.org/job/dir-apacheds-jdk16-win/384/changes>

Changes:

[elecharny] o Fixed the testModDn test by waiting for the consumer thread to be initialized
before accepting incoming requests
o Initialized the handlers, partitions and replication before opening the server

[elecharny] Applied patch for DIRSERVER-1730

[pamarcelot] Added utility methods related to the "cipher suites" field.

[elecharny] Added some Javadoc

[elecharny] o Get the pwdAttribute from the passwordPolicy configuration

[elecharny] Fixed a bad constant for replication log (See DIRSERVER-1840)

------------------------------------------
[...truncated 3132 lines...]
Running org.apache.directory.server.operations.bind.BindIT
Tests run: 5, Failures: 0, Errors: 0, Skipped: 0, Time elapsed: 12.358 sec
Running org.apache.directory.server.operations.bind.DelegatedAuthIT
Tests run: 2, Failures: 0, Errors: 0, Skipped: 0, Time elapsed: 29.472 sec
Running org.apache.directory.server.operations.bind.MiscBindIT
Tests run: 6, Failures: 0, Errors: 0, Skipped: 0, Time elapsed: 17.17 sec
Running org.apache.directory.server.operations.bind.SaslBindIT
		No encryption was performed by peer.
		No encryption was performed by peer.
Tests run: 17, Failures: 0, Errors: 0, Skipped: 4, Time elapsed: 31.303 sec
Running org.apache.directory.server.operations.bind.SimpleBindIT
Tests run: 10, Failures: 0, Errors: 0, Skipped: 0, Time elapsed: 16.427 sec
Running org.apache.directory.server.operations.compare.CompareIT
Tests run: 7, Failures: 0, Errors: 0, Skipped: 0, Time elapsed: 14.544 sec
Running org.apache.directory.server.operations.compare.MatchingRuleCompareIT
Tests run: 2, Failures: 0, Errors: 0, Skipped: 0, Time elapsed: 10.463 sec
Running org.apache.directory.server.operations.delete.DeleteAliasIT
Tests run: 2, Failures: 0, Errors: 0, Skipped: 0, Time elapsed: 11.828 sec
Running org.apache.directory.server.operations.delete.DeleteIT
Tests run: 8, Failures: 0, Errors: 0, Skipped: 0, Time elapsed: 16.102 sec
Running org.apache.directory.server.operations.extended.ExtendedIT
Tests run: 1, Failures: 0, Errors: 0, Skipped: 0, Time elapsed: 7.755 sec
Running org.apache.directory.server.operations.extended.PwdModifyIT
Tests run: 4, Failures: 0, Errors: 0, Skipped: 0, Time elapsed: 9.38 sec
Running org.apache.directory.server.operations.extended.StoredProcedureIT
Tests run: 2, Failures: 0, Errors: 0, Skipped: 2, Time elapsed: 6.223 sec
Running org.apache.directory.server.operations.ldapsdk.AddIT
Tests run: 30, Failures: 0, Errors: 0, Skipped: 0, Time elapsed: 59.121 sec
Running org.apache.directory.server.operations.ldapsdk.BindIT
Tests run: 5, Failures: 0, Errors: 0, Skipped: 0, Time elapsed: 12.097 sec
Running org.apache.directory.server.operations.ldapsdk.CompareIT
Tests run: 7, Failures: 0, Errors: 0, Skipped: 0, Time elapsed: 14.454 sec
Running org.apache.directory.server.operations.ldapsdk.DeleteIT
Tests run: 8, Failures: 0, Errors: 0, Skipped: 0, Time elapsed: 17.34 sec
Running org.apache.directory.server.operations.ldapsdk.IllegalModificationIT
Tests run: 2, Failures: 0, Errors: 0, Skipped: 0, Time elapsed: 7.204 sec
Running org.apache.directory.server.operations.ldapsdk.ModifyDnReferralIT
Tests run: 7, Failures: 0, Errors: 0, Skipped: 0, Time elapsed: 14.237 sec
Running org.apache.directory.server.operations.ldapsdk.ModifyReferralIT
Tests run: 4, Failures: 0, Errors: 0, Skipped: 0, Time elapsed: 11.453 sec
Running org.apache.directory.server.operations.lookup.LookupIT
Tests run: 3, Failures: 0, Errors: 0, Skipped: 0, Time elapsed: 10.388 sec
Running org.apache.directory.server.operations.modify.IllegalModificationIT
Tests run: 2, Failures: 0, Errors: 0, Skipped: 0, Time elapsed: 10.656 sec
Running org.apache.directory.server.operations.modify.ModifyAddIT
Tests run: 16, Failures: 0, Errors: 0, Skipped: 0, Time elapsed: 24.957 sec
Running org.apache.directory.server.operations.modify.ModifyMultipleChangesIT
Tests run: 2, Failures: 0, Errors: 0, Skipped: 0, Time elapsed: 9.72 sec
Running org.apache.directory.server.operations.modify.ModifyReferralIT
Tests run: 4, Failures: 0, Errors: 0, Skipped: 0, Time elapsed: 11.471 sec
Running org.apache.directory.server.operations.modify.ModifyRemoveIT
Tests run: 16, Failures: 0, Errors: 0, Skipped: 0, Time elapsed: 26.927 sec
Running org.apache.directory.server.operations.modify.ModifyReplaceIT
Tests run: 7, Failures: 0, Errors: 0, Skipped: 0, Time elapsed: 16.125 sec
Running org.apache.directory.server.operations.modifydn.ModifyDnReferralIT
Tests run: 7, Failures: 0, Errors: 0, Skipped: 0, Time elapsed: 14.329 sec
Running org.apache.directory.server.operations.modifydn.ModifyRdnIT
Tests run: 19, Failures: 0, Errors: 0, Skipped: 2, Time elapsed: 24.277 sec
Running org.apache.directory.server.operations.modifydn.MoveIT
Tests run: 4, Failures: 0, Errors: 0, Skipped: 0, Time elapsed: 12.279 sec
Running org.apache.directory.server.operations.search.IndexedNegationSearchIT
Tests run: 3, Failures: 0, Errors: 0, Skipped: 0, Time elapsed: 16.087 sec
Running org.apache.directory.server.operations.search.NegationSearchIT
Tests run: 2, Failures: 0, Errors: 0, Skipped: 0, Time elapsed: 12.232 sec
Running org.apache.directory.server.operations.search.PagedSearchIT
Tests run: 37, Failures: 0, Errors: 0, Skipped: 0, Time elapsed: 35.929 sec
Running org.apache.directory.server.operations.search.PersistentSearchIT
Tests run: 9, Failures: 0, Errors: 0, Skipped: 0, Time elapsed: 17.773 sec
Running org.apache.directory.server.operations.search.ReferralSearchIT
Tests run: 7, Failures: 0, Errors: 0, Skipped: 0, Time elapsed: 22.542 sec
Running org.apache.directory.server.operations.search.ReferralSearchMoveAndRenameIT
Tests run: 1, Failures: 0, Errors: 0, Skipped: 0, Time elapsed: 14.556 sec
Running org.apache.directory.server.operations.search.ReferralSearchNoRevertIT
Tests run: 1, Failures: 0, Errors: 0, Skipped: 0, Time elapsed: 17.251 sec
Running org.apache.directory.server.operations.search.SchemaSearchIT
Tests run: 5, Failures: 0, Errors: 0, Skipped: 0, Time elapsed: 20.135 sec
Running org.apache.directory.server.operations.search.SearchIT

Results :

Tests run: 333, Failures: 0, Errors: 0, Skipped: 11

[WARNING] Could not delete temp direcotry F:\hudson\hudson-slave\workspace\dir-apacheds-jdk16-win\trunk\server-integ\target\surefire
because File F:\hudson\hudson-slave\workspace\dir-apacheds-jdk16-win\trunk\server-integ\target\surefire\surefirebooter5245725974536407528.jar
unable to be deleted.
[JENKINS] Recording test results
[INFO] ------------------------------------------------------------------------
[INFO] Reactor Summary:
[INFO] 
[INFO] ApacheDS .......................................... SUCCESS [5.113s]
[INFO] ApacheDS I18n ..................................... SUCCESS [4.958s]
[INFO] ApacheDS Core Constants ........................... SUCCESS [2.017s]
[INFO] ApacheDS Core API ................................. SUCCESS [20.314s]
[INFO] ApacheDS Core Shared .............................. SUCCESS [3.067s]
[INFO] ApacheDS Interceptors ............................. SUCCESS [0.121s]
[INFO] ApacheDS AdministrativePoint Interceptor .......... SUCCESS [2.092s]
[INFO] ApacheDS Authentication Interceptor ............... SUCCESS [4.309s]
[INFO] ApacheDS Authorization Interceptor ................ SUCCESS [5.655s]
[INFO] ApacheDS ChangeLog Interceptor .................... SUCCESS [3.633s]
[INFO] ApacheDS Collective Attribute Interceptor ......... SUCCESS [1.614s]
[INFO] ApacheDS Event Interceptor ........................ SUCCESS [1.415s]
[INFO] ApacheDS Exception Interceptor .................... SUCCESS [1.612s]
[INFO] ApacheDS Journal Interceptor ...................... SUCCESS [1.370s]
[INFO] ApacheDS Normalization Interceptor ................ SUCCESS [3.219s]
[INFO] ApacheDS Operational Attribute Interceptor ........ SUCCESS [1.950s]
[INFO] ApacheDS Referral Interceptor ..................... SUCCESS [1.380s]
[INFO] ApacheDS Schema Interceptor ....................... SUCCESS [7.667s]
[INFO] ApacheDS Subtree Interceptor ...................... SUCCESS [9.786s]
[INFO] ApacheDS Triggers Interceptor ..................... SUCCESS [1.892s]
[INFO] ApacheDS Core ..................................... SUCCESS [5.451s]
[INFO] ApacheDS Core AVL ................................. SUCCESS [10.340s]
[INFO] ApacheDS Generalized (X) DBM Partition ............ SUCCESS [19.393s]
[INFO] ApacheDS LDIF Partition ........................... SUCCESS [14.974s]
[INFO] ApacheDS JDBM Partition ........................... SUCCESS [38.542s]
[INFO] ApacheDS Core Annotations ......................... SUCCESS [58.116s]
[INFO] ApacheDS Core JNDI ................................ SUCCESS [3.947s]
[INFO] ApacheDS Protocol Kerberos Codec .................. SUCCESS [18.063s]
[INFO] ApacheDS Interceptors for Kerberos ................ SUCCESS [1.913s]
[INFO] ApacheDS Protocol Dhcp ............................ SUCCESS [3.232s]
[INFO] ApacheDS Protocol Shared .......................... SUCCESS [2.504s]
[INFO] ApacheDS Protocol Dns ............................. SUCCESS [7.097s]
[INFO] ApacheDS Protocol Kerberos ........................ SUCCESS [5.475s]
[INFO] ApacheDS Protocol Ldap ............................ SUCCESS [1:08.818s]
[INFO] ApacheDS Protocol Ntp ............................. SUCCESS [20.202s]
[INFO] Apacheds Server Annotations ....................... SUCCESS [54.201s]
[INFO] ApacheDS Server Config ............................ SUCCESS [28.952s]
[INFO] ApacheDS Server JNDI .............................. SUCCESS [2.848s]
[INFO] ApacheDS Test Framework ........................... SUCCESS [1:57.069s]
[INFO] ApacheDS All ...................................... SUCCESS [7.756s]
[INFO] ApacheDS Logger Interceptor ....................... SUCCESS [3.646s]
[INFO] ApacheDS Password Hashing Interceptor ............. SUCCESS [2.497s]
[INFO] ApacheDS Core Integration ......................... SUCCESS [31:52.563s]
[INFO] ApacheDS Server Integration ....................... FAILURE [30:34.669s]
[INFO] ApacheDS DirectoryService-WebApp bridge ........... SKIPPED
[INFO] ApacheDS Jetty HTTP Server Integration ............ SKIPPED
[INFO] ApacheDS Service Builder .......................... SKIPPED
[INFO] ApacheDS Protocol Kerberos Test ................... SKIPPED
[INFO] Apache Directory LDAP Client API test ............. SKIPPED
[INFO] kerberos-client ................................... SKIPPED
[INFO] ApacheDS Service .................................. SKIPPED
[INFO] ApacheDS Wrapper .................................. SKIPPED
[INFO] ApacheDS Installers Maven Plugin .................. SKIPPED
[INFO] ApacheDS Installers ............................... SKIPPED
[INFO] ------------------------------------------------------------------------
[INFO] BUILD FAILURE
[INFO] ------------------------------------------------------------------------
[INFO] Total time: 1:12:12.056s
[INFO] Finished at: Tue May 07 06:14:36 BST 2013
[INFO] Final Memory: 53M/301M
[INFO] ------------------------------------------------------------------------
[JENKINS] Archiving disabled
[JENKINS] Archiving disabled
[JENKINS] Archiving disabled
[JENKINS] Archiving disabled
[JENKINS] Archiving disabled
[JENKINS] Archiving disabled
[JENKINS] Archiving disabled
[JENKINS] Archiving disabled
[JENKINS] Archiving disabled
[JENKINS] Archiving disabled
[JENKINS] Archiving disabled
[JENKINS] Archiving disabled
[JENKINS] Archiving disabled
[JENKINS] Archiving disabled
[JENKINS] Archiving disabled
[JENKINS] Archiving disabled
[JENKINS] Archiving disabled
[JENKINS] Archiving disabled
[JENKINS] Archiving disabled
[JENKINS] Archiving disabled
[JENKINS] Archiving disabled
[JENKINS] Archiving disabled
[JENKINS] Archiving disabled
[JENKINS] Archiving disabled
[JENKINS] Archiving disabled
[JENKINS] Archiving disabled
[JENKINS] Archiving disabled
[JENKINS] Archiving disabled
[JENKINS] Archiving disabled
[JENKINS] Archiving disabled
[JENKINS] Archiving disabled
[JENKINS] Archiving disabled
[JENKINS] Archiving disabled
[JENKINS] Archiving disabled
[JENKINS] Archiving disabled
[JENKINS] Archiving disabled
[JENKINS] Archiving disabled
[JENKINS] Archiving disabled
[JENKINS] Archiving disabled
[JENKINS] Archiving disabled
[JENKINS] Archiving disabled
[JENKINS] Archiving disabled
[JENKINS] Archiving disabled
[JENKINS] Archiving disabled
[JENKINS] Archiving disabled
[JENKINS] Archiving disabled
[JENKINS] Archiving disabled
[JENKINS] Archiving disabled
[JENKINS] Archiving disabled
[JENKINS] Archiving disabled
[JENKINS] Archiving disabled
[JENKINS] Archiving disabled
[JENKINS] Archiving disabled
[JENKINS] Archiving disabled
Waiting for Jenkins to finish collecting data
mavenExecutionResult exceptions not empty
message : Failed to execute goal org.apache.maven.plugins:maven-surefire-plugin:2.12.2:test
(default-test) on project apacheds-server-integ: Failure or timeout
cause : Failure or timeout
Stack trace : 
org.apache.maven.lifecycle.LifecycleExecutionException: Failed to execute goal org.apache.maven.plugins:maven-surefire-plugin:2.12.2:test
(default-test) on project apacheds-server-integ: Failure or timeout
	at org.apache.maven.lifecycle.internal.MojoExecutor.execute(MojoExecutor.java:217)
	at org.apache.maven.lifecycle.internal.MojoExecutor.execute(MojoExecutor.java:153)
	at org.apache.maven.lifecycle.internal.MojoExecutor.execute(MojoExecutor.java:145)
	at org.apache.maven.lifecycle.internal.LifecycleModuleBuilder.buildProject(LifecycleModuleBuilder.java:84)
	at org.apache.maven.lifecycle.internal.LifecycleModuleBuilder.buildProject(LifecycleModuleBuilder.java:59)
	at org.apache.maven.lifecycle.internal.LifecycleStarter.singleThreadedBuild(LifecycleStarter.java:183)
	at org.apache.maven.lifecycle.internal.LifecycleStarter.execute(LifecycleStarter.java:161)
	at org.apache.maven.DefaultMaven.doExecute(DefaultMaven.java:319)
	at org.apache.maven.DefaultMaven.execute(DefaultMaven.java:156)
	at org.jvnet.hudson.maven3.launcher.Maven3Launcher.main(Maven3Launcher.java:79)
	at sun.reflect.NativeMethodAccessorImpl.invoke0(Native Method)
	at sun.reflect.NativeMethodAccessorImpl.invoke(NativeMethodAccessorImpl.java:39)
	at sun.reflect.DelegatingMethodAccessorImpl.invoke(DelegatingMethodAccessorImpl.java:25)
	at java.lang.reflect.Method.invoke(Method.java:597)
	at org.codehaus.plexus.classworlds.launcher.Launcher.launchStandard(Launcher.java:329)
	at org.codehaus.plexus.classworlds.launcher.Launcher.launch(Launcher.java:239)
	at org.jvnet.hudson.maven3.agent.Maven3Main.launch(Maven3Main.java:158)
	at hudson.maven.Maven3Builder.call(Maven3Builder.java:100)
	at hudson.maven.Maven3Builder.call(Maven3Builder.java:66)
	at hudson.remoting.UserRequest.perform(UserRequest.java:118)
	at hudson.remoting.UserRequest.perform(UserRequest.java:48)
	at hudson.remoting.Request$2.run(Request.java:326)
	at hudson.remoting.InterceptingExecutorService$1.call(InterceptingExecutorService.java:72)
	at java.util.concurrent.FutureTask$Sync.innerRun(FutureTask.java:303)
	at java.util.concurrent.FutureTask.run(FutureTask.java:138)
	at java.util.concurrent.ThreadPoolExecutor$Worker.runTask(ThreadPoolExecutor.java:886)
	at java.util.concurrent.ThreadPoolExecutor$Worker.run(ThreadPoolExecutor.java:908)
	at java.lang.Thread.run(Thread.java:662)
Caused by: org.apache.maven.plugin.MojoExecutionException: Failure or timeout
	at org.apache.maven.plugin.surefire.SurefirePlugin.assertNoFailureOrTimeout(SurefirePlugin.java:177)
	at org.apache.maven.plugin.surefire.SurefirePlugin.handleSummary(SurefirePlugin.java:158)
	at org.apache.maven.plugin.surefire.AbstractSurefireMojo.executeAfterPreconditionsChecked(AbstractSurefireMojo.java:626)
	at org.apache.maven.plugin.surefire.AbstractSurefireMojo.execute(AbstractSurefireMojo.java:587)
	at org.apache.maven.plugin.DefaultBuildPluginManager.executeMojo(DefaultBuildPluginManager.java:107)
	at org.apache.maven.lifecycle.internal.MojoExecutor.execute(MojoExecutor.java:209)
	... 27 more
Maven failed with error.
Sending e-mails to: notifications@directory.apache.org
Sending e-mails to: notifications@directory.apache.org
channel stopped
Process leaked file descriptors. See http://wiki.jenkins-ci.org/display/JENKINS/Spawning+processes+from+build
for more information

Mime
View raw message