directory-notifications mailing list archives

Site index · List index
Message view « Date » · « Thread »
Top « Date » · « Thread »
From Apache Jenkins Server <jenk...@builds.apache.org>
Subject Build failed in Jenkins: dir-apacheds-jdk16-win » ApacheDS Server Integration #387
Date Fri, 10 May 2013 05:14:24 GMT
See <https://builds.apache.org/job/dir-apacheds-jdk16-win/org.apache.directory.server$apacheds-server-integ/387/>

------------------------------------------
[...truncated 50 lines...]

-------------------------------------------------------
 T E S T S
-------------------------------------------------------
Running org.apache.directory.dsml.engine.Dsmlv2EngineIT
Tests run: 2, Failures: 0, Errors: 0, Skipped: 0, Time elapsed: 11.38 sec
Running org.apache.directory.IndexIT
Tests run: 2, Failures: 0, Errors: 0, Skipped: 1, Time elapsed: 1.681 sec
Running org.apache.directory.server.admin.AdministrativePointAddIT
Tests run: 2, Failures: 0, Errors: 0, Skipped: 0, Time elapsed: 17.922 sec
Running org.apache.directory.server.admin.AdministrativePointModifyDelIT
Tests run: 3, Failures: 0, Errors: 0, Skipped: 1, Time elapsed: 12.71 sec
Running org.apache.directory.server.admin.AdministrativePointModifyIT
Tests run: 1, Failures: 0, Errors: 0, Skipped: 0, Time elapsed: 11.739 sec
Running org.apache.directory.server.admin.AdministrativePointPersistentIT
Tests run: 1, Failures: 0, Errors: 0, Skipped: 0, Time elapsed: 10.265 sec
Running org.apache.directory.server.kerberos.KeyDerivationServiceIT
Tests run: 4, Failures: 0, Errors: 0, Skipped: 0, Time elapsed: 16.974 sec
Running org.apache.directory.server.kerberos.PasswordPolicyServiceIT
Tests run: 1, Failures: 0, Errors: 0, Skipped: 1, Time elapsed: 0.001 sec
Running org.apache.directory.server.operations.add.AddAliasIT
Tests run: 3, Failures: 0, Errors: 0, Skipped: 0, Time elapsed: 12.433 sec
Running org.apache.directory.server.operations.add.AddingEntriesWithSpecialCharactersInRDNIT
Tests run: 9, Failures: 0, Errors: 0, Skipped: 0, Time elapsed: 19.819 sec
Running org.apache.directory.server.operations.add.AddIT
Tests run: 31, Failures: 0, Errors: 0, Skipped: 0, Time elapsed: 39.95 sec
Running org.apache.directory.server.operations.bind.BindIT
Tests run: 5, Failures: 0, Errors: 0, Skipped: 0, Time elapsed: 14.175 sec
Running org.apache.directory.server.operations.bind.DelegatedAuthIT
Tests run: 2, Failures: 0, Errors: 0, Skipped: 0, Time elapsed: 24.311 sec
Running org.apache.directory.server.operations.bind.MiscBindIT
Tests run: 6, Failures: 0, Errors: 0, Skipped: 0, Time elapsed: 15.287 sec
Running org.apache.directory.server.operations.bind.SaslBindIT
		No encryption was performed by peer.
		No encryption was performed by peer.
Tests run: 17, Failures: 0, Errors: 0, Skipped: 4, Time elapsed: 31.304 sec
Running org.apache.directory.server.operations.bind.SimpleBindIT
Tests run: 10, Failures: 0, Errors: 0, Skipped: 0, Time elapsed: 18.583 sec
Running org.apache.directory.server.operations.compare.CompareIT
Tests run: 7, Failures: 0, Errors: 0, Skipped: 0, Time elapsed: 16.248 sec
Running org.apache.directory.server.operations.compare.MatchingRuleCompareIT
Tests run: 2, Failures: 0, Errors: 0, Skipped: 0, Time elapsed: 10.752 sec
Running org.apache.directory.server.operations.delete.DeleteAliasIT
Tests run: 2, Failures: 0, Errors: 0, Skipped: 0, Time elapsed: 12.433 sec
Running org.apache.directory.server.operations.delete.DeleteIT
Tests run: 8, Failures: 0, Errors: 0, Skipped: 0, Time elapsed: 18.208 sec
Running org.apache.directory.server.operations.extended.ExtendedIT
Tests run: 1, Failures: 0, Errors: 0, Skipped: 0, Time elapsed: 9.474 sec
Running org.apache.directory.server.operations.extended.PwdModifyIT
Tests run: 4, Failures: 0, Errors: 0, Skipped: 0, Time elapsed: 14.58 sec
Running org.apache.directory.server.operations.extended.StoredProcedureIT
Tests run: 2, Failures: 0, Errors: 0, Skipped: 2, Time elapsed: 7.932 sec
Running org.apache.directory.server.operations.ldapsdk.AddIT
Tests run: 30, Failures: 0, Errors: 0, Skipped: 0, Time elapsed: 71.481 sec
Running org.apache.directory.server.operations.ldapsdk.BindIT
Tests run: 5, Failures: 0, Errors: 0, Skipped: 0, Time elapsed: 15.117 sec
Running org.apache.directory.server.operations.ldapsdk.CompareIT
Tests run: 7, Failures: 0, Errors: 0, Skipped: 0, Time elapsed: 16.517 sec
Running org.apache.directory.server.operations.ldapsdk.DeleteIT
Tests run: 8, Failures: 0, Errors: 0, Skipped: 0, Time elapsed: 20.85 sec
Running org.apache.directory.server.operations.ldapsdk.IllegalModificationIT
Tests run: 2, Failures: 0, Errors: 0, Skipped: 0, Time elapsed: 8.544 sec
Running org.apache.directory.server.operations.ldapsdk.ModifyDnReferralIT
Tests run: 7, Failures: 0, Errors: 0, Skipped: 0, Time elapsed: 16.286 sec
Running org.apache.directory.server.operations.ldapsdk.ModifyReferralIT
Tests run: 4, Failures: 0, Errors: 0, Skipped: 0, Time elapsed: 15.886 sec
Running org.apache.directory.server.operations.lookup.LookupIT
Tests run: 3, Failures: 0, Errors: 0, Skipped: 0, Time elapsed: 11.402 sec
Running org.apache.directory.server.operations.modify.IllegalModificationIT
Tests run: 2, Failures: 0, Errors: 0, Skipped: 0, Time elapsed: 11.571 sec
Running org.apache.directory.server.operations.modify.ModifyAddIT
Tests run: 16, Failures: 0, Errors: 0, Skipped: 0, Time elapsed: 28.66 sec
Running org.apache.directory.server.operations.modify.ModifyMultipleChangesIT
Tests run: 2, Failures: 0, Errors: 0, Skipped: 0, Time elapsed: 12.643 sec
Running org.apache.directory.server.operations.modify.ModifyReferralIT
Tests run: 4, Failures: 0, Errors: 0, Skipped: 0, Time elapsed: 13.224 sec
Running org.apache.directory.server.operations.modify.ModifyRemoveIT
Tests run: 16, Failures: 0, Errors: 0, Skipped: 0, Time elapsed: 27.062 sec
Running org.apache.directory.server.operations.modify.ModifyReplaceIT
Tests run: 7, Failures: 0, Errors: 0, Skipped: 0, Time elapsed: 15.133 sec
Running org.apache.directory.server.operations.modifydn.ModifyDnReferralIT
Tests run: 7, Failures: 0, Errors: 0, Skipped: 0, Time elapsed: 15.756 sec
Running org.apache.directory.server.operations.modifydn.ModifyRdnIT
Tests run: 19, Failures: 0, Errors: 0, Skipped: 2, Time elapsed: 25.074 sec
Running org.apache.directory.server.operations.modifydn.MoveIT
Tests run: 4, Failures: 0, Errors: 0, Skipped: 0, Time elapsed: 12.128 sec
Running org.apache.directory.server.operations.search.IndexedNegationSearchIT
Tests run: 3, Failures: 0, Errors: 0, Skipped: 0, Time elapsed: 11.95 sec
Running org.apache.directory.server.operations.search.NegationSearchIT
Tests run: 2, Failures: 0, Errors: 0, Skipped: 0, Time elapsed: 9.879 sec
Running org.apache.directory.server.operations.search.PagedSearchIT
Tests run: 37, Failures: 0, Errors: 0, Skipped: 0, Time elapsed: 45.973 sec
Running org.apache.directory.server.operations.search.PersistentSearchIT
Tests run: 9, Failures: 0, Errors: 0, Skipped: 0, Time elapsed: 20.538 sec
Running org.apache.directory.server.operations.search.ReferralSearchIT
Tests run: 7, Failures: 0, Errors: 0, Skipped: 0, Time elapsed: 19.541 sec
Running org.apache.directory.server.operations.search.ReferralSearchMoveAndRenameIT
Tests run: 1, Failures: 0, Errors: 0, Skipped: 0, Time elapsed: 11.555 sec
Running org.apache.directory.server.operations.search.ReferralSearchNoRevertIT
Tests run: 1, Failures: 0, Errors: 0, Skipped: 0, Time elapsed: 11.407 sec
Running org.apache.directory.server.operations.search.SchemaSearchIT
Tests run: 5, Failures: 0, Errors: 0, Skipped: 0, Time elapsed: 12.347 sec
Running org.apache.directory.server.operations.search.SearchIT
Tests run: 41, Failures: 0, Errors: 0, Skipped: 1, Time elapsed: 746.54 sec
Running org.apache.directory.server.operations.search.SearchLimitsIT
Tests run: 15, Failures: 0, Errors: 0, Skipped: 0, Time elapsed: 30.655 sec
Running org.apache.directory.server.ppolicy.PasswordPolicyIT
pwdFailureTime: 20130510051038.562Z

pwdFailureTime: 20130510051038.562Z
pwdFailureTime: 20130510051039.752Z

pwdFailureTime: 20130510051039.752Z
pwdFailureTime: 20130510051041.047Z

pwdFailureTime: 20130510051041.047Z
pwdFailureTime: 20130510051042.596Z

Tests run: 19, Failures: 0, Errors: 0, Skipped: 1, Time elapsed: 89.326 sec
Running org.apache.directory.server.replication.ClientInitialRefreshIT

---> Running testInitialRefreshLoadAndAdd

NbAdded every 100ms : 
0, 0, 11
NbAdded every 100ms : 
1
<-- Done

---> Running testInitialRefreshStopAndGo

Completed so far : 
(consumer1 completed) 

NbAdded every 100ms : 
0, 10
<-- Done

--->Running testInitialRefresh4Consumers

Completed so far : 
(consumer1 completed) 
(consumer4 completed) 
(consumer3 completed) 
(consumer2 completed) 

<-- Done

---> Running testInitialRefreshLoad

NbAdded every 100ms : 
0, 0, 0, 11
<-- Done
Tests run: 4, Failures: 0, Errors: 0, Skipped: 0, Time elapsed: 29.266 sec
Running org.apache.directory.server.replication.ClientServerReplicationIT
------------------------------------- Stop consumer
------------------------------------- Start consumer
------------------------------------- Stop consumer
------------------------------------- Start consumer
------------------------------------- Stop consumer
------------------------------------- Start consumer
------------------------------------- Stop consumer
------------------------------------- Start consumer
------------------------------------- Stop consumer
------------------------------------- Start consumer
------------------------------------- Stop consumer
------------------------------------- Start consumer
------------------------------------- Stop consumer
------------------------------------- Start consumer
------------------------------------- Stop consumer
------------------------------------- Start consumer
------------------------------------- Stop consumer
------------------------------------- Start consumer
------------------------------------- Stop consumer
------------------------------------- Start consumer
>--------------------------------------- Adding Entry
    dn[n]: cn=user14,dc=example,dc=com
    objectclass: person
    cn: user14
    sn: user14

>--------------------------------------- Added 
>--------------------------------------- Modifying MessageType : MODIFY_REQUEST
Message ID : -1
    Modify Request
        Object : 'cn=user14,dc=example,dc=com'
            Modification[0]
                Operation :  add
                Modification
userPassword: secret
org.apache.directory.api.ldap.model.message.ModifyRequestImpl@ba3b521a
>--------------------------------------- Modified 
org.apache.directory.api.ldap.model.exception.LdapOperationErrorException: ERR_538 RecordManager
has been closed
	at org.apache.directory.server.core.partition.impl.btree.AbstractBTreePartition.modify(AbstractBTreePartition.java:1170)
	at org.apache.directory.server.core.shared.partition.DefaultPartitionNexus.sync(DefaultPartitionNexus.java:335)
	at org.apache.directory.server.core.DefaultDirectoryService.shutdown(DefaultDirectoryService.java:1325)
	at org.apache.directory.server.replication.ClientServerReplicationIT.tearDown(ClientServerReplicationIT.java:113)
	at sun.reflect.NativeMethodAccessorImpl.invoke0(Native Method)
	at sun.reflect.NativeMethodAccessorImpl.invoke(NativeMethodAccessorImpl.java:39)
	at sun.reflect.DelegatingMethodAccessorImpl.invoke(DelegatingMethodAccessorImpl.java:25)
	at java.lang.reflect.Method.invoke(Method.java:597)
	at org.junit.runners.model.FrameworkMethod$1.runReflectiveCall(FrameworkMethod.java:47)
	at org.junit.internal.runners.model.ReflectiveCallable.run(ReflectiveCallable.java:12)
	at org.junit.runners.model.FrameworkMethod.invokeExplosively(FrameworkMethod.java:44)
	at org.junit.internal.runners.statements.RunAfters.evaluate(RunAfters.java:33)
	at org.junit.runners.ParentRunner.run(ParentRunner.java:309)
	at org.apache.maven.surefire.junit4.JUnit4Provider.execute(JUnit4Provider.java:252)
	at org.apache.maven.surefire.junit4.JUnit4Provider.executeTestSet(JUnit4Provider.java:141)
	at org.apache.maven.surefire.junit4.JUnit4Provider.invoke(JUnit4Provider.java:112)
	at sun.reflect.NativeMethodAccessorImpl.invoke0(Native Method)
	at sun.reflect.NativeMethodAccessorImpl.invoke(NativeMethodAccessorImpl.java:39)
	at sun.reflect.DelegatingMethodAccessorImpl.invoke(DelegatingMethodAccessorImpl.java:25)
	at java.lang.reflect.Method.invoke(Method.java:597)
	at org.apache.maven.surefire.util.ReflectionUtils.invokeMethodWithArray(ReflectionUtils.java:189)
	at org.apache.maven.surefire.booter.ProviderFactory$ProviderProxy.invoke(ProviderFactory.java:165)
	at org.apache.maven.surefire.booter.ProviderFactory.invokeProvider(ProviderFactory.java:85)
	at org.apache.maven.surefire.booter.ForkedBooter.runSuitesInProcess(ForkedBooter.java:113)
	at org.apache.maven.surefire.booter.ForkedBooter.main(ForkedBooter.java:75)
Caused by: org.apache.directory.api.ldap.model.exception.LdapException: ERR_538 RecordManager
has been closed
	at org.apache.directory.server.core.partition.impl.btree.AbstractBTreePartition.getEntryId(AbstractBTreePartition.java:2203)
	at org.apache.directory.server.core.partition.impl.btree.AbstractBTreePartition.modify(AbstractBTreePartition.java:1180)
	at org.apache.directory.server.core.partition.impl.btree.AbstractBTreePartition.modify(AbstractBTreePartition.java:1160)
	... 24 more
Caused by: java.lang.IllegalStateException: ERR_538 RecordManager has been closed
	at jdbm.recman.CacheRecordManager.checkIfClosed(CacheRecordManager.java:399)
	at jdbm.recman.CacheRecordManager.fetch(CacheRecordManager.java:257)
	at jdbm.btree.BTree.getRoot(BTree.java:552)
	at jdbm.btree.BTree.find(BTree.java:405)
	at org.apache.directory.server.core.partition.impl.btree.jdbm.JdbmTable.get(JdbmTable.java:325)
	at org.apache.directory.server.core.partition.impl.btree.jdbm.JdbmIndex.forwardLookup(JdbmIndex.java:353)
	at org.apache.directory.server.core.partition.impl.btree.jdbm.JdbmIndex.forwardLookup(JdbmIndex.java:59)
	at org.apache.directory.server.core.partition.impl.btree.AbstractBTreePartition.getEntryId(AbstractBTreePartition.java:2185)
	... 26 more
Tests run: 6, Failures: 0, Errors: 1, Skipped: 1, Time elapsed: 63.045 sec <<< FAILURE!
Running org.apache.directory.server.replication.StaleEventLogDetectionIT
Tests run: 2, Failures: 0, Errors: 2, Skipped: 0, Time elapsed: 4.314 sec <<< FAILURE!
Running org.apache.directory.server.schema.SchemaIT

Results :

Tests in error: 
  org.apache.directory.server.replication.ClientServerReplicationIT: ERR_265 Grouping many
exceptions on root nexus sync()
  org.apache.directory.server.replication.StaleEventLogDetectionIT: the working directory
C:\Users\hudson\AppData\Local\Temp\server-work-provider-replication\run has been locked by
another directory service.
  org.apache.directory.server.replication.StaleEventLogDetectionIT

Tests run: 420, Failures: 0, Errors: 3, Skipped: 14

[WARNING] Could not delete temp direcotry F:\hudson\hudson-slave\workspace\dir-apacheds-jdk16-win\trunk\server-integ\target\surefire
because File F:\hudson\hudson-slave\workspace\dir-apacheds-jdk16-win\trunk\server-integ\target\surefire\surefirebooter8288260608782494036.jar
unable to be deleted.
[JENKINS] Recording test results

Mime
View raw message