directory-notifications mailing list archives

Site index · List index
Message view « Date » · « Thread »
Top « Date » · « Thread »
From Apache Jenkins Server <jenk...@builds.apache.org>
Subject Build failed in Jenkins: dir-apacheds-jdk16-win #386
Date Thu, 09 May 2013 04:05:16 GMT
See <https://builds.apache.org/job/dir-apacheds-jdk16-win/386/changes>

Changes:

[elecharny] Referenced the SNAPSHOT for API

[elecharny] Fixed the log4k.properties file

[elecharny] o Added a logger for operation time 
o Added a dedicated logger for codec
o Fixed the dedicated loggers
o Fixed some log4j.properties files
o Added the dump of encoded requests in codec, using the CODEC_LOG dedicated logger

------------------------------------------
[...truncated 1197 lines...]
[INFO] 
[INFO] --- maven-clean-plugin:2.4.1:clean (default-clean) @ apacheds-interceptors-trigger
---
[INFO] Deleting F:\hudson\hudson-slave\workspace\dir-apacheds-jdk16-win\trunk\interceptors\trigger\target
[INFO] 
[INFO] --- maven-remote-resources-plugin:1.2.1:process (default) @ apacheds-interceptors-trigger
---
[INFO] [debug] execute contextualize
[INFO] Using 'UTF-8' encoding to copy filtered resources.

[INFO] skip non existing resourceDirectory F:\hudson\hudson-slave\workspace\dir-apacheds-jdk16-win\trunk\interceptors\trigger\src\main\resources
[INFO] --- maven-resources-plugin:2.5:resources (default-resources) @ apacheds-interceptors-trigger
---
[INFO] Copying 3 resources
[INFO] 
[INFO] --- maven-compiler-plugin:2.5.1:compile (default-compile) @ apacheds-interceptors-trigger
---
[INFO] Compiling 10 source files to F:\hudson\hudson-slave\workspace\dir-apacheds-jdk16-win\trunk\interceptors\trigger\target\classes
[INFO] [debug] execute contextualize
[INFO] Using 'UTF-8' encoding to copy filtered resources.
[INFO] skip non existing resourceDirectory F:\hudson\hudson-slave\workspace\dir-apacheds-jdk16-win\trunk\interceptors\trigger\src\test\resources

[INFO] --- maven-resources-plugin:2.5:testResources (default-testResources) @ apacheds-interceptors-trigger
---
[INFO] Copying 3 resources
[INFO] 
[INFO] --- maven-compiler-plugin:2.5.1:testCompile (default-testCompile) @ apacheds-interceptors-trigger
---
[INFO] Nothing to compile - all classes are up to date
[INFO] 
[INFO] --- maven-surefire-plugin:2.12.2:test (default-test) @ apacheds-interceptors-trigger
---
[JENKINS] Recording test results
[INFO] 
[INFO] --- maven-bundle-plugin:2.3.7:bundle (default-bundle) @ apacheds-interceptors-trigger
---
[INFO] 
[INFO] --- maven-site-plugin:3.1:attach-descriptor (attach-descriptor) @ apacheds-interceptors-trigger
---
[INFO] Checking legal files in: apacheds-interceptors-trigger-2.0.0-M13-SNAPSHOT.jar
[INFO] 
[INFO] --- tools-maven-plugin:1.4:verify-legal-files (verify-legal-files) @ apacheds-interceptors-trigger
---
May 9, 2013 5:04:00 AM hudson.maven.ExecutedMojo <init>
WARNING: Failed to getClass for org.apache.maven.plugin.source.SourceJarMojo
[INFO] Building jar: F:\hudson\hudson-slave\workspace\dir-apacheds-jdk16-win\trunk\interceptors\trigger\target\apacheds-interceptors-trigger-2.0.0-M13-SNAPSHOT-sources.jar
[INFO] 
[INFO] --- maven-source-plugin:2.2:jar (attach-sources) @ apacheds-interceptors-trigger ---
[INFO] Installing F:\hudson\hudson-slave\workspace\dir-apacheds-jdk16-win\trunk\interceptors\trigger\target\apacheds-interceptors-trigger-2.0.0-M13-SNAPSHOT.jar
to f:\hudson\hudson-slave\maven-repositories\0\org\apache\directory\server\apacheds-interceptors-trigger\2.0.0-M13-SNAPSHOT\apacheds-interceptors-trigger-2.0.0-M13-SNAPSHOT.jar
[INFO] 
[INFO] --- maven-install-plugin:2.3.1:install (default-install) @ apacheds-interceptors-trigger
---
[INFO] Installing F:\hudson\hudson-slave\workspace\dir-apacheds-jdk16-win\trunk\interceptors\trigger\pom.xml
to f:\hudson\hudson-slave\maven-repositories\0\org\apache\directory\server\apacheds-interceptors-trigger\2.0.0-M13-SNAPSHOT\apacheds-interceptors-trigger-2.0.0-M13-SNAPSHOT.pom
[INFO] Installing F:\hudson\hudson-slave\workspace\dir-apacheds-jdk16-win\trunk\interceptors\trigger\target\apacheds-interceptors-trigger-2.0.0-M13-SNAPSHOT-sources.jar
to f:\hudson\hudson-slave\maven-repositories\0\org\apache\directory\server\apacheds-interceptors-trigger\2.0.0-M13-SNAPSHOT\apacheds-interceptors-trigger-2.0.0-M13-SNAPSHOT-sources.jar
[INFO] 
[INFO] --- maven-bundle-plugin:2.3.7:install (default-install) @ apacheds-interceptors-trigger
---
[INFO] Installing org/apache/directory/server/apacheds-interceptors-trigger/2.0.0-M13-SNAPSHOT/apacheds-interceptors-trigger-2.0.0-M13-SNAPSHOT.jar
[INFO] Writing OBR metadata
[INFO]                                                                         
[INFO] ------------------------------------------------------------------------
[INFO] Building ApacheDS Core 2.0.0-M13-SNAPSHOT
[INFO] ------------------------------------------------------------------------
[INFO] [INFO] Deleting F:\hudson\hudson-slave\workspace\dir-apacheds-jdk16-win\trunk\core\target

[INFO] --- maven-clean-plugin:2.4.1:clean (default-clean) @ apacheds-core ---
[INFO] 
[INFO] --- maven-remote-resources-plugin:1.2.1:process (default) @ apacheds-core ---
[INFO] [debug] execute contextualize

[INFO] --- maven-resources-plugin:2.5:resources (default-resources) @ apacheds-core ---
[INFO] Using 'UTF-8' encoding to copy filtered resources.
[INFO] Copying 0 resource
[INFO] Copying 3 resources
[INFO] 
[INFO] --- maven-compiler-plugin:2.5.1:compile (default-compile) @ apacheds-core ---
[INFO] Compiling 9 source files to F:\hudson\hudson-slave\workspace\dir-apacheds-jdk16-win\trunk\core\target\classes
[INFO] -------------------------------------------------------------
[ERROR] COMPILATION ERROR : 
[INFO] -------------------------------------------------------------
[ERROR] F:\hudson\hudson-slave\workspace\dir-apacheds-jdk16-win\trunk\core\src\main\java\org\apache\directory\server\core\DefaultOperationManager.java:[78,80]
cannot find symbol
symbol  : variable OPERATION_LOG
location: class org.apache.directory.api.ldap.model.constants.Loggers
[INFO] 1 error
[INFO] -------------------------------------------------------------
[INFO] ------------------------------------------------------------------------
[INFO] Reactor Summary:
[INFO] 
[INFO] ApacheDS .......................................... SUCCESS [5.634s]
[INFO] ApacheDS I18n ..................................... SUCCESS [5.785s]
[INFO] ApacheDS Core Constants ........................... SUCCESS [2.153s]
[INFO] ApacheDS Core API ................................. SUCCESS [23.020s]
[INFO] ApacheDS Core Shared .............................. SUCCESS [2.810s]
[INFO] ApacheDS Interceptors ............................. SUCCESS [0.104s]
[INFO] ApacheDS AdministrativePoint Interceptor .......... SUCCESS [2.203s]
[INFO] ApacheDS Authentication Interceptor ............... SUCCESS [4.339s]
[INFO] ApacheDS Authorization Interceptor ................ SUCCESS [5.983s]
[INFO] ApacheDS ChangeLog Interceptor .................... SUCCESS [3.591s]
[INFO] ApacheDS Collective Attribute Interceptor ......... SUCCESS [1.479s]
[INFO] ApacheDS Event Interceptor ........................ SUCCESS [1.809s]
[INFO] ApacheDS Exception Interceptor .................... SUCCESS [1.400s]
[INFO] ApacheDS Journal Interceptor ...................... SUCCESS [1.611s]
[INFO] ApacheDS Normalization Interceptor ................ SUCCESS [3.298s]
[INFO] ApacheDS Operational Attribute Interceptor ........ SUCCESS [1.581s]
[INFO] ApacheDS Referral Interceptor ..................... SUCCESS [1.430s]
[INFO] ApacheDS Schema Interceptor ....................... SUCCESS [7.106s]
[INFO] ApacheDS Subtree Interceptor ...................... SUCCESS [8.790s]
[INFO] ApacheDS Triggers Interceptor ..................... SUCCESS [2.077s]
[INFO] ApacheDS Core ..................................... FAILURE [1.699s]
[INFO] ApacheDS Core AVL ................................. SKIPPED
[INFO] ApacheDS Generalized (X) DBM Partition ............ SKIPPED
[INFO] ApacheDS LDIF Partition ........................... SKIPPED
[INFO] ApacheDS JDBM Partition ........................... SKIPPED
[INFO] ApacheDS Core Annotations ......................... SKIPPED
[INFO] ApacheDS Core JNDI ................................ SKIPPED
[INFO] ApacheDS Protocol Kerberos Codec .................. SKIPPED
[INFO] ApacheDS Interceptors for Kerberos ................ SKIPPED
[INFO] ApacheDS Protocol Dhcp ............................ SKIPPED
[INFO] ApacheDS Protocol Shared .......................... SKIPPED
[INFO] ApacheDS Protocol Dns ............................. SKIPPED
[INFO] ApacheDS Protocol Kerberos ........................ SKIPPED
[INFO] ApacheDS Protocol Ldap ............................ SKIPPED
[INFO] ApacheDS Protocol Ntp ............................. SKIPPED
[INFO] Apacheds Server Annotations ....................... SKIPPED
[INFO] ApacheDS Server Config ............................ SKIPPED
[INFO] ApacheDS Server JNDI .............................. SKIPPED
[INFO] ApacheDS Test Framework ........................... SKIPPED
[INFO] ApacheDS All ...................................... SKIPPED
[INFO] ApacheDS Logger Interceptor ....................... SKIPPED
[INFO] ApacheDS Password Hashing Interceptor ............. SKIPPED
[INFO] ApacheDS Core Integration ......................... SKIPPED
[INFO] ApacheDS Server Integration ....................... SKIPPED
[INFO] ApacheDS DirectoryService-WebApp bridge ........... SKIPPED
[INFO] ApacheDS Jetty HTTP Server Integration ............ SKIPPED
[INFO] ApacheDS Service Builder .......................... SKIPPED
[INFO] ApacheDS Protocol Kerberos Test ................... SKIPPED
[INFO] Apache Directory LDAP Client API test ............. SKIPPED
[INFO] kerberos-client ................................... SKIPPED
[INFO] ApacheDS Service .................................. SKIPPED
[INFO] ApacheDS Wrapper .................................. SKIPPED
[INFO] ApacheDS Installers Maven Plugin .................. SKIPPED
[INFO] ApacheDS Installers ............................... SKIPPED
[INFO] ------------------------------------------------------------------------
[INFO] BUILD FAILURE
[INFO] ------------------------------------------------------------------------
[INFO] Total time: 1:33.065s
[INFO] Finished at: Thu May 09 05:04:02 BST 2013
[INFO] Final Memory: 47M/227M
[INFO] ------------------------------------------------------------------------
[JENKINS] Archiving disabled
[JENKINS] Archiving disabled
[JENKINS] Archiving disabled
[JENKINS] Archiving disabled
[JENKINS] Archiving disabled
[JENKINS] Archiving disabled
[JENKINS] Archiving disabled
[JENKINS] Archiving disabled
[JENKINS] Archiving disabled
[JENKINS] Archiving disabled
[JENKINS] Archiving disabled
[JENKINS] Archiving disabled
[JENKINS] Archiving disabled
[JENKINS] Archiving disabled
[JENKINS] Archiving disabled
[JENKINS] Archiving disabled
[JENKINS] Archiving disabled
[JENKINS] Archiving disabled
[JENKINS] Archiving disabled
[JENKINS] Archiving disabled
[JENKINS] Archiving disabled
[JENKINS] Archiving disabled
[JENKINS] Archiving disabled
[JENKINS] Archiving disabled
[JENKINS] Archiving disabled
[JENKINS] Archiving disabled
[JENKINS] Archiving disabled
[JENKINS] Archiving disabled
[JENKINS] Archiving disabled
[JENKINS] Archiving disabled
[JENKINS] Archiving disabled
[JENKINS] Archiving disabled
[JENKINS] Archiving disabled
[JENKINS] Archiving disabled
[JENKINS] Archiving disabled
[JENKINS] Archiving disabled
[JENKINS] Archiving disabled
[JENKINS] Archiving disabled
[JENKINS] Archiving disabled
[JENKINS] Archiving disabled
[JENKINS] Archiving disabled
[JENKINS] Archiving disabled
[JENKINS] Archiving disabled
[JENKINS] Archiving disabled
[JENKINS] Archiving disabled
[JENKINS] Archiving disabled
[JENKINS] Archiving disabled
[JENKINS] Archiving disabled
[JENKINS] Archiving disabled
[JENKINS] Archiving disabled
[JENKINS] Archiving disabled
[JENKINS] Archiving disabled
[JENKINS] Archiving disabled
[JENKINS] Archiving disabled
Waiting for Jenkins to finish collecting data
mavenExecutionResult exceptions not empty
message : Failed to execute goal org.apache.maven.plugins:maven-compiler-plugin:2.5.1:compile
(default-compile) on project apacheds-core: Compilation failure
F:\hudson\hudson-slave\workspace\dir-apacheds-jdk16-win\trunk\core\src\main\java\org\apache\directory\server\core\DefaultOperationManager.java:[78,80]
cannot find symbol
symbol  : variable OPERATION_LOG
location: class org.apache.directory.api.ldap.model.constants.Loggers

cause : Compilation failure
F:\hudson\hudson-slave\workspace\dir-apacheds-jdk16-win\trunk\core\src\main\java\org\apache\directory\server\core\DefaultOperationManager.java:[78,80]
cannot find symbol
symbol  : variable OPERATION_LOG
location: class org.apache.directory.api.ldap.model.constants.Loggers

Stack trace : 
org.apache.maven.lifecycle.LifecycleExecutionException: Failed to execute goal org.apache.maven.plugins:maven-compiler-plugin:2.5.1:compile
(default-compile) on project apacheds-core: Compilation failure
F:\hudson\hudson-slave\workspace\dir-apacheds-jdk16-win\trunk\core\src\main\java\org\apache\directory\server\core\DefaultOperationManager.java:[78,80]
cannot find symbol
symbol  : variable OPERATION_LOG
location: class org.apache.directory.api.ldap.model.constants.Loggers

	at org.apache.maven.lifecycle.internal.MojoExecutor.execute(MojoExecutor.java:213)
	at org.apache.maven.lifecycle.internal.MojoExecutor.execute(MojoExecutor.java:153)
	at org.apache.maven.lifecycle.internal.MojoExecutor.execute(MojoExecutor.java:145)
	at org.apache.maven.lifecycle.internal.LifecycleModuleBuilder.buildProject(LifecycleModuleBuilder.java:84)
	at org.apache.maven.lifecycle.internal.LifecycleModuleBuilder.buildProject(LifecycleModuleBuilder.java:59)
	at org.apache.maven.lifecycle.internal.LifecycleStarter.singleThreadedBuild(LifecycleStarter.java:183)
	at org.apache.maven.lifecycle.internal.LifecycleStarter.execute(LifecycleStarter.java:161)
	at org.apache.maven.DefaultMaven.doExecute(DefaultMaven.java:319)
	at org.apache.maven.DefaultMaven.execute(DefaultMaven.java:156)
	at org.jvnet.hudson.maven3.launcher.Maven3Launcher.main(Maven3Launcher.java:79)
	at sun.reflect.NativeMethodAccessorImpl.invoke0(Native Method)
	at sun.reflect.NativeMethodAccessorImpl.invoke(NativeMethodAccessorImpl.java:39)
	at sun.reflect.DelegatingMethodAccessorImpl.invoke(DelegatingMethodAccessorImpl.java:25)
	at java.lang.reflect.Method.invoke(Method.java:597)
	at org.codehaus.plexus.classworlds.launcher.Launcher.launchStandard(Launcher.java:329)
	at org.codehaus.plexus.classworlds.launcher.Launcher.launch(Launcher.java:239)
	at org.jvnet.hudson.maven3.agent.Maven3Main.launch(Maven3Main.java:158)
	at hudson.maven.Maven3Builder.call(Maven3Builder.java:100)
	at hudson.maven.Maven3Builder.call(Maven3Builder.java:66)
	at hudson.remoting.UserRequest.perform(UserRequest.java:118)
	at hudson.remoting.UserRequest.perform(UserRequest.java:48)
	at hudson.remoting.Request$2.run(Request.java:326)
	at hudson.remoting.InterceptingExecutorService$1.call(InterceptingExecutorService.java:72)
	at java.util.concurrent.FutureTask$Sync.innerRun(FutureTask.java:303)
	at java.util.concurrent.FutureTask.run(FutureTask.java:138)
	at java.util.concurrent.ThreadPoolExecutor$Worker.runTask(ThreadPoolExecutor.java:886)
	at java.util.concurrent.ThreadPoolExecutor$Worker.run(ThreadPoolExecutor.java:908)
	at java.lang.Thread.run(Thread.java:662)
Caused by: org.apache.maven.plugin.CompilationFailureException: Compilation failure
F:\hudson\hudson-slave\workspace\dir-apacheds-jdk16-win\trunk\core\src\main\java\org\apache\directory\server\core\DefaultOperationManager.java:[78,80]
cannot find symbol
symbol  : variable OPERATION_LOG
location: class org.apache.directory.api.ldap.model.constants.Loggers

	at org.apache.maven.plugin.AbstractCompilerMojo.execute(AbstractCompilerMojo.java:729)
	at org.apache.maven.plugin.CompilerMojo.execute(CompilerMojo.java:128)
	at org.apache.maven.plugin.DefaultBuildPluginManager.executeMojo(DefaultBuildPluginManager.java:107)
	at org.apache.maven.lifecycle.internal.MojoExecutor.execute(MojoExecutor.java:209)
	... 27 more
Sending e-mails to: notifications@directory.apache.org
channel stopped

Mime
View raw message