directory-notifications mailing list archives

Site index · List index
Message view « Date » · « Thread »
Top « Date » · « Thread »
From Apache Jenkins Server <jenk...@builds.apache.org>
Subject Build failed in Jenkins: dir-apacheds-jdk16-win #396
Date Sat, 18 May 2013 04:05:18 GMT
See <https://builds.apache.org/job/dir-apacheds-jdk16-win/396/changes>

Changes:

[elecharny] o Removed the authenticator cache invalidation for a compare operation
o Improved the cache for modification (we only invalidate it when the userPassword is being
modified)

[elecharny] Changed the thrown exception when we try to delete an entry which has some children

------------------------------------------
[...truncated 430 lines...]
[INFO] Using 'UTF-8' encoding to copy filtered resources.
[INFO] skip non existing resourceDirectory F:\hudson\hudson-slave\workspace\dir-apacheds-jdk16-win\trunk\interceptors\admin\src\main\resources
[INFO] Copying 3 resources

[INFO] --- maven-resources-plugin:2.5:resources (default-resources) @ apacheds-interceptors-admin
---
[INFO] 
[INFO] --- maven-compiler-plugin:2.5.1:compile (default-compile) @ apacheds-interceptors-admin
---
[INFO] Compiling 1 source file to F:\hudson\hudson-slave\workspace\dir-apacheds-jdk16-win\trunk\interceptors\admin\target\classes
[INFO] [debug] execute contextualize

[INFO] --- maven-resources-plugin:2.5:testResources (default-testResources) @ apacheds-interceptors-admin
---
[INFO] Using 'UTF-8' encoding to copy filtered resources.
[INFO] skip non existing resourceDirectory F:\hudson\hudson-slave\workspace\dir-apacheds-jdk16-win\trunk\interceptors\admin\src\test\resources
[INFO] Copying 3 resources
[INFO] 
[INFO] --- maven-compiler-plugin:2.5.1:testCompile (default-testCompile) @ apacheds-interceptors-admin
---
[INFO] No sources to compile
[INFO] 
[INFO] --- maven-surefire-plugin:2.12.2:test (default-test) @ apacheds-interceptors-admin
---
[JENKINS] Recording test results
[INFO] 
[INFO] --- maven-bundle-plugin:2.3.7:bundle (default-bundle) @ apacheds-interceptors-admin
---
[INFO] 
[INFO] --- maven-site-plugin:3.1:attach-descriptor (attach-descriptor) @ apacheds-interceptors-admin
---
[INFO] [INFO] Checking legal files in: apacheds-interceptors-admin-2.0.0-M13-SNAPSHOT.jar

[INFO] --- tools-maven-plugin:1.4:verify-legal-files (verify-legal-files) @ apacheds-interceptors-admin
---
May 18, 2013 5:03:28 AM hudson.maven.ExecutedMojo <init>
WARNING: Failed to getClass for org.apache.maven.plugin.source.SourceJarMojo
[INFO] 
[INFO] --- maven-source-plugin:2.2:jar (attach-sources) @ apacheds-interceptors-admin ---
[INFO] Building jar: F:\hudson\hudson-slave\workspace\dir-apacheds-jdk16-win\trunk\interceptors\admin\target\apacheds-interceptors-admin-2.0.0-M13-SNAPSHOT-sources.jar
[INFO] [INFO] Installing F:\hudson\hudson-slave\workspace\dir-apacheds-jdk16-win\trunk\interceptors\admin\target\apacheds-interceptors-admin-2.0.0-M13-SNAPSHOT.jar
to f:\hudson\hudson-slave\maven-repositories\0\org\apache\directory\server\apacheds-interceptors-admin\2.0.0-M13-SNAPSHOT\apacheds-interceptors-admin-2.0.0-M13-SNAPSHOT.jar

[INFO] --- maven-install-plugin:2.3.1:install (default-install) @ apacheds-interceptors-admin
---
[INFO] Installing F:\hudson\hudson-slave\workspace\dir-apacheds-jdk16-win\trunk\interceptors\admin\pom.xml
to f:\hudson\hudson-slave\maven-repositories\0\org\apache\directory\server\apacheds-interceptors-admin\2.0.0-M13-SNAPSHOT\apacheds-interceptors-admin-2.0.0-M13-SNAPSHOT.pom
[INFO] Installing F:\hudson\hudson-slave\workspace\dir-apacheds-jdk16-win\trunk\interceptors\admin\target\apacheds-interceptors-admin-2.0.0-M13-SNAPSHOT-sources.jar
to f:\hudson\hudson-slave\maven-repositories\0\org\apache\directory\server\apacheds-interceptors-admin\2.0.0-M13-SNAPSHOT\apacheds-interceptors-admin-2.0.0-M13-SNAPSHOT-sources.jar
[INFO] 
[INFO] --- maven-bundle-plugin:2.3.7:install (default-install) @ apacheds-interceptors-admin
---
[INFO] Installing org/apache/directory/server/apacheds-interceptors-admin/2.0.0-M13-SNAPSHOT/apacheds-interceptors-admin-2.0.0-M13-SNAPSHOT.jar
[INFO] Writing OBR metadata
[INFO]                                                                         
[INFO] ------------------------------------------------------------------------
[INFO] Building ApacheDS Authentication Interceptor 2.0.0-M13-SNAPSHOT
[INFO] ------------------------------------------------------------------------
Downloading: http://repository.apache.org/snapshots/org/apache/directory/api/api-ldap-extras-codec/1.0.0-M18-SNAPSHOT/maven-metadata.xml
Downloaded: http://repository.apache.org/snapshots/org/apache/directory/api/api-ldap-extras-codec/1.0.0-M18-SNAPSHOT/maven-metadata.xml
(2 KB at 5.4 KB/sec)
Downloading: http://repository.apache.org/snapshots/org/apache/directory/api/api-ldap-extras-codec/1.0.0-M18-SNAPSHOT/api-ldap-extras-codec-1.0.0-M18-20130517.043923-13.pom
Downloaded: http://repository.apache.org/snapshots/org/apache/directory/api/api-ldap-extras-codec/1.0.0-M18-SNAPSHOT/api-ldap-extras-codec-1.0.0-M18-20130517.043923-13.pom
(5 KB at 46.9 KB/sec)
Downloading: http://repository.apache.org/snapshots/org/apache/directory/api/api-ldap-extras-codec/1.0.0-M18-SNAPSHOT/api-ldap-extras-codec-1.0.0-M18-20130517.043923-13.jar
Downloaded: http://repository.apache.org/snapshots/org/apache/directory/api/api-ldap-extras-codec/1.0.0-M18-SNAPSHOT/api-ldap-extras-codec-1.0.0-M18-20130517.043923-13.jar
(199 KB at 2512.1 KB/sec)
[INFO] 
[INFO] --- maven-clean-plugin:2.4.1:clean (default-clean) @ apacheds-interceptors-authn ---
[INFO] Deleting F:\hudson\hudson-slave\workspace\dir-apacheds-jdk16-win\trunk\interceptors\authn\target
[INFO] 
[INFO] --- maven-remote-resources-plugin:1.2.1:process (default) @ apacheds-interceptors-authn
---
[INFO] [debug] execute contextualize

[INFO] --- maven-resources-plugin:2.5:resources (default-resources) @ apacheds-interceptors-authn
---
[INFO] Using 'UTF-8' encoding to copy filtered resources.
[INFO] skip non existing resourceDirectory F:\hudson\hudson-slave\workspace\dir-apacheds-jdk16-win\trunk\interceptors\authn\src\main\resources
[INFO] Copying 3 resources
[INFO] 
[INFO] --- maven-compiler-plugin:2.5.1:compile (default-compile) @ apacheds-interceptors-authn
---
[INFO] Compiling 9 source files to F:\hudson\hudson-slave\workspace\dir-apacheds-jdk16-win\trunk\interceptors\authn\target\classes
[INFO] -------------------------------------------------------------
[ERROR] COMPILATION ERROR : 
[INFO] -------------------------------------------------------------
[ERROR] F:\hudson\hudson-slave\workspace\dir-apacheds-jdk16-win\trunk\interceptors\authn\src\main\java\org\apache\directory\server\core\authn\AuthenticationInterceptor.java:[841,21]
cannot find symbol
symbol  : variable USER_PASSWORD_AT
location: class org.apache.directory.server.core.authn.AuthenticationInterceptor
[INFO] 1 error
[INFO] -------------------------------------------------------------
[INFO] ------------------------------------------------------------------------
[INFO] Reactor Summary:
[INFO] 
[INFO] ApacheDS .......................................... SUCCESS [7.525s]
[INFO] ApacheDS I18n ..................................... SUCCESS [5.996s]
[INFO] ApacheDS Core Constants ........................... SUCCESS [2.479s]
[INFO] ApacheDS Core API ................................. SUCCESS [37.464s]
[INFO] ApacheDS Core Shared .............................. SUCCESS [4.480s]
[INFO] ApacheDS Interceptors ............................. SUCCESS [0.116s]
[INFO] ApacheDS AdministrativePoint Interceptor .......... SUCCESS [2.012s]
[INFO] ApacheDS Authentication Interceptor ............... FAILURE [1.216s]
[INFO] ApacheDS Authorization Interceptor ................ SKIPPED
[INFO] ApacheDS ChangeLog Interceptor .................... SKIPPED
[INFO] ApacheDS Collective Attribute Interceptor ......... SKIPPED
[INFO] ApacheDS Event Interceptor ........................ SKIPPED
[INFO] ApacheDS Exception Interceptor .................... SKIPPED
[INFO] ApacheDS Journal Interceptor ...................... SKIPPED
[INFO] ApacheDS Normalization Interceptor ................ SKIPPED
[INFO] ApacheDS Operational Attribute Interceptor ........ SKIPPED
[INFO] ApacheDS Referral Interceptor ..................... SKIPPED
[INFO] ApacheDS Schema Interceptor ....................... SKIPPED
[INFO] ApacheDS Subtree Interceptor ...................... SKIPPED
[INFO] ApacheDS Triggers Interceptor ..................... SKIPPED
[INFO] ApacheDS Core ..................................... SKIPPED
[INFO] ApacheDS Core AVL ................................. SKIPPED
[INFO] ApacheDS Generalized (X) DBM Partition ............ SKIPPED
[INFO] ApacheDS LDIF Partition ........................... SKIPPED
[INFO] ApacheDS JDBM Partition ........................... SKIPPED
[INFO] ApacheDS Core Annotations ......................... SKIPPED
[INFO] ApacheDS Core JNDI ................................ SKIPPED
[INFO] ApacheDS Protocol Kerberos Codec .................. SKIPPED
[INFO] ApacheDS Interceptors for Kerberos ................ SKIPPED
[INFO] ApacheDS Protocol Dhcp ............................ SKIPPED
[INFO] ApacheDS Protocol Shared .......................... SKIPPED
[INFO] ApacheDS Protocol Dns ............................. SKIPPED
[INFO] ApacheDS Protocol Kerberos ........................ SKIPPED
[INFO] ApacheDS Protocol Ldap ............................ SKIPPED
[INFO] ApacheDS Protocol Ntp ............................. SKIPPED
[INFO] Apacheds Server Annotations ....................... SKIPPED
[INFO] ApacheDS Server Config ............................ SKIPPED
[INFO] ApacheDS Server JNDI .............................. SKIPPED
[INFO] ApacheDS Test Framework ........................... SKIPPED
[INFO] ApacheDS All ...................................... SKIPPED
[INFO] ApacheDS Logger Interceptor ....................... SKIPPED
[INFO] ApacheDS Password Hashing Interceptor ............. SKIPPED
[INFO] ApacheDS Core Integration ......................... SKIPPED
[INFO] ApacheDS Server Integration ....................... SKIPPED
[INFO] ApacheDS DirectoryService-WebApp bridge ........... SKIPPED
[INFO] ApacheDS Jetty HTTP Server Integration ............ SKIPPED
[INFO] ApacheDS Service Builder .......................... SKIPPED
[INFO] ApacheDS Protocol Kerberos Test ................... SKIPPED
[INFO] Apache Directory LDAP Client API test ............. SKIPPED
[INFO] kerberos-client ................................... SKIPPED
[INFO] ApacheDS Service .................................. SKIPPED
[INFO] ApacheDS Wrapper .................................. SKIPPED
[INFO] ApacheDS Installers Maven Plugin .................. SKIPPED
[INFO] ApacheDS Installers ............................... SKIPPED
[INFO] ------------------------------------------------------------------------
[INFO] BUILD FAILURE
[INFO] ------------------------------------------------------------------------
[INFO] Total time: 1:05.291s
[INFO] Finished at: Sat May 18 05:03:30 BST 2013
[INFO] Final Memory: 40M/230M
[INFO] ------------------------------------------------------------------------
[JENKINS] Archiving disabled
[JENKINS] Archiving disabled
[JENKINS] Archiving disabled
[JENKINS] Archiving disabled
[JENKINS] Archiving disabled
[JENKINS] Archiving disabled
[JENKINS] Archiving disabled
[JENKINS] Archiving disabled
[JENKINS] Archiving disabled
[JENKINS] Archiving disabled
[JENKINS] Archiving disabled
[JENKINS] Archiving disabled
[JENKINS] Archiving disabled
[JENKINS] Archiving disabled
[JENKINS] Archiving disabled
[JENKINS] Archiving disabled
[JENKINS] Archiving disabled
[JENKINS] Archiving disabled
[JENKINS] Archiving disabled
[JENKINS] Archiving disabled
[JENKINS] Archiving disabled
[JENKINS] Archiving disabled
[JENKINS] Archiving disabled
[JENKINS] Archiving disabled
[JENKINS] Archiving disabled
[JENKINS] Archiving disabled
[JENKINS] Archiving disabled
[JENKINS] Archiving disabled
[JENKINS] Archiving disabled
[JENKINS] Archiving disabled
[JENKINS] Archiving disabled
[JENKINS] Archiving disabled
[JENKINS] Archiving disabled
[JENKINS] Archiving disabled
[JENKINS] Archiving disabled
[JENKINS] Archiving disabled
[JENKINS] Archiving disabled
[JENKINS] Archiving disabled
[JENKINS] Archiving disabled
[JENKINS] Archiving disabled
[JENKINS] Archiving disabled
[JENKINS] Archiving disabled
[JENKINS] Archiving disabled
[JENKINS] Archiving disabled
[JENKINS] Archiving disabled
[JENKINS] Archiving disabled
[JENKINS] Archiving disabled
[JENKINS] Archiving disabled
[JENKINS] Archiving disabled
[JENKINS] Archiving disabled
[JENKINS] Archiving disabled
[JENKINS] Archiving disabled
[JENKINS] Archiving disabled
[JENKINS] Archiving disabled
Waiting for Jenkins to finish collecting data
mavenExecutionResult exceptions not empty
message : Failed to execute goal org.apache.maven.plugins:maven-compiler-plugin:2.5.1:compile
(default-compile) on project apacheds-interceptors-authn: Compilation failure
F:\hudson\hudson-slave\workspace\dir-apacheds-jdk16-win\trunk\interceptors\authn\src\main\java\org\apache\directory\server\core\authn\AuthenticationInterceptor.java:[841,21]
cannot find symbol
symbol  : variable USER_PASSWORD_AT
location: class org.apache.directory.server.core.authn.AuthenticationInterceptor

cause : Compilation failure
F:\hudson\hudson-slave\workspace\dir-apacheds-jdk16-win\trunk\interceptors\authn\src\main\java\org\apache\directory\server\core\authn\AuthenticationInterceptor.java:[841,21]
cannot find symbol
symbol  : variable USER_PASSWORD_AT
location: class org.apache.directory.server.core.authn.AuthenticationInterceptor

Stack trace : 
org.apache.maven.lifecycle.LifecycleExecutionException: Failed to execute goal org.apache.maven.plugins:maven-compiler-plugin:2.5.1:compile
(default-compile) on project apacheds-interceptors-authn: Compilation failure
F:\hudson\hudson-slave\workspace\dir-apacheds-jdk16-win\trunk\interceptors\authn\src\main\java\org\apache\directory\server\core\authn\AuthenticationInterceptor.java:[841,21]
cannot find symbol
symbol  : variable USER_PASSWORD_AT
location: class org.apache.directory.server.core.authn.AuthenticationInterceptor

	at org.apache.maven.lifecycle.internal.MojoExecutor.execute(MojoExecutor.java:213)
	at org.apache.maven.lifecycle.internal.MojoExecutor.execute(MojoExecutor.java:153)
	at org.apache.maven.lifecycle.internal.MojoExecutor.execute(MojoExecutor.java:145)
	at org.apache.maven.lifecycle.internal.LifecycleModuleBuilder.buildProject(LifecycleModuleBuilder.java:84)
	at org.apache.maven.lifecycle.internal.LifecycleModuleBuilder.buildProject(LifecycleModuleBuilder.java:59)
	at org.apache.maven.lifecycle.internal.LifecycleStarter.singleThreadedBuild(LifecycleStarter.java:183)
	at org.apache.maven.lifecycle.internal.LifecycleStarter.execute(LifecycleStarter.java:161)
	at org.apache.maven.DefaultMaven.doExecute(DefaultMaven.java:319)
	at org.apache.maven.DefaultMaven.execute(DefaultMaven.java:156)
	at org.jvnet.hudson.maven3.launcher.Maven3Launcher.main(Maven3Launcher.java:79)
	at sun.reflect.NativeMethodAccessorImpl.invoke0(Native Method)
	at sun.reflect.NativeMethodAccessorImpl.invoke(NativeMethodAccessorImpl.java:39)
	at sun.reflect.DelegatingMethodAccessorImpl.invoke(DelegatingMethodAccessorImpl.java:25)
	at java.lang.reflect.Method.invoke(Method.java:597)
	at org.codehaus.plexus.classworlds.launcher.Launcher.launchStandard(Launcher.java:329)
	at org.codehaus.plexus.classworlds.launcher.Launcher.launch(Launcher.java:239)
	at org.jvnet.hudson.maven3.agent.Maven3Main.launch(Maven3Main.java:158)
	at hudson.maven.Maven3Builder.call(Maven3Builder.java:100)
	at hudson.maven.Maven3Builder.call(Maven3Builder.java:66)
	at hudson.remoting.UserRequest.perform(UserRequest.java:118)
	at hudson.remoting.UserRequest.perform(UserRequest.java:48)
	at hudson.remoting.Request$2.run(Request.java:326)
	at hudson.remoting.InterceptingExecutorService$1.call(InterceptingExecutorService.java:72)
	at java.util.concurrent.FutureTask$Sync.innerRun(FutureTask.java:303)
	at java.util.concurrent.FutureTask.run(FutureTask.java:138)
	at java.util.concurrent.ThreadPoolExecutor$Worker.runTask(ThreadPoolExecutor.java:886)
	at java.util.concurrent.ThreadPoolExecutor$Worker.run(ThreadPoolExecutor.java:908)
	at java.lang.Thread.run(Thread.java:662)
Caused by: org.apache.maven.plugin.CompilationFailureException: Compilation failure
F:\hudson\hudson-slave\workspace\dir-apacheds-jdk16-win\trunk\interceptors\authn\src\main\java\org\apache\directory\server\core\authn\AuthenticationInterceptor.java:[841,21]
cannot find symbol
symbol  : variable USER_PASSWORD_AT
location: class org.apache.directory.server.core.authn.AuthenticationInterceptor

	at org.apache.maven.plugin.AbstractCompilerMojo.execute(AbstractCompilerMojo.java:729)
	at org.apache.maven.plugin.CompilerMojo.execute(CompilerMojo.java:128)
	at org.apache.maven.plugin.DefaultBuildPluginManager.executeMojo(DefaultBuildPluginManager.java:107)
	at org.apache.maven.lifecycle.internal.MojoExecutor.execute(MojoExecutor.java:209)
	... 27 more
Sending e-mails to: notifications@directory.apache.org
channel stopped

Mime
View raw message