directory-notifications mailing list archives

Site index · List index
Message view « Date » · « Thread »
Top « Date » · « Thread »
From Apache Jenkins Server <jenk...@builds.apache.org>
Subject Build failed in Jenkins: dir-junit-addons-jdk15-deploy-site #973
Date Tue, 07 May 2013 04:20:36 GMT
See <https://builds.apache.org/job/dir-junit-addons-jdk15-deploy-site/973/>

------------------------------------------
Started by timer
Building remotely on solaris1 in workspace <https://builds.apache.org/job/dir-junit-addons-jdk15-deploy-site/ws/>
Updating https://svn.apache.org/repos/asf/directory/buildtools/junit-addons/trunk
ERROR: Failed to update https://svn.apache.org/repos/asf/directory/buildtools/junit-addons/trunk
org.tmatesoft.svn.core.SVNException: svn: OPTIONS /repos/asf/directory/buildtools/junit-addons/trunk
failed
	at org.tmatesoft.svn.core.internal.io.dav.http.HTTPConnection.request(HTTPConnection.java:298)
	at org.tmatesoft.svn.core.internal.io.dav.http.HTTPConnection.request(HTTPConnection.java:283)
	at org.tmatesoft.svn.core.internal.io.dav.http.HTTPConnection.request(HTTPConnection.java:271)
	at org.tmatesoft.svn.core.internal.io.dav.DAVConnection.exchangeCapabilities(DAVConnection.java:533)
	at org.tmatesoft.svn.core.internal.io.dav.DAVConnection.open(DAVConnection.java:98)
	at org.tmatesoft.svn.core.internal.io.dav.DAVRepository.openConnection(DAVRepository.java:1011)
	at org.tmatesoft.svn.core.internal.io.dav.DAVRepository.getRepositoryUUID(DAVRepository.java:148)
	at org.tmatesoft.svn.core.wc.SVNBasicClient.createRepository(SVNBasicClient.java:342)
	at org.tmatesoft.svn.core.wc.SVNBasicClient.createRepository(SVNBasicClient.java:330)
	at org.tmatesoft.svn.core.wc.SVNUpdateClient.update(SVNUpdateClient.java:535)
	at org.tmatesoft.svn.core.wc.SVNUpdateClient.doUpdate(SVNUpdateClient.java:401)
	at hudson.scm.subversion.UpdateUpdater$TaskImpl.perform(UpdateUpdater.java:136)
	at hudson.scm.subversion.WorkspaceUpdater$UpdateTask.delegateTo(WorkspaceUpdater.java:136)
	at hudson.scm.SubversionSCM$CheckOutTask.perform(SubversionSCM.java:788)
	at hudson.scm.SubversionSCM$CheckOutTask.invoke(SubversionSCM.java:769)
	at hudson.scm.SubversionSCM$CheckOutTask.invoke(SubversionSCM.java:753)
	at hudson.FilePath$FileCallableWrapper.call(FilePath.java:2348)
	at hudson.remoting.UserRequest.perform(UserRequest.java:118)
	at hudson.remoting.UserRequest.perform(UserRequest.java:48)
	at hudson.remoting.Request$2.run(Request.java:326)
	at hudson.remoting.InterceptingExecutorService$1.call(InterceptingExecutorService.java:72)
	at java.util.concurrent.FutureTask$Sync.innerRun(FutureTask.java:303)
	at java.util.concurrent.FutureTask.run(FutureTask.java:138)
	at java.util.concurrent.ThreadPoolExecutor$Worker.runTask(ThreadPoolExecutor.java:886)
	at java.util.concurrent.ThreadPoolExecutor$Worker.run(ThreadPoolExecutor.java:908)
	at java.lang.Thread.run(Thread.java:662)
Caused by: org.tmatesoft.svn.core.SVNErrorMessage: svn: OPTIONS /repos/asf/directory/buildtools/junit-addons/trunk
failed
	at org.tmatesoft.svn.core.SVNErrorMessage.create(SVNErrorMessage.java:200)
	at org.tmatesoft.svn.core.SVNErrorMessage.create(SVNErrorMessage.java:146)
	at org.tmatesoft.svn.core.SVNErrorMessage.create(SVNErrorMessage.java:89)
	... 26 more
Caused by: org.tmatesoft.svn.core.SVNException: svn: OPTIONS request failed on '/repos/asf/directory/buildtools/junit-addons/trunk'
svn: unknown host
	at org.tmatesoft.svn.core.internal.wc.SVNErrorManager.error(SVNErrorManager.java:64)
	at org.tmatesoft.svn.core.internal.wc.SVNErrorManager.error(SVNErrorManager.java:51)
	at org.tmatesoft.svn.core.internal.io.dav.http.HTTPConnection._request(HTTPConnection.java:662)
	at org.tmatesoft.svn.core.internal.io.dav.http.HTTPConnection.request(HTTPConnection.java:292)
	... 25 more
Caused by: org.tmatesoft.svn.core.SVNErrorMessage: svn: OPTIONS request failed on '/repos/asf/directory/buildtools/junit-addons/trunk'
	at org.tmatesoft.svn.core.SVNErrorMessage.create(SVNErrorMessage.java:200)
	at org.tmatesoft.svn.core.internal.io.dav.http.HTTPConnection._request(HTTPConnection.java:660)
	... 26 more
Caused by: org.tmatesoft.svn.core.SVNErrorMessage: svn: unknown host
	at org.tmatesoft.svn.core.SVNErrorMessage.create(SVNErrorMessage.java:200)
	at org.tmatesoft.svn.core.internal.io.dav.http.HTTPConnection._request(HTTPConnection.java:415)
	... 26 more
Caused by: java.net.UnknownHostException: svn.apache.org
	at java.net.InetAddress.getAllByName0(InetAddress.java:1158)
	at java.net.InetAddress.getAllByName(InetAddress.java:1084)
	at java.net.InetAddress.getAllByName(InetAddress.java:1020)
	at java.net.InetAddress.getByName(InetAddress.java:970)
	at org.tmatesoft.svn.core.internal.util.SVNSocketFactory.createAddres(SVNSocketFactory.java:141)
	at org.tmatesoft.svn.core.internal.util.SVNSocketFactory.createSSLSocket(SVNSocketFactory.java:72)
	at org.tmatesoft.svn.core.internal.io.dav.http.HTTPConnection.connect(HTTPConnection.java:189)
	at org.tmatesoft.svn.core.internal.io.dav.http.HTTPConnection._request(HTTPConnection.java:354)
	... 26 more
no change for https://svn.apache.org/repos/asf/directory/buildtools/junit-addons/trunk since
the previous build
Parsing POMs
[trunk] $ /home/hudson/tools/java/latest1.5/bin/java -Xmx512m -XX:MaxPermSize=128m -Djava.awt.headless=true
-cp /export/home/hudson/hudson-slave/maven3-agent.jar:/home/hudson/tools/maven/apache-maven-3.0.4/boot/plexus-classworlds-2.4.jar
org.jvnet.hudson.maven3.agent.Maven3Main /home/hudson/tools/maven/apache-maven-3.0.4 /zonestorage/hudson_solaris/home/hudson/hudson-slave/slave.jar
/export/home/hudson/hudson-slave/maven3-interceptor.jar 56793
<===[JENKINS REMOTING CAPACITY]===>   channel started
log4j:WARN No appenders could be found for logger (org.apache.commons.beanutils.converters.BooleanConverter).
log4j:WARN Please initialize the log4j system properly.
Executing Maven:  -B -f <https://builds.apache.org/job/dir-junit-addons-jdk15-deploy-site/ws/trunk/pom.xml>
-Dmaven.repo.local=/export/home/hudson/hudson-slave/maven-repositories/0 clean deploy site
[INFO] Scanning for projects...
[INFO]                                                                         
[INFO] ------------------------------------------------------------------------
[INFO] Building Apache Directory JUnit Add-ons 0.2-SNAPSHOT
[INFO] ------------------------------------------------------------------------
[INFO] 
[INFO] --- maven-clean-plugin:2.4.1:clean (default-clean) @ junit-addons ---[INFO] Deleting
<https://builds.apache.org/job/dir-junit-addons-jdk15-deploy-site/ws/trunk/target>

[INFO] 
[INFO] --- maven-remote-resources-plugin:1.2.1:process (default) @ junit-addons ---
[INFO] 
[INFO] --- maven-resources-plugin:2.5:resources (default-resources) @ junit-addons ---[debug]
execute contextualize
[INFO] Using 'UTF-8' encoding to copy filtered resources.
[INFO] skip non existing resourceDirectory <https://builds.apache.org/job/dir-junit-addons-jdk15-deploy-site/ws/trunk/src/main/resources>
[INFO] Copying 3 resources

[INFO] 
[INFO] --- maven-compiler-plugin:2.5.1:compile (default-compile) @ junit-addons ---[INFO]
Compiling 9 source files to <https://builds.apache.org/job/dir-junit-addons-jdk15-deploy-site/ws/trunk/target/classes>

[INFO] 
[INFO] --- maven-resources-plugin:2.5:testResources (default-testResources) @ junit-addons
---[debug] execute contextualize
[INFO] Using 'UTF-8' encoding to copy filtered resources.
[INFO] skip non existing resourceDirectory <https://builds.apache.org/job/dir-junit-addons-jdk15-deploy-site/ws/trunk/src/test/resources>
[INFO] Copying 3 resources

[INFO] 
[INFO] --- maven-compiler-plugin:2.5.1:testCompile (default-testCompile) @ junit-addons ---
[INFO] No sources to compile
[INFO] 
[INFO] --- maven-surefire-plugin:2.12.2:test (default-test) @ junit-addons ---
[JENKINS] Recording test results
[INFO] 
[INFO] --- maven-bundle-plugin:2.3.7:bundle (default-bundle) @ junit-addons ---
[INFO] 
[INFO] --- maven-site-plugin:3.1:attach-descriptor (attach-descriptor) @ junit-addons ---
[INFO] 
[INFO] --- tools-maven-plugin:1.4:verify-legal-files (verify-legal-files) @ junit-addons ---[INFO]
Checking legal files in: junit-addons-0.2-SNAPSHOT.jar

[INFO] [INFO] Installing <https://builds.apache.org/job/dir-junit-addons-jdk15-deploy-site/ws/trunk/target/junit-addons-0.2-SNAPSHOT.jar>
to /export/home/hudson/hudson-slave/maven-repositories/0/org/apache/directory/junit/junit-addons/0.2-SNAPSHOT/junit-addons-0.2-SNAPSHOT.jar

[INFO] Installing <https://builds.apache.org/job/dir-junit-addons-jdk15-deploy-site/ws/trunk/pom.xml>
to /export/home/hudson/hudson-slave/maven-repositories/0/org/apache/directory/junit/junit-addons/0.2-SNAPSHOT/junit-addons-0.2-SNAPSHOT.pom
[INFO] --- maven-install-plugin:2.3.1:install (default-install) @ junit-addons ---
[INFO] 
[INFO] --- maven-bundle-plugin:2.3.7:install (default-install) @ junit-addons ---
[INFO] Installing org/apache/directory/junit/junit-addons/0.2-SNAPSHOT/junit-addons-0.2-SNAPSHOT.jar
[INFO] Writing OBR metadata
[INFO] 
[INFO] --- maven-deploy-plugin:2.7:deploy (default-deploy) @ junit-addons ---
Downloading: https://repository.apache.org/content/repositories/snapshots/org/apache/directory/junit/junit-addons/0.2-SNAPSHOT/maven-metadata.xml
[WARNING] Could not transfer metadata org.apache.directory.junit:junit-addons:0.2-SNAPSHOT/maven-metadata.xml
from/to apache.snapshots.https (https://repository.apache.org/content/repositories/snapshots):
repository.apache.org: repository.apache.org
[INFO] ------------------------------------------------------------------------
[INFO] BUILD FAILURE
[INFO] ------------------------------------------------------------------------
[INFO] Total time: 3:00.394s
[INFO] Finished at: Tue May 07 04:19:52 GMT+00:00 2013
[INFO] Final Memory: 15M/73M
[INFO] ------------------------------------------------------------------------
[JENKINS] Archiving <https://builds.apache.org/job/dir-junit-addons-jdk15-deploy-site/ws/trunk/pom.xml>
to /home/hudson/hudson/jobs/dir-junit-addons-jdk15-deploy-site/modules/org.apache.directory.junit$junit-addons/builds/2013-05-07_04-15-26/archive/org.apache.directory.junit/junit-addons/0.2-SNAPSHOT/junit-addons-0.2-SNAPSHOT.pom
[JENKINS] Archiving <https://builds.apache.org/job/dir-junit-addons-jdk15-deploy-site/ws/trunk/target/junit-addons-0.2-SNAPSHOT.jar>
to /home/hudson/hudson/jobs/dir-junit-addons-jdk15-deploy-site/modules/org.apache.directory.junit$junit-addons/builds/2013-05-07_04-15-26/archive/org.apache.directory.junit/junit-addons/0.2-SNAPSHOT/junit-addons-0.2-SNAPSHOT.jar
Waiting for Jenkins to finish collecting data
mavenExecutionResult exceptions not empty
message : Failed to execute goal org.apache.maven.plugins:maven-deploy-plugin:2.7:deploy (default-deploy)
on project junit-addons: Failed to retrieve remote metadata org.apache.directory.junit:junit-addons:0.2-SNAPSHOT/maven-metadata.xml:
Could not transfer metadata org.apache.directory.junit:junit-addons:0.2-SNAPSHOT/maven-metadata.xml
from/to apache.snapshots.https (https://repository.apache.org/content/repositories/snapshots):
repository.apache.org: repository.apache.org
cause : Failed to retrieve remote metadata org.apache.directory.junit:junit-addons:0.2-SNAPSHOT/maven-metadata.xml:
Could not transfer metadata org.apache.directory.junit:junit-addons:0.2-SNAPSHOT/maven-metadata.xml
from/to apache.snapshots.https (https://repository.apache.org/content/repositories/snapshots):
repository.apache.org: repository.apache.org
Stack trace : 
org.apache.maven.lifecycle.LifecycleExecutionException: Failed to execute goal org.apache.maven.plugins:maven-deploy-plugin:2.7:deploy
(default-deploy) on project junit-addons: Failed to retrieve remote metadata org.apache.directory.junit:junit-addons:0.2-SNAPSHOT/maven-metadata.xml:
Could not transfer metadata org.apache.directory.junit:junit-addons:0.2-SNAPSHOT/maven-metadata.xml
from/to apache.snapshots.https (https://repository.apache.org/content/repositories/snapshots):
repository.apache.org: repository.apache.org
	at org.apache.maven.lifecycle.internal.MojoExecutor.execute(MojoExecutor.java:217)
	at org.apache.maven.lifecycle.internal.MojoExecutor.execute(MojoExecutor.java:153)
	at org.apache.maven.lifecycle.internal.MojoExecutor.execute(MojoExecutor.java:145)
	at org.apache.maven.lifecycle.internal.LifecycleModuleBuilder.buildProject(LifecycleModuleBuilder.java:84)
	at org.apache.maven.lifecycle.internal.LifecycleModuleBuilder.buildProject(LifecycleModuleBuilder.java:59)
	at org.apache.maven.lifecycle.internal.LifecycleStarter.singleThreadedBuild(LifecycleStarter.java:183)
	at org.apache.maven.lifecycle.internal.LifecycleStarter.execute(LifecycleStarter.java:161)
	at org.apache.maven.DefaultMaven.doExecute(DefaultMaven.java:320)
	at org.apache.maven.DefaultMaven.execute(DefaultMaven.java:156)
	at org.jvnet.hudson.maven3.launcher.Maven3Launcher.main(Maven3Launcher.java:79)
	at sun.reflect.NativeMethodAccessorImpl.invoke0(Native Method)
	at sun.reflect.NativeMethodAccessorImpl.invoke(NativeMethodAccessorImpl.java:39)
	at sun.reflect.DelegatingMethodAccessorImpl.invoke(DelegatingMethodAccessorImpl.java:25)
	at java.lang.reflect.Method.invoke(Method.java:592)
	at org.codehaus.plexus.classworlds.launcher.Launcher.launchStandard(Launcher.java:329)
	at org.codehaus.plexus.classworlds.launcher.Launcher.launch(Launcher.java:239)
	at org.jvnet.hudson.maven3.agent.Maven3Main.launch(Maven3Main.java:158)
	at hudson.maven.Maven3Builder.call(Maven3Builder.java:100)
	at hudson.maven.Maven3Builder.call(Maven3Builder.java:66)
	at hudson.remoting.UserRequest.perform(UserRequest.java:118)
	at hudson.remoting.UserRequest.perform(UserRequest.java:48)
	at hudson.remoting.Request$2.run(Request.java:326)
	at hudson.remoting.InterceptingExecutorService$1.call(InterceptingExecutorService.java:72)
	at java.util.concurrent.FutureTask$Sync.innerRun(FutureTask.java:269)
	at java.util.concurrent.FutureTask.run(FutureTask.java:123)
	at java.util.concurrent.ThreadPoolExecutor$Worker.runTask(ThreadPoolExecutor.java:651)
	at java.util.concurrent.ThreadPoolExecutor$Worker.run(ThreadPoolExecutor.java:676)
	at java.lang.Thread.run(Thread.java:595)
Caused by: org.apache.maven.plugin.MojoExecutionException: Failed to retrieve remote metadata
org.apache.directory.junit:junit-addons:0.2-SNAPSHOT/maven-metadata.xml: Could not transfer
metadata org.apache.directory.junit:junit-addons:0.2-SNAPSHOT/maven-metadata.xml from/to apache.snapshots.https
(https://repository.apache.org/content/repositories/snapshots): repository.apache.org: repository.apache.org
	at org.apache.maven.plugin.deploy.DeployMojo.execute(DeployMojo.java:193)
	at org.apache.maven.plugin.DefaultBuildPluginManager.executeMojo(DefaultBuildPluginManager.java:101)
	at org.apache.maven.lifecycle.internal.MojoExecutor.execute(MojoExecutor.java:209)
	... 27 more
Caused by: org.apache.maven.artifact.deployer.ArtifactDeploymentException: Failed to retrieve
remote metadata org.apache.directory.junit:junit-addons:0.2-SNAPSHOT/maven-metadata.xml: Could
not transfer metadata org.apache.directory.junit:junit-addons:0.2-SNAPSHOT/maven-metadata.xml
from/to apache.snapshots.https (https://repository.apache.org/content/repositories/snapshots):
repository.apache.org: repository.apache.org
	at org.apache.maven.artifact.deployer.DefaultArtifactDeployer.deploy(DefaultArtifactDeployer.java:141)
	at org.apache.maven.plugin.deploy.AbstractDeployMojo.deploy(AbstractDeployMojo.java:167)
	at org.apache.maven.plugin.deploy.DeployMojo.execute(DeployMojo.java:157)
	... 29 more
Caused by: org.sonatype.aether.deployment.DeploymentException: Failed to retrieve remote metadata
org.apache.directory.junit:junit-addons:0.2-SNAPSHOT/maven-metadata.xml: Could not transfer
metadata org.apache.directory.junit:junit-addons:0.2-SNAPSHOT/maven-metadata.xml from/to apache.snapshots.https
(https://repository.apache.org/content/repositories/snapshots): repository.apache.org: repository.apache.org
	at org.sonatype.aether.impl.internal.DefaultDeployer.upload(DefaultDeployer.java:403)
	at org.sonatype.aether.impl.internal.DefaultDeployer.deploy(DefaultDeployer.java:256)
	at org.sonatype.aether.impl.internal.DefaultDeployer.deploy(DefaultDeployer.java:211)
	at org.sonatype.aether.impl.internal.DefaultRepositorySystem.deploy(DefaultRepositorySystem.java:443)
	at org.apache.maven.artifact.deployer.DefaultArtifactDeployer.deploy(DefaultArtifactDeployer.java:137)
	... 31 more
Caused by: org.sonatype.aether.transfer.MetadataTransferException: Could not transfer metadata
org.apache.directory.junit:junit-addons:0.2-SNAPSHOT/maven-metadata.xml from/to apache.snapshots.https
(https://repository.apache.org/content/repositories/snapshots): repository.apache.org: repository.apache.org
	at org.sonatype.aether.connector.wagon.WagonRepositoryConnector$3.wrap(WagonRepositoryConnector.java:930)
	at org.sonatype.aether.connector.wagon.WagonRepositoryConnector$3.wrap(WagonRepositoryConnector.java:920)
	at org.sonatype.aether.connector.wagon.WagonRepositoryConnector$GetTask.run(WagonRepositoryConnector.java:669)
	at org.sonatype.aether.util.concurrency.RunnableErrorForwarder$1.run(RunnableErrorForwarder.java:60)
	... 3 more
Caused by: org.apache.maven.wagon.TransferFailedException: repository.apache.org: repository.apache.org
	at org.apache.maven.wagon.shared.http4.AbstractHttpClientWagon.fillInputData(AbstractHttpClientWagon.java:799)
	at org.apache.maven.wagon.StreamWagon.getInputStream(StreamWagon.java:116)
	at org.apache.maven.wagon.StreamWagon.getIfNewer(StreamWagon.java:88)
	at org.apache.maven.wagon.StreamWagon.get(StreamWagon.java:61)
	at org.sonatype.aether.connector.wagon.WagonRepositoryConnector$GetTask.run(WagonRepositoryConnector.java:601)
	... 4 more
Caused by: java.net.UnknownHostException: repository.apache.org: repository.apache.org
	at java.net.InetAddress.getAllByName0(InetAddress.java:1145)
	at java.net.InetAddress.getAllByName(InetAddress.java:1072)
	at java.net.InetAddress.getAllByName(InetAddress.java:1008)
	at org.apache.maven.wagon.providers.http.httpclient.impl.conn.DefaultClientConnectionOperator.resolveHostname(DefaultClientConnectionOperator.java:242)
	at org.apache.maven.wagon.providers.http.httpclient.impl.conn.DefaultClientConnectionOperator.openConnection(DefaultClientConnectionOperator.java:130)
	at org.apache.maven.wagon.providers.http.httpclient.impl.conn.AbstractPoolEntry.open(AbstractPoolEntry.java:149)
	at org.apache.maven.wagon.providers.http.httpclient.impl.conn.AbstractPooledConnAdapter.open(AbstractPooledConnAdapter.java:121)
	at org.apache.maven.wagon.providers.http.httpclient.impl.client.DefaultRequestDirector.tryConnect(DefaultRequestDirector.java:573)
	at org.apache.maven.wagon.providers.http.httpclient.impl.client.DefaultRequestDirector.execute(DefaultRequestDirector.java:425)
	at org.apache.maven.wagon.providers.http.httpclient.impl.client.AbstractHttpClient.execute(AbstractHttpClient.java:820)
	at org.apache.maven.wagon.providers.http.httpclient.impl.client.AbstractHttpClient.execute(AbstractHttpClient.java:754)
	at org.apache.maven.wagon.shared.http4.AbstractHttpClientWagon.execute(AbstractHttpClientWagon.java:674)
	at org.apache.maven.wagon.shared.http4.AbstractHttpClientWagon.fillInputData(AbstractHttpClientWagon.java:793)
	... 8 more
Sending e-mails to: notifications@directory.apache.org
channel stopped

Mime
View raw message