directory-notifications mailing list archives

Site index · List index
Message view « Date » · « Thread »
Top « Date » · « Thread »
From Apache Jenkins Server <jenk...@builds.apache.org>
Subject Build failed in Jenkins: dir-studio-jdk16-win #812
Date Mon, 08 Apr 2013 04:14:08 GMT
See <https://builds.apache.org/job/dir-studio-jdk16-win/812/>

------------------------------------------
[...truncated 1283 lines...]
-------------------------------------------------------
Running org.apache.directory.studio.ldifparser.model.lines.LdifAttrValLineTest
Tests run: 5, Failures: 0, Errors: 0, Skipped: 0, Time elapsed: 0.115 sec
Running org.apache.directory.studio.ldifparser.model.lines.LdifDnLineTest
Tests run: 6, Failures: 0, Errors: 0, Skipped: 0, Time elapsed: 0.081 sec
Running org.apache.directory.studio.ldifparser.parser.LdifParserTest
Tests run: 1, Failures: 0, Errors: 0, Skipped: 0, Time elapsed: 0.001 sec

Results :

Tests run: 12, Failures: 0, Errors: 0, Skipped: 0

[JENKINS] Recording test results
[INFO] [INFO] Building jar: F:\hudson\hudson-slave\workspace\dir-studio-jdk16-win\trunk\plugins\ldifparser\target\ldifparser-2.0.0-SNAPSHOT.jar

[INFO] --- maven-jar-plugin:2.4:jar (default-jar) @ ldifparser ---
[INFO] 
[INFO] --- maven-site-plugin:3.0:attach-descriptor (attach-descriptor) @ ldifparser ---
[INFO] [INFO] Checking legal files in: ldifparser-2.0.0-SNAPSHOT.jar

[INFO] --- tools-maven-plugin:1.4:verify-legal-files (verify-legal-files) @ ldifparser ---
[INFO] [INFO] Installing F:\hudson\hudson-slave\workspace\dir-studio-jdk16-win\trunk\plugins\ldifparser\target\ldifparser-2.0.0-SNAPSHOT.jar
to f:\hudson\hudson-slave\maven-repositories\1\org\apache\directory\studio\ldifparser\2.0.0-SNAPSHOT\ldifparser-2.0.0-SNAPSHOT.jar
[INFO] Installing F:\hudson\hudson-slave\workspace\dir-studio-jdk16-win\trunk\plugins\ldifparser\pom.xml
to f:\hudson\hudson-slave\maven-repositories\1\org\apache\directory\studio\ldifparser\2.0.0-SNAPSHOT\ldifparser-2.0.0-SNAPSHOT.pom

[INFO] --- maven-install-plugin:2.3.1:install (default-install) @ ldifparser ---
[INFO]                                                                         
[INFO] ------------------------------------------------------------------------
[INFO] Building Apache Directory Studio Connection Core 2.0.0-SNAPSHOT
[INFO] [INFO] Deleting F:\hudson\hudson-slave\workspace\dir-studio-jdk16-win\trunk\plugins\connection.core\target
------------------------------------------------------------------------
[INFO] 
[INFO] --- maven-clean-plugin:2.4.1:clean (default-clean) @ connection.core ---
[INFO] 
[INFO] --- maven-remote-resources-plugin:1.2.1:process (default) @ connection.core ---
[INFO] [debug] execute contextualize
[INFO] Using 'UTF-8' encoding to copy filtered resources.
[INFO] Copying 3 resources

[INFO] --- maven-resources-plugin:2.5:resources (default-resources) @ connection.core ---
[INFO] Copying 6 resources
[INFO] Copying 3 resources
[INFO] Copying 3 resources
[WARNING] The artifact org.slf4j:jcl104-over-slf4j:jar:1.5.6 has been relocated to org.slf4j:jcl-over-slf4j:jar:1.5.6
[INFO] 
[INFO] --- studio-maven-plugin:1.0.5:prepare-jar-package (default) @ connection.core ---
[INFO] 
[INFO] --- maven-compiler-plugin:2.3.2:compile (default-compile) @ connection.core ---
[INFO] Compiling 59 source files to F:\hudson\hudson-slave\workspace\dir-studio-jdk16-win\trunk\plugins\connection.core\target\classes
[INFO] -------------------------------------------------------------
[ERROR] COMPILATION ERROR : 
[INFO] -------------------------------------------------------------
[ERROR] \hudson\hudson-slave\workspace\dir-studio-jdk16-win\trunk\plugins\connection.core\src\main\java\org\apache\directory\studio\connection\core\io\api\DirectoryApiConnectionWrapper.java:[76,43]
cannot find symbol
symbol  : class CramMd5Request
location: package org.apache.directory.ldap.client.api
[ERROR] \hudson\hudson-slave\workspace\dir-studio-jdk16-win\trunk\plugins\connection.core\src\main\java\org\apache\directory\studio\connection\core\io\api\DirectoryApiConnectionWrapper.java:[77,43]
cannot find symbol
symbol  : class DigestMd5Request
location: package org.apache.directory.ldap.client.api
[ERROR] \hudson\hudson-slave\workspace\dir-studio-jdk16-win\trunk\plugins\connection.core\src\main\java\org\apache\directory\studio\connection\core\io\api\DirectoryApiConnectionWrapper.java:[78,43]
cannot find symbol
symbol  : class GssApiRequest
location: package org.apache.directory.ldap.client.api
[ERROR] \hudson\hudson-slave\workspace\dir-studio-jdk16-win\trunk\plugins\connection.core\src\main\java\org\apache\directory\studio\connection\core\io\api\DirectoryApiConnectionWrapper.java:[374,32]
cannot find symbol
symbol: class CramMd5Request
                                CramMd5Request cramMd5Request = new CramMd5Request();
[ERROR] \hudson\hudson-slave\workspace\dir-studio-jdk16-win\trunk\plugins\connection.core\src\main\java\org\apache\directory\studio\connection\core\io\api\DirectoryApiConnectionWrapper.java:[374,68]
cannot find symbol
symbol: class CramMd5Request
                                CramMd5Request cramMd5Request = new CramMd5Request();
[ERROR] \hudson\hudson-slave\workspace\dir-studio-jdk16-win\trunk\plugins\connection.core\src\main\java\org\apache\directory\studio\connection\core\io\api\DirectoryApiConnectionWrapper.java:[389,32]
cannot find symbol
symbol: class DigestMd5Request
                                DigestMd5Request digestMd5Request = new DigestMd5Request();
[ERROR] \hudson\hudson-slave\workspace\dir-studio-jdk16-win\trunk\plugins\connection.core\src\main\java\org\apache\directory\studio\connection\core\io\api\DirectoryApiConnectionWrapper.java:[389,72]
cannot find symbol
symbol: class DigestMd5Request
                                DigestMd5Request digestMd5Request = new DigestMd5Request();
[ERROR] \hudson\hudson-slave\workspace\dir-studio-jdk16-win\trunk\plugins\connection.core\src\main\java\org\apache\directory\studio\connection\core\io\api\DirectoryApiConnectionWrapper.java:[405,32]
cannot find symbol
symbol: class GssApiRequest
                                GssApiRequest gssApiRequest = new GssApiRequest();
[ERROR] \hudson\hudson-slave\workspace\dir-studio-jdk16-win\trunk\plugins\connection.core\src\main\java\org\apache\directory\studio\connection\core\io\api\DirectoryApiConnectionWrapper.java:[405,66]
cannot find symbol
symbol: class GssApiRequest
                                GssApiRequest gssApiRequest = new GssApiRequest();
[INFO] 9 errors 
[INFO] -------------------------------------------------------------
[INFO] ------------------------------------------------------------------------
[INFO] Reactor Summary:
[INFO] 
[INFO] Apache Directory Studio ........................... SUCCESS [8.317s]
[INFO] Apache Directory Studio Repository ................ SUCCESS [18.589s]
[INFO] Apache Directory Studio Libraries Plugins ......... SUCCESS [0.139s]
[INFO] SLF4J API Module (for Apache Directory Studio) .... SUCCESS [23.864s]
[INFO] Ehcache Core (for Apache Directory Studio) ........ SUCCESS [3.226s]
[INFO] AntLR Parser Generator (for Apache Directory Studio)  SUCCESS [1.492s]
[INFO] Apache Commons Codec (for Apache Directory Studio)  SUCCESS [1.204s]
[INFO] Apache Commons Collections (for Apache Directory Studio)  SUCCESS [3.004s]
[INFO] Apache Commons IO (for Apache Directory Studio) ... SUCCESS [5.653s]
[INFO] Apache Commons Lang (for Apache Directory Studio) . SUCCESS [0.964s]
[INFO] Apache Commons Logging (for Apache Directory Studio)  SUCCESS [0.793s]
[INFO] Apache Commons Pool (for Apache Directory Studio) . SUCCESS [0.899s]
[INFO] Apache HttpComponents Core (for Apache Directory Studio)  SUCCESS [0.848s]
[INFO] Apache HttpComponents Client (for Apache Directory Studio)  SUCCESS [1.471s]
[INFO] Log4j (for Apache Directory Studio) ............... SUCCESS [0.926s]
[INFO] Legion of the Bouncy Castle Java Cryptography APIs (for Apache Directory Studio)  SUCCESS
[1.882s]
[INFO] dom4j (for Apache Directory Studio) ............... SUCCESS [0.868s]
[INFO] SLF4J LOG4J-12 Binding (for Apache Directory Studio)  SUCCESS [1.103s]
[INFO] XPP3 (for Apache Directory Studio) ................ SUCCESS [0.733s]
[INFO] Apache Directory Studio Plugins ................... SUCCESS [0.174s]
[INFO] Apache Directory Studio Common UI ................. SUCCESS [4.911s]
[INFO] Apache Directory Studio Common Core ............... SUCCESS [2.023s]
[INFO] Apache Directory Studio LDIF Parser ............... SUCCESS [6.698s]
[INFO] Apache Directory Studio Connection Core ........... FAILURE [5.977s]
[INFO] Apache Directory Studio Connection UI ............. SKIPPED
[INFO] Apache Directory Studio LDAP Browser Core ......... SKIPPED
[INFO] Apache Directory Studio LDAP Browser Common ....... SKIPPED
[INFO] Apache Directory Studio Value Editors ............. SKIPPED
[INFO] Apache Directory Studio ACI Item Editor ........... SKIPPED
[INFO] Apache Directory Studio ApacheDS Launcher ......... SKIPPED
[INFO] Apache Directory Studio ApacheDS Configuration .... SKIPPED
[INFO] Apache Directory Studio ApacheDS 2.0 Configuration  SKIPPED
[INFO] Apache Directory Studio LDIF Editor ............... SKIPPED
[INFO] Apache Directory Studio LDAP Browser UI ........... SKIPPED
[INFO] Apache Directory Studio LDAP Servers .............. SKIPPED
[INFO] Apache Directory Studio ApacheDS 1.5.3 LDAP Server Adapter  SKIPPED
[INFO] Apache Directory Studio ApacheDS 1.5.4 LDAP Server Adapter  SKIPPED
[INFO] Apache Directory Studio ApacheDS 1.5.5 LDAP Server Adapter  SKIPPED
[INFO] Apache Directory Studio ApacheDS 1.5.6 LDAP Server Adapter  SKIPPED
[INFO] Apache Directory Studio ApacheDS 1.5.7 LDAP Server Adapter  SKIPPED
[INFO] Apache Directory Studio ApacheDS 2.0.0 LDAP Server Adapter  SKIPPED
[INFO] Apache Directory Studio RCP ....................... SKIPPED
[INFO] Apache Directory Studio Schema Editor ............. SKIPPED
[INFO] Apache Directory Studio Apache DS Help ............ SKIPPED
[INFO] Apache Directory Studio Apache DS Configuration Help  SKIPPED
[INFO] Apache Directory Studio LDAP Browser Help ......... SKIPPED
[INFO] Apache Directory Studio LDIF Editor Help .......... SKIPPED
[INFO] Apache Directory Studio RCP Help .................. SKIPPED
[INFO] Apache Directory Studio Schema Editor Help ........ SKIPPED
[INFO] Apache Directory Studio Help Plugins .............. SKIPPED
[INFO] Apache Directory Studio Feature Plugins ........... SKIPPED
[INFO] Apache Directory Studio ApacheDS Configuration Feature  SKIPPED
[INFO] Apache Directory Studio ApacheDS 2.0 Configuration Feature  SKIPPED
[INFO] Apache Directory Studio ApacheDS Feature .......... SKIPPED
[INFO] Apache Directory Studio LDAP Browser Feature ...... SKIPPED
[INFO] Apache Directory Studio LDAP Servers Feature ...... SKIPPED
[INFO] Apache Directory Studio LDIF Editor Feature ....... SKIPPED
[INFO] Apache Directory Studio RCP Feature ............... SKIPPED
[INFO] Apache Directory Studio Schema Editor Feature ..... SKIPPED
[INFO] ------------------------------------------------------------------------
[INFO] BUILD FAILURE
[INFO] ------------------------------------------------------------------------
[INFO] Total time: 1:41.822s
[INFO] Finished at: Mon Apr 08 05:12:14 BST 2013
[INFO] Final Memory: 75M/215M
[INFO] ------------------------------------------------------------------------
[JENKINS] Archiving disabled
[JENKINS] Archiving disabled
[JENKINS] Archiving disabled
[JENKINS] Archiving disabled
[JENKINS] Archiving disabled
[JENKINS] Archiving disabled
[JENKINS] Archiving disabled
[JENKINS] Archiving disabled
[JENKINS] Archiving disabled
[JENKINS] Archiving disabled
[JENKINS] Archiving disabled
[JENKINS] Archiving disabled
[JENKINS] Archiving disabled
[JENKINS] Archiving disabled
[JENKINS] Archiving disabled
[JENKINS] Archiving disabled
[JENKINS] Archiving disabled
[JENKINS] Archiving disabled
[JENKINS] Archiving disabled
[JENKINS] Archiving disabled
[JENKINS] Archiving disabled
[JENKINS] Archiving disabled
[JENKINS] Archiving disabled
[JENKINS] Archiving disabled
[JENKINS] Archiving disabled
[JENKINS] Archiving disabled
[JENKINS] Archiving disabled
[JENKINS] Archiving disabled
[JENKINS] Archiving disabled
[JENKINS] Archiving disabled
[JENKINS] Archiving disabled
[JENKINS] Archiving disabled
[JENKINS] Archiving disabled
[JENKINS] Archiving disabled
[JENKINS] Archiving disabled
[JENKINS] Archiving disabled
[JENKINS] Archiving disabled
[JENKINS] Archiving disabled
[JENKINS] Archiving disabled
[JENKINS] Archiving disabled
[JENKINS] Archiving disabled
[JENKINS] Archiving disabled
[JENKINS] Archiving disabled
[JENKINS] Archiving disabled
[JENKINS] Archiving disabled
[JENKINS] Archiving disabled
[JENKINS] Archiving disabled
[JENKINS] Archiving disabled
[JENKINS] Archiving disabled
[JENKINS] Archiving disabled
[JENKINS] Archiving disabled
[JENKINS] Archiving disabled
[JENKINS] Archiving disabled
[JENKINS] Archiving disabled
[JENKINS] Archiving disabled
[JENKINS] Archiving disabled
[JENKINS] Archiving disabled
[JENKINS] Archiving disabled
[JENKINS] Archiving disabled
Waiting for Jenkins to finish collecting data
mavenExecutionResult exceptions not empty
message : Failed to execute goal org.apache.maven.plugins:maven-compiler-plugin:2.3.2:compile
(default-compile) on project connection.core: Compilation failure
cause : Compilation failure
Stack trace : 
org.apache.maven.lifecycle.LifecycleExecutionException: Failed to execute goal org.apache.maven.plugins:maven-compiler-plugin:2.3.2:compile
(default-compile) on project connection.core: Compilation failure
	at org.apache.maven.lifecycle.internal.MojoExecutor.execute(MojoExecutor.java:213)
	at org.apache.maven.lifecycle.internal.MojoExecutor.execute(MojoExecutor.java:153)
	at org.apache.maven.lifecycle.internal.MojoExecutor.execute(MojoExecutor.java:145)
	at org.apache.maven.lifecycle.internal.LifecycleModuleBuilder.buildProject(LifecycleModuleBuilder.java:84)
	at org.apache.maven.lifecycle.internal.LifecycleModuleBuilder.buildProject(LifecycleModuleBuilder.java:59)
	at org.apache.maven.lifecycle.internal.LifecycleStarter.singleThreadedBuild(LifecycleStarter.java:183)
	at org.apache.maven.lifecycle.internal.LifecycleStarter.execute(LifecycleStarter.java:161)
	at org.apache.maven.DefaultMaven.doExecute(DefaultMaven.java:319)
	at org.apache.maven.DefaultMaven.execute(DefaultMaven.java:156)
	at org.jvnet.hudson.maven3.launcher.Maven3Launcher.main(Maven3Launcher.java:79)
	at sun.reflect.NativeMethodAccessorImpl.invoke0(Native Method)
	at sun.reflect.NativeMethodAccessorImpl.invoke(NativeMethodAccessorImpl.java:39)
	at sun.reflect.DelegatingMethodAccessorImpl.invoke(DelegatingMethodAccessorImpl.java:25)
	at java.lang.reflect.Method.invoke(Method.java:597)
	at org.codehaus.plexus.classworlds.launcher.Launcher.launchStandard(Launcher.java:329)
	at org.codehaus.plexus.classworlds.launcher.Launcher.launch(Launcher.java:239)
	at org.jvnet.hudson.maven3.agent.Maven3Main.launch(Maven3Main.java:158)
	at hudson.maven.Maven3Builder.call(Maven3Builder.java:100)
	at hudson.maven.Maven3Builder.call(Maven3Builder.java:66)
	at hudson.remoting.UserRequest.perform(UserRequest.java:118)
	at hudson.remoting.UserRequest.perform(UserRequest.java:48)
	at hudson.remoting.Request$2.run(Request.java:326)
	at hudson.remoting.InterceptingExecutorService$1.call(InterceptingExecutorService.java:72)
	at java.util.concurrent.FutureTask$Sync.innerRun(FutureTask.java:303)
	at java.util.concurrent.FutureTask.run(FutureTask.java:138)
	at java.util.concurrent.ThreadPoolExecutor$Worker.runTask(ThreadPoolExecutor.java:886)
	at java.util.concurrent.ThreadPoolExecutor$Worker.run(ThreadPoolExecutor.java:908)
	at java.lang.Thread.run(Thread.java:662)
Caused by: org.apache.maven.plugin.CompilationFailureException: Compilation failure
	at org.apache.maven.plugin.AbstractCompilerMojo.execute(AbstractCompilerMojo.java:656)
	at org.apache.maven.plugin.CompilerMojo.execute(CompilerMojo.java:128)
	at org.apache.maven.plugin.DefaultBuildPluginManager.executeMojo(DefaultBuildPluginManager.java:107)
	at org.apache.maven.lifecycle.internal.MojoExecutor.execute(MojoExecutor.java:209)
	... 27 more
channel stopped

Mime
View raw message