directory-notifications mailing list archives

Site index · List index
Message view « Date » · « Thread »
Top « Date » · « Thread »
From Apache Jenkins Server <jenk...@builds.apache.org>
Subject Build failed in Jenkins: dir-apacheds-jdbm-jdk16-ubuntu-deploy #405
Date Sun, 14 Apr 2013 05:18:30 GMT
See <https://builds.apache.org/job/dir-apacheds-jdbm-jdk16-ubuntu-deploy/405/>

------------------------------------------
[...truncated 69 lines...]
[INFO] --- maven-compiler-plugin:2.5.1:compile (default-compile) @ apacheds-jdbm1 ---
[INFO] Compiling 58 source files to <https://builds.apache.org/job/dir-apacheds-jdbm-jdk16-ubuntu-deploy/ws/jdbm1/target/classes>
[debug] execute contextualize
[INFO] [INFO] Using 'UTF-8' encoding to copy filtered resources.
[INFO] skip non existing resourceDirectory <https://builds.apache.org/job/dir-apacheds-jdbm-jdk16-ubuntu-deploy/ws/jdbm1/src/test/resources>
[INFO] Copying 3 resources

[INFO] --- maven-resources-plugin:2.5:testResources (default-testResources) @ apacheds-jdbm1
---
[INFO] 
[INFO] --- maven-compiler-plugin:2.5.1:testCompile (default-testCompile) @ apacheds-jdbm1
---
[INFO] Compiling 3 source files to <https://builds.apache.org/job/dir-apacheds-jdbm-jdk16-ubuntu-deploy/ws/jdbm1/target/test-classes>
[INFO] 
[INFO] --- maven-surefire-plugin:2.12.2:test (default-test) @ apacheds-jdbm1 ---
[INFO] Surefire report directory: <https://builds.apache.org/job/dir-apacheds-jdbm-jdk16-ubuntu-deploy/ws/jdbm1/target/surefire-reports>

-------------------------------------------------------
 T E S T S
-------------------------------------------------------
Running jdbm.btree.TestBTree
Tests run: 10, Failures: 0, Errors: 0, Skipped: 1, Time elapsed: 10.348 sec
Running jdbm.recman.LocationTest
Tests run: 8, Failures: 0, Errors: 0, Skipped: 2, Time elapsed: 0.004 sec

Results :

Tests run: 18, Failures: 0, Errors: 0, Skipped: 3

[JENKINS] Recording test results
[INFO] 
[INFO] --- maven-bundle-plugin:2.3.7:bundle (default-bundle) @ apacheds-jdbm1 ---
[INFO] 
[INFO] --- maven-site-plugin:3.0:attach-descriptor (attach-descriptor) @ apacheds-jdbm1 ---
[INFO] [INFO] Checking legal files in: apacheds-jdbm1-2.0.0-M3-SNAPSHOT.jar

[INFO] --- tools-maven-plugin:1.4:verify-legal-files (verify-legal-files) @ apacheds-jdbm1
---
[INFO] [INFO] Installing <https://builds.apache.org/job/dir-apacheds-jdbm-jdk16-ubuntu-deploy/ws/jdbm1/target/apacheds-jdbm1-2.0.0-M3-SNAPSHOT.jar>
to /home/jenkins/jenkins-slave/maven-repositories/1/org/apache/directory/jdbm/apacheds-jdbm1/2.0.0-M3-SNAPSHOT/apacheds-jdbm1-2.0.0-M3-SNAPSHOT.jar
[INFO] Installing <https://builds.apache.org/job/dir-apacheds-jdbm-jdk16-ubuntu-deploy/ws/jdbm1/pom.xml>
to /home/jenkins/jenkins-slave/maven-repositories/1/org/apache/directory/jdbm/apacheds-jdbm1/2.0.0-M3-SNAPSHOT/apacheds-jdbm1-2.0.0-M3-SNAPSHOT.pom

[INFO] --- maven-install-plugin:2.3.1:install (default-install) @ apacheds-jdbm1 ---
[INFO] 
[INFO] --- maven-bundle-plugin:2.3.7:install (default-install) @ apacheds-jdbm1 ---
[INFO] Installing org/apache/directory/jdbm/apacheds-jdbm1/2.0.0-M3-SNAPSHOT/apacheds-jdbm1-2.0.0-M3-SNAPSHOT.jar
[INFO] Writing OBR metadata
Downloading: https://repository.apache.org/content/repositories/snapshots/org/apache/directory/jdbm/apacheds-jdbm1/2.0.0-M3-SNAPSHOT/maven-metadata.xml
[INFO] 
[INFO] --- maven-deploy-plugin:2.7:deploy (default-deploy) @ apacheds-jdbm1 ---
Downloaded: https://repository.apache.org/content/repositories/snapshots/org/apache/directory/jdbm/apacheds-jdbm1/2.0.0-M3-SNAPSHOT/maven-metadata.xml
(801 B at 2.4 KB/sec)
Uploading: https://repository.apache.org/content/repositories/snapshots/org/apache/directory/jdbm/apacheds-jdbm1/2.0.0-M3-SNAPSHOT/apacheds-jdbm1-2.0.0-M3-20130414.051421-78.jar
Uploaded: https://repository.apache.org/content/repositories/snapshots/org/apache/directory/jdbm/apacheds-jdbm1/2.0.0-M3-SNAPSHOT/apacheds-jdbm1-2.0.0-M3-20130414.051421-78.jar
(103 KB at 266.3 KB/sec)
Uploading: https://repository.apache.org/content/repositories/snapshots/org/apache/directory/jdbm/apacheds-jdbm1/2.0.0-M3-SNAPSHOT/apacheds-jdbm1-2.0.0-M3-20130414.051421-78.pom
Uploaded: https://repository.apache.org/content/repositories/snapshots/org/apache/directory/jdbm/apacheds-jdbm1/2.0.0-M3-SNAPSHOT/apacheds-jdbm1-2.0.0-M3-20130414.051421-78.pom
(3 KB at 9.6 KB/sec)
Downloading: https://repository.apache.org/content/repositories/snapshots/org/apache/directory/jdbm/apacheds-jdbm1/maven-metadata.xml
Downloaded: https://repository.apache.org/content/repositories/snapshots/org/apache/directory/jdbm/apacheds-jdbm1/maven-metadata.xml
(365 B at 1.6 KB/sec)
Uploading: https://repository.apache.org/content/repositories/snapshots/org/apache/directory/jdbm/apacheds-jdbm1/2.0.0-M3-SNAPSHOT/maven-metadata.xml
Uploaded: https://repository.apache.org/content/repositories/snapshots/org/apache/directory/jdbm/apacheds-jdbm1/2.0.0-M3-SNAPSHOT/maven-metadata.xml
(801 B at 2.8 KB/sec)
Uploading: https://repository.apache.org/content/repositories/snapshots/org/apache/directory/jdbm/apacheds-jdbm1/maven-metadata.xml
Uploaded: https://repository.apache.org/content/repositories/snapshots/org/apache/directory/jdbm/apacheds-jdbm1/maven-metadata.xml
(365 B at 0.3 KB/sec)
[INFO] [INFO] Remote OBR update disabled (enable with -DremoteOBR)

[INFO] --- maven-bundle-plugin:2.3.7:deploy (default-deploy) @ apacheds-jdbm1 ---
[INFO] [INFO] Deleting <https://builds.apache.org/job/dir-apacheds-jdbm-jdk16-ubuntu-deploy/ws/jdbm2/target>
                                                                        
[INFO] ------------------------------------------------------------------------
[INFO] Building ApacheDS JDBM Implementation MVCC 2.0.0-M3-SNAPSHOT
[INFO] ------------------------------------------------------------------------
[INFO] 
[INFO] --- maven-clean-plugin:2.4.1:clean (default-clean) @ apacheds-jdbm2 ---
[INFO] 
[INFO] --- maven-remote-resources-plugin:1.2.1:process (default) @ apacheds-jdbm2 ---
[INFO] [debug] execute contextualize
[INFO] Using 'UTF-8' encoding to copy filtered resources.

[INFO] --- maven-resources-plugin:2.5:resources (default-resources) @ apacheds-jdbm2 ---
[INFO] Copying 6 resources
[INFO] Copying 3 resources
[INFO] 
[INFO] --- maven-compiler-plugin:2.5.1:compile (default-compile) @ apacheds-jdbm2 ---
[INFO] Compiling 65 source files to <https://builds.apache.org/job/dir-apacheds-jdbm-jdk16-ubuntu-deploy/ws/jdbm2/target/classes>
[debug] execute contextualize
[INFO] [INFO] Using 'UTF-8' encoding to copy filtered resources.
[INFO] Copying 1 resource
[INFO] Copying 3 resources

[INFO] --- maven-resources-plugin:2.5:testResources (default-testResources) @ apacheds-jdbm2
---
[INFO] [INFO] Compiling 8 source files to <https://builds.apache.org/job/dir-apacheds-jdbm-jdk16-ubuntu-deploy/ws/jdbm2/target/test-classes>

[INFO] --- maven-compiler-plugin:2.5.1:testCompile (default-testCompile) @ apacheds-jdbm2
---
[INFO] [INFO] Surefire report directory: <https://builds.apache.org/job/dir-apacheds-jdbm-jdk16-ubuntu-deploy/ws/jdbm2/target/surefire-reports>

-------------------------------------------------------
 T E S T S
-------------------------------------------------------

[INFO] --- maven-surefire-plugin:2.12.2:test (default-test) @ apacheds-jdbm2 ---
Running jdbm.btree.TestBTree
Tests run: 9, Failures: 0, Errors: 0, Skipped: 0, Time elapsed: 10.389 sec
Running jdbm.btree.TestSnapshotBTree
 TestLongBrowsing read thread min key is0max value is0
 TestLongBrowsing read thread min key is0max value is1
 TestLongBrowsing read thread min key is0max value is1
 TestLongBrowsing read thread min key is0max value is1
TestLongBrowsing read thread count is 10000
TestLongBrowsing read thread count is 10000
TestLongBrowsing read thread count is 10000
TestLongBrowsing read thread count is 10000
TestLongBrowsing updates ended
TestRemoveInsert read thread count is 10000
TestRemoveInsert read thread count is 10000
TestRemoveInsert read thread count is 10000
TestRemoveInsert updates ended
TestRemoveInsert read thread count is 10000
count is 1024
Tests run: 3, Failures: 0, Errors: 0, Skipped: 0, Time elapsed: 213.123 sec
Running jdbm.btree.TestBTreeBrowser
Tests run: 11, Failures: 0, Errors: 0, Skipped: 0, Time elapsed: 0.963 sec
Running jdbm.btree.TestStreamCorrupted
Tests run: 1, Failures: 0, Errors: 0, Skipped: 0, Time elapsed: 0.104 sec
Running jdbm.helper.TestVersionedCache
Sum is: 1027
Tests run: 2, Failures: 0, Errors: 0, Skipped: 0, Time elapsed: 0.45 sec
Running jdbm.helper.TestActionVersioning
Tests run: 1, Failures: 0, Errors: 0, Skipped: 0, Time elapsed: 0.001 sec
Running jdbm.recman.BlockIoTest
Tests run: 4, Failures: 0, Errors: 0, Skipped: 0, Time elapsed: 0.002 sec
Running jdbm.recman.LocationTest
Tests run: 8, Failures: 0, Errors: 0, Skipped: 2, Time elapsed: 0 sec

Results :

Tests run: 39, Failures: 0, Errors: 0, Skipped: 2

[JENKINS] Recording test results
[INFO] 
[INFO] --- maven-bundle-plugin:2.3.7:bundle (default-bundle) @ apacheds-jdbm2 ---
[INFO] 
[INFO] --- maven-site-plugin:3.0:attach-descriptor (attach-descriptor) @ apacheds-jdbm2 ---
[INFO] Checking legal files in: apacheds-jdbm2-2.0.0-M3-SNAPSHOT.jar
[INFO] 
[INFO] --- tools-maven-plugin:1.4:verify-legal-files (verify-legal-files) @ apacheds-jdbm2
---
[INFO] [INFO] Installing <https://builds.apache.org/job/dir-apacheds-jdbm-jdk16-ubuntu-deploy/ws/jdbm2/target/apacheds-jdbm2-2.0.0-M3-SNAPSHOT.jar>
to /home/jenkins/jenkins-slave/maven-repositories/1/org/apache/directory/jdbm/apacheds-jdbm2/2.0.0-M3-SNAPSHOT/apacheds-jdbm2-2.0.0-M3-SNAPSHOT.jar

[INFO] Installing <https://builds.apache.org/job/dir-apacheds-jdbm-jdk16-ubuntu-deploy/ws/jdbm2/pom.xml>
to /home/jenkins/jenkins-slave/maven-repositories/1/org/apache/directory/jdbm/apacheds-jdbm2/2.0.0-M3-SNAPSHOT/apacheds-jdbm2-2.0.0-M3-SNAPSHOT.pom
[INFO] --- maven-install-plugin:2.3.1:install (default-install) @ apacheds-jdbm2 ---
[INFO] 
[INFO] --- maven-bundle-plugin:2.3.7:install (default-install) @ apacheds-jdbm2 ---
[INFO] Installing org/apache/directory/jdbm/apacheds-jdbm2/2.0.0-M3-SNAPSHOT/apacheds-jdbm2-2.0.0-M3-SNAPSHOT.jar
[INFO] Writing OBR metadata
[INFO] Downloading: https://repository.apache.org/content/repositories/snapshots/org/apache/directory/jdbm/apacheds-jdbm2/2.0.0-M3-SNAPSHOT/maven-metadata.xml

[INFO] --- maven-deploy-plugin:2.7:deploy (default-deploy) @ apacheds-jdbm2 ---
Downloaded: https://repository.apache.org/content/repositories/snapshots/org/apache/directory/jdbm/apacheds-jdbm2/2.0.0-M3-SNAPSHOT/maven-metadata.xml
(801 B at 1.2 KB/sec)
Uploading: https://repository.apache.org/content/repositories/snapshots/org/apache/directory/jdbm/apacheds-jdbm2/2.0.0-M3-SNAPSHOT/apacheds-jdbm2-2.0.0-M3-20130414.051818-76.jar
Uploaded: https://repository.apache.org/content/repositories/snapshots/org/apache/directory/jdbm/apacheds-jdbm2/2.0.0-M3-SNAPSHOT/apacheds-jdbm2-2.0.0-M3-20130414.051818-76.jar
(140 KB at 179.7 KB/sec)
Uploading: https://repository.apache.org/content/repositories/snapshots/org/apache/directory/jdbm/apacheds-jdbm2/2.0.0-M3-SNAPSHOT/apacheds-jdbm2-2.0.0-M3-20130414.051818-76.pom
Uploaded: https://repository.apache.org/content/repositories/snapshots/org/apache/directory/jdbm/apacheds-jdbm2/2.0.0-M3-SNAPSHOT/apacheds-jdbm2-2.0.0-M3-20130414.051818-76.pom
(4 KB at 10.6 KB/sec)
Downloading: https://repository.apache.org/content/repositories/snapshots/org/apache/directory/jdbm/apacheds-jdbm2/maven-metadata.xml
Downloaded: https://repository.apache.org/content/repositories/snapshots/org/apache/directory/jdbm/apacheds-jdbm2/maven-metadata.xml
(365 B at 0.7 KB/sec)
Uploading: https://repository.apache.org/content/repositories/snapshots/org/apache/directory/jdbm/apacheds-jdbm2/2.0.0-M3-SNAPSHOT/maven-metadata.xml
Uploaded: https://repository.apache.org/content/repositories/snapshots/org/apache/directory/jdbm/apacheds-jdbm2/2.0.0-M3-SNAPSHOT/maven-metadata.xml
(801 B at 2.3 KB/sec)
Uploading: https://repository.apache.org/content/repositories/snapshots/org/apache/directory/jdbm/apacheds-jdbm2/maven-metadata.xml
Uploaded: https://repository.apache.org/content/repositories/snapshots/org/apache/directory/jdbm/apacheds-jdbm2/maven-metadata.xml
(365 B at 0.7 KB/sec)
[INFO] ------------------------------------------------------------------------
[INFO] Reactor Summary:
[INFO] 
[INFO] ApacheDS JDBM ..................................... SUCCESS [20.120s]
[INFO] ApacheDS JDBM Original Implementation ............. SUCCESS [32.445s]
[INFO] ApacheDS JDBM Implementation MVCC ................. FAILURE [3:56.458s]
[INFO] ------------------------------------------------------------------------
[INFO] BUILD FAILURE
[INFO] ------------------------------------------------------------------------
[INFO] Total time: 4:52.343s
[INFO] Finished at: Sun Apr 14 05:18:21 UTC 2013
[INFO] Final Memory: 20M/326M
[INFO] ------------------------------------------------------------------------
[JENKINS] Archiving <https://builds.apache.org/job/dir-apacheds-jdbm-jdk16-ubuntu-deploy/ws/pom.xml>
to /home/hudson/hudson/jobs/dir-apacheds-jdbm-jdk16-ubuntu-deploy/modules/org.apache.directory.jdbm$apacheds-jdbm-parent/builds/2013-04-14_05-13-10/archive/org.apache.directory.jdbm/apacheds-jdbm-parent/2.0.0-M3-SNAPSHOT/apacheds-jdbm-parent-2.0.0-M3-SNAPSHOT.pom
[JENKINS] Archiving <https://builds.apache.org/job/dir-apacheds-jdbm-jdk16-ubuntu-deploy/ws/jdbm1/pom.xml>
to /home/hudson/hudson/jobs/dir-apacheds-jdbm-jdk16-ubuntu-deploy/modules/org.apache.directory.jdbm$apacheds-jdbm1/builds/2013-04-14_05-13-10/archive/org.apache.directory.jdbm/apacheds-jdbm1/2.0.0-M3-SNAPSHOT/apacheds-jdbm1-2.0.0-M3-SNAPSHOT.pom
[JENKINS] Archiving <https://builds.apache.org/job/dir-apacheds-jdbm-jdk16-ubuntu-deploy/ws/jdbm1/target/apacheds-jdbm1-2.0.0-M3-SNAPSHOT.jar>
to /home/hudson/hudson/jobs/dir-apacheds-jdbm-jdk16-ubuntu-deploy/modules/org.apache.directory.jdbm$apacheds-jdbm1/builds/2013-04-14_05-13-10/archive/org.apache.directory.jdbm/apacheds-jdbm1/2.0.0-M3-20130414.051421-78/apacheds-jdbm1-2.0.0-M3-20130414.051421-78.jar
[JENKINS] Archiving <https://builds.apache.org/job/dir-apacheds-jdbm-jdk16-ubuntu-deploy/ws/jdbm2/pom.xml>
to /home/hudson/hudson/jobs/dir-apacheds-jdbm-jdk16-ubuntu-deploy/modules/org.apache.directory.jdbm$apacheds-jdbm2/builds/2013-04-14_05-13-10/archive/org.apache.directory.jdbm/apacheds-jdbm2/2.0.0-M3-SNAPSHOT/apacheds-jdbm2-2.0.0-M3-SNAPSHOT.pom
[JENKINS] Archiving <https://builds.apache.org/job/dir-apacheds-jdbm-jdk16-ubuntu-deploy/ws/jdbm2/target/apacheds-jdbm2-2.0.0-M3-SNAPSHOT.jar>
to /home/hudson/hudson/jobs/dir-apacheds-jdbm-jdk16-ubuntu-deploy/modules/org.apache.directory.jdbm$apacheds-jdbm2/builds/2013-04-14_05-13-10/archive/org.apache.directory.jdbm/apacheds-jdbm2/2.0.0-M3-20130414.051818-76/apacheds-jdbm2-2.0.0-M3-20130414.051818-76.jar
Waiting for Jenkins to finish collecting data
mavenExecutionResult exceptions not empty
message : Internal error: java.lang.reflect.UndeclaredThrowableException
cause : null
Stack trace : 
org.apache.maven.InternalErrorException: Internal error: java.lang.reflect.UndeclaredThrowableException
	at org.apache.maven.lifecycle.internal.BuilderCommon.handleBuildError(BuilderCommon.java:128)
	at org.apache.maven.lifecycle.internal.LifecycleModuleBuilder.buildProject(LifecycleModuleBuilder.java:95)
	at org.apache.maven.lifecycle.internal.LifecycleModuleBuilder.buildProject(LifecycleModuleBuilder.java:59)
	at org.apache.maven.lifecycle.internal.LifecycleStarter.singleThreadedBuild(LifecycleStarter.java:183)
	at org.apache.maven.lifecycle.internal.LifecycleStarter.execute(LifecycleStarter.java:161)
	at org.apache.maven.DefaultMaven.doExecute(DefaultMaven.java:320)
	at org.apache.maven.DefaultMaven.execute(DefaultMaven.java:156)
	at org.jvnet.hudson.maven3.launcher.Maven3Launcher.main(Maven3Launcher.java:79)
	at sun.reflect.NativeMethodAccessorImpl.invoke0(Native Method)
	at sun.reflect.NativeMethodAccessorImpl.invoke(NativeMethodAccessorImpl.java:39)
	at sun.reflect.DelegatingMethodAccessorImpl.invoke(DelegatingMethodAccessorImpl.java:25)
	at java.lang.reflect.Method.invoke(Method.java:597)
	at org.codehaus.plexus.classworlds.launcher.Launcher.launchStandard(Launcher.java:329)
	at org.codehaus.plexus.classworlds.launcher.Launcher.launch(Launcher.java:239)
	at org.jvnet.hudson.maven3.agent.Maven3Main.launch(Maven3Main.java:158)
	at hudson.maven.Maven3Builder.call(Maven3Builder.java:100)
	at hudson.maven.Maven3Builder.call(Maven3Builder.java:66)
	at hudson.remoting.UserRequest.perform(UserRequest.java:118)
	at hudson.remoting.UserRequest.perform(UserRequest.java:48)
	at hudson.remoting.Request$2.run(Request.java:326)
	at hudson.remoting.InterceptingExecutorService$1.call(InterceptingExecutorService.java:72)
	at java.util.concurrent.FutureTask$Sync.innerRun(FutureTask.java:303)
	at java.util.concurrent.FutureTask.run(FutureTask.java:138)
	at java.util.concurrent.ThreadPoolExecutor$Worker.runTask(ThreadPoolExecutor.java:886)
	at java.util.concurrent.ThreadPoolExecutor$Worker.run(ThreadPoolExecutor.java:908)
	at java.lang.Thread.run(Thread.java:619)
Caused by: java.lang.reflect.UndeclaredThrowableException
	at $Proxy2.setExecutedMojos(Unknown Source)
	at hudson.maven.MavenBuildProxy$Filter.setExecutedMojos(MavenBuildProxy.java:243)
	at hudson.maven.Maven3Builder$MavenExecutionListener.recordMojoEnded(Maven3Builder.java:439)
	at hudson.maven.Maven3Builder$MavenExecutionListener.mojoSucceeded(Maven3Builder.java:425)
	at org.apache.maven.lifecycle.internal.DefaultExecutionEventCatapult.fire(DefaultExecutionEventCatapult.java:87)
	at org.apache.maven.lifecycle.internal.DefaultExecutionEventCatapult.fire(DefaultExecutionEventCatapult.java:42)
	at org.apache.maven.lifecycle.internal.MojoExecutor.execute(MojoExecutor.java:228)
	at org.apache.maven.lifecycle.internal.MojoExecutor.execute(MojoExecutor.java:153)
	at org.apache.maven.lifecycle.internal.MojoExecutor.execute(MojoExecutor.java:145)
	at org.apache.maven.lifecycle.internal.LifecycleModuleBuilder.buildProject(LifecycleModuleBuilder.java:84)
	... 24 more
Caused by: java.io.InvalidClassException: java.util.concurrent.CopyOnWriteArrayList; serializable
and externalizable flags conflict
	at java.io.ObjectStreamClass.readNonProxy(ObjectStreamClass.java:672)
	at java.io.ObjectInputStream.readClassDescriptor(ObjectInputStream.java:827)
	at java.io.ObjectInputStream.readNonProxyDesc(ObjectInputStream.java:1583)
	at java.io.ObjectInputStream.readClassDesc(ObjectInputStream.java:1514)
	at java.io.ObjectInputStream.readOrdinaryObject(ObjectInputStream.java:1750)
	at java.io.ObjectInputStream.readObject0(ObjectInputStream.java:1347)
	at java.io.ObjectInputStream.readArray(ObjectInputStream.java:1685)
	at java.io.ObjectInputStream.readObject0(ObjectInputStream.java:1341)
	at java.io.ObjectInputStream.defaultReadFields(ObjectInputStream.java:1970)
	at java.io.ObjectInputStream.readSerialData(ObjectInputStream.java:1894)
	at java.io.ObjectInputStream.readOrdinaryObject(ObjectInputStream.java:1777)
	at java.io.ObjectInputStream.readObject0(ObjectInputStream.java:1347)
	at java.io.ObjectInputStream.readObject(ObjectInputStream.java:369)
	at hudson.remoting.UserRequest.deserialize(UserRequest.java:182)
	at hudson.remoting.UserRequest.perform(UserRequest.java:98)
	at hudson.remoting.UserRequest.perform(UserRequest.java:48)
	at hudson.remoting.Request$2.run(Request.java:326)
	at hudson.remoting.InterceptingExecutorService$1.call(InterceptingExecutorService.java:72)
	at java.util.concurrent.FutureTask$Sync.innerRun(FutureTask.java:334)
	at java.util.concurrent.FutureTask.run(FutureTask.java:166)
	at java.util.concurrent.ThreadPoolExecutor.runWorker(ThreadPoolExecutor.java:1145)
	at java.util.concurrent.ThreadPoolExecutor$Worker.run(ThreadPoolExecutor.java:615)
	at java.lang.Thread.run(Thread.java:722)
Sending e-mails to: notifications@directory.apache.org
channel stopped

Mime
View raw message