directory-notifications mailing list archives

Site index · List index
Message view « Date » · « Thread »
Top « Date » · « Thread »
From Apache Jenkins Server <jenk...@builds.apache.org>
Subject Build failed in Jenkins: dir-apacheds-jdk16-win #368
Date Wed, 03 Apr 2013 05:23:54 GMT
See <https://builds.apache.org/job/dir-apacheds-jdk16-win/368/>

------------------------------------------
[...truncated 3346 lines...]
NbAdded every 100ms : 
0, 0, 11
NbAdded every 100ms : 
0, 1
<-- Done

---> Running testInitialRefreshStopAndGo

Completed so far : 
(consumer1 completed) 

NbAdded every 100ms : 
0, 10
<-- Done

--->Running testInitialRefresh4Consumers

Completed so far : 
(consumer2 completed) 
(consumer4 completed) 
(consumer1 completed) 
(consumer3 completed) 

<-- Done

---> Running testInitialRefreshLoad

NbAdded every 100ms : 
0, 11
<-- Done
Tests run: 4, Failures: 0, Errors: 0, Skipped: 0, Time elapsed: 22.164 sec
Running org.apache.directory.server.replication.ClientServerReplicationIT
------------------------------------- Stop consumer
------------------------------------- Start consumer
------------------------------------- Stop consumer
------------------------------------- Start consumer
------------------------------------- Stop consumer
------------------------------------- Start consumer
------------------------------------- Stop consumer
------------------------------------- Start consumer
------------------------------------- Stop consumer
------------------------------------- Start consumer
------------------------------------- Stop consumer
------------------------------------- Start consumer
------------------------------------- Stop consumer
------------------------------------- Start consumer
------------------------------------- Stop consumer
------------------------------------- Start consumer
------------------------------------- Stop consumer
------------------------------------- Start consumer
------------------------------------- Stop consumer
------------------------------------- Start consumer
>--------------------------------------- Adding Entry
    dn[n]: cn=user13,dc=example,dc=com
    objectclass: person
    cn: user13
    sn: user13

>--------------------------------------- Added 
>--------------------------------------- Modifying MessageType : MODIFY_REQUEST
Message ID : -1
    Modify Request
        Object : 'cn=user13,dc=example,dc=com'
            Modification[0]
                Operation :  add
                Modification
userPassword: secret
org.apache.directory.api.ldap.model.message.ModifyRequestImpl@caa59306
>--------------------------------------- Modified 
Tests run: 5, Failures: 0, Errors: 0, Skipped: 2, Time elapsed: 43.554 sec
Running org.apache.directory.server.replication.StaleEventLogDetectionIT

---> Running testDeleteStaleEventLog

NbAdded every 100ms : 
0, 11
<-- Done
Tests run: 1, Failures: 0, Errors: 0, Skipped: 0, Time elapsed: 29.55 sec
Running org.apache.directory.server.schema.SchemaIT

Results :

Tests run: 405, Failures: 0, Errors: 0, Skipped: 15

[WARNING] Could not delete temp direcotry F:\hudson\hudson-slave\workspace\dir-apacheds-jdk16-win\trunk\server-integ\target\surefire
because File F:\hudson\hudson-slave\workspace\dir-apacheds-jdk16-win\trunk\server-integ\target\surefire\surefirebooter4513157059514932657.jar
unable to be deleted.
[JENKINS] Recording test results
[INFO] ------------------------------------------------------------------------
[INFO] Reactor Summary:
[INFO] 
[INFO] ApacheDS .......................................... SUCCESS [5.316s]
[INFO] ApacheDS I18n ..................................... SUCCESS [5.279s]
[INFO] ApacheDS Core Constants ........................... SUCCESS [2.522s]
[INFO] ApacheDS Core API ................................. SUCCESS [25.141s]
[INFO] ApacheDS Core Shared .............................. SUCCESS [2.898s]
[INFO] ApacheDS Interceptors ............................. SUCCESS [0.164s]
[INFO] ApacheDS AdministrativePoint Interceptor .......... SUCCESS [1.992s]
[INFO] ApacheDS Authentication Interceptor ............... SUCCESS [5.261s]
[INFO] ApacheDS Authorization Interceptor ................ SUCCESS [5.919s]
[INFO] ApacheDS ChangeLog Interceptor .................... SUCCESS [4.210s]
[INFO] ApacheDS Collective Attribute Interceptor ......... SUCCESS [1.550s]
[INFO] ApacheDS Event Interceptor ........................ SUCCESS [1.730s]
[INFO] ApacheDS Exception Interceptor .................... SUCCESS [1.419s]
[INFO] ApacheDS Journal Interceptor ...................... SUCCESS [1.407s]
[INFO] ApacheDS Normalization Interceptor ................ SUCCESS [3.378s]
[INFO] ApacheDS Operational Attribute Interceptor ........ SUCCESS [1.737s]
[INFO] ApacheDS Referral Interceptor ..................... SUCCESS [1.479s]
[INFO] ApacheDS Schema Interceptor ....................... SUCCESS [7.603s]
[INFO] ApacheDS Subtree Interceptor ...................... SUCCESS [11.621s]
[INFO] ApacheDS Triggers Interceptor ..................... SUCCESS [2.432s]
[INFO] ApacheDS Core ..................................... SUCCESS [6.212s]
[INFO] ApacheDS Core AVL ................................. SUCCESS [17.009s]
[INFO] ApacheDS Generalized (X) DBM Partition ............ SUCCESS [50.614s]
[INFO] ApacheDS LDIF Partition ........................... SUCCESS [22.030s]
[INFO] ApacheDS JDBM Partition ........................... SUCCESS [41.666s]
[INFO] ApacheDS Core Annotations ......................... SUCCESS [56.107s]
[INFO] ApacheDS Core JNDI ................................ SUCCESS [5.354s]
[INFO] ApacheDS Protocol Kerberos Codec .................. SUCCESS [19.906s]
[INFO] ApacheDS Interceptors for Kerberos ................ SUCCESS [10.797s]
[INFO] ApacheDS Protocol Dhcp ............................ SUCCESS [3.441s]
[INFO] ApacheDS Protocol Shared .......................... SUCCESS [2.191s]
[INFO] ApacheDS Protocol Dns ............................. SUCCESS [4.343s]
[INFO] ApacheDS Protocol Kerberos ........................ SUCCESS [5.635s]
[INFO] ApacheDS Protocol Ldap ............................ SUCCESS [1:52.207s]
[INFO] ApacheDS Protocol Ntp ............................. SUCCESS [4.119s]
[INFO] Apacheds Server Annotations ....................... SUCCESS [1:10.135s]
[INFO] ApacheDS Server Config ............................ SUCCESS [39.271s]
[INFO] ApacheDS Server JNDI .............................. SUCCESS [5.712s]
[INFO] ApacheDS Test Framework ........................... SUCCESS [2:20.661s]
[INFO] ApacheDS All ...................................... SUCCESS [16.310s]
[INFO] ApacheDS Logger Interceptor ....................... SUCCESS [10.604s]
[INFO] ApacheDS Password Hashing Interceptor ............. SUCCESS [2.895s]
[INFO] ApacheDS Core Integration ......................... SUCCESS [36:27.288s]
[INFO] ApacheDS Server Integration ....................... FAILURE [30:40.644s]
[INFO] ApacheDS DirectoryService-WebApp bridge ........... SKIPPED
[INFO] ApacheDS Jetty HTTP Server Integration ............ SKIPPED
[INFO] ApacheDS Service Builder .......................... SKIPPED
[INFO] ApacheDS Protocol Kerberos Test ................... SKIPPED
[INFO] Apache Directory LDAP Client API test ............. SKIPPED
[INFO] kerberos-client ................................... SKIPPED
[INFO] ApacheDS Service .................................. SKIPPED
[INFO] ApacheDS Wrapper .................................. SKIPPED
[INFO] ApacheDS Installers Maven Plugin .................. SKIPPED
[INFO] ApacheDS Installers ............................... SKIPPED
[INFO] ------------------------------------------------------------------------
[INFO] BUILD FAILURE
[INFO] ------------------------------------------------------------------------
[INFO] Total time: 1:19:33.899s
[INFO] Finished at: Wed Apr 03 06:22:54 BST 2013
[INFO] Final Memory: 58M/282M
[INFO] ------------------------------------------------------------------------
[JENKINS] Archiving disabled
[JENKINS] Archiving disabled
[JENKINS] Archiving disabled
[JENKINS] Archiving disabled
[JENKINS] Archiving disabled
[JENKINS] Archiving disabled
[JENKINS] Archiving disabled
[JENKINS] Archiving disabled
[JENKINS] Archiving disabled
[JENKINS] Archiving disabled
[JENKINS] Archiving disabled
[JENKINS] Archiving disabled
[JENKINS] Archiving disabled
[JENKINS] Archiving disabled
[JENKINS] Archiving disabled
[JENKINS] Archiving disabled
[JENKINS] Archiving disabled
[JENKINS] Archiving disabled
[JENKINS] Archiving disabled
[JENKINS] Archiving disabled
[JENKINS] Archiving disabled
[JENKINS] Archiving disabled
[JENKINS] Archiving disabled
[JENKINS] Archiving disabled
[JENKINS] Archiving disabled
[JENKINS] Archiving disabled
[JENKINS] Archiving disabled
[JENKINS] Archiving disabled
[JENKINS] Archiving disabled
[JENKINS] Archiving disabled
[JENKINS] Archiving disabled
[JENKINS] Archiving disabled
[JENKINS] Archiving disabled
[JENKINS] Archiving disabled
[JENKINS] Archiving disabled
[JENKINS] Archiving disabled
[JENKINS] Archiving disabled
[JENKINS] Archiving disabled
[JENKINS] Archiving disabled
[JENKINS] Archiving disabled
[JENKINS] Archiving disabled
[JENKINS] Archiving disabled
[JENKINS] Archiving disabled
[JENKINS] Archiving disabled
[JENKINS] Archiving disabled
[JENKINS] Archiving disabled
[JENKINS] Archiving disabled
[JENKINS] Archiving disabled
[JENKINS] Archiving disabled
[JENKINS] Archiving disabled
[JENKINS] Archiving disabled
[JENKINS] Archiving disabled
[JENKINS] Archiving disabled
[JENKINS] Archiving disabled
Waiting for Jenkins to finish collecting data
mavenExecutionResult exceptions not empty
message : Failed to execute goal org.apache.maven.plugins:maven-surefire-plugin:2.12.2:test
(default-test) on project apacheds-server-integ: Failure or timeout
cause : Failure or timeout
Stack trace : 
org.apache.maven.lifecycle.LifecycleExecutionException: Failed to execute goal org.apache.maven.plugins:maven-surefire-plugin:2.12.2:test
(default-test) on project apacheds-server-integ: Failure or timeout
	at org.apache.maven.lifecycle.internal.MojoExecutor.execute(MojoExecutor.java:217)
	at org.apache.maven.lifecycle.internal.MojoExecutor.execute(MojoExecutor.java:153)
	at org.apache.maven.lifecycle.internal.MojoExecutor.execute(MojoExecutor.java:145)
	at org.apache.maven.lifecycle.internal.LifecycleModuleBuilder.buildProject(LifecycleModuleBuilder.java:84)
	at org.apache.maven.lifecycle.internal.LifecycleModuleBuilder.buildProject(LifecycleModuleBuilder.java:59)
	at org.apache.maven.lifecycle.internal.LifecycleStarter.singleThreadedBuild(LifecycleStarter.java:183)
	at org.apache.maven.lifecycle.internal.LifecycleStarter.execute(LifecycleStarter.java:161)
	at org.apache.maven.DefaultMaven.doExecute(DefaultMaven.java:319)
	at org.apache.maven.DefaultMaven.execute(DefaultMaven.java:156)
	at org.jvnet.hudson.maven3.launcher.Maven3Launcher.main(Maven3Launcher.java:79)
	at sun.reflect.NativeMethodAccessorImpl.invoke0(Native Method)
	at sun.reflect.NativeMethodAccessorImpl.invoke(NativeMethodAccessorImpl.java:39)
	at sun.reflect.DelegatingMethodAccessorImpl.invoke(DelegatingMethodAccessorImpl.java:25)
	at java.lang.reflect.Method.invoke(Method.java:597)
	at org.codehaus.plexus.classworlds.launcher.Launcher.launchStandard(Launcher.java:329)
	at org.codehaus.plexus.classworlds.launcher.Launcher.launch(Launcher.java:239)
	at org.jvnet.hudson.maven3.agent.Maven3Main.launch(Maven3Main.java:158)
	at hudson.maven.Maven3Builder.call(Maven3Builder.java:100)
	at hudson.maven.Maven3Builder.call(Maven3Builder.java:66)
	at hudson.remoting.UserRequest.perform(UserRequest.java:118)
	at hudson.remoting.UserRequest.perform(UserRequest.java:48)
	at hudson.remoting.Request$2.run(Request.java:326)
	at hudson.remoting.InterceptingExecutorService$1.call(InterceptingExecutorService.java:72)
	at java.util.concurrent.FutureTask$Sync.innerRun(FutureTask.java:303)
	at java.util.concurrent.FutureTask.run(FutureTask.java:138)
	at java.util.concurrent.ThreadPoolExecutor$Worker.runTask(ThreadPoolExecutor.java:886)
	at java.util.concurrent.ThreadPoolExecutor$Worker.run(ThreadPoolExecutor.java:908)
	at java.lang.Thread.run(Thread.java:662)
Caused by: org.apache.maven.plugin.MojoExecutionException: Failure or timeout
	at org.apache.maven.plugin.surefire.SurefirePlugin.assertNoFailureOrTimeout(SurefirePlugin.java:177)
	at org.apache.maven.plugin.surefire.SurefirePlugin.handleSummary(SurefirePlugin.java:158)
	at org.apache.maven.plugin.surefire.AbstractSurefireMojo.executeAfterPreconditionsChecked(AbstractSurefireMojo.java:626)
	at org.apache.maven.plugin.surefire.AbstractSurefireMojo.execute(AbstractSurefireMojo.java:587)
	at org.apache.maven.plugin.DefaultBuildPluginManager.executeMojo(DefaultBuildPluginManager.java:107)
	at org.apache.maven.lifecycle.internal.MojoExecutor.execute(MojoExecutor.java:209)
	... 27 more
Sending e-mails to: notifications@directory.apache.org
channel stopped
Process leaked file descriptors. See http://wiki.jenkins-ci.org/display/JENKINS/Spawning+processes+from+build
for more information

Mime
View raw message