directory-notifications mailing list archives

Site index · List index
Message view « Date » · « Thread »
Top « Date » · « Thread »
From Apache Jenkins Server <jenk...@builds.apache.org>
Subject Build failed in Jenkins: dir-studio-jdk16-win #816
Date Fri, 26 Apr 2013 23:47:20 GMT
See <https://builds.apache.org/job/dir-studio-jdk16-win/816/>

------------------------------------------
[...truncated 1993 lines...]
[INFO] Copying 48 resources
[INFO] Copying 3 resources
[INFO] 
[INFO] --- studio-maven-plugin:1.0.5:prepare-jar-package (default) @ apacheds.configuration
---
[INFO] 
[INFO] --- maven-compiler-plugin:2.3.2:compile (default-compile) @ apacheds.configuration
---
[INFO] Compiling 234 source files to F:\hudson\hudson-slave\workspace\dir-studio-jdk16-win\trunk\plugins\apacheds.configuration\target\classes
[INFO] 
[INFO] --- maven-bundle-plugin:2.3.4:manifest (generate-manifest) @ apacheds.configuration
---
[INFO] [debug] execute contextualize
[INFO] Using 'UTF-8' encoding to copy filtered resources.

[INFO] --- maven-resources-plugin:2.5:testResources (default-testResources) @ apacheds.configuration
---
[INFO] skip non existing resourceDirectory F:\hudson\hudson-slave\workspace\dir-studio-jdk16-win\trunk\plugins\apacheds.configuration\src\test\resources
[INFO] Copying 3 resources
[INFO] 
[INFO] --- maven-compiler-plugin:2.3.2:testCompile (default-testCompile) @ apacheds.configuration
---
[INFO] Nothing to compile - all classes are up to date
[INFO] 
[INFO] --- maven-surefire-plugin:2.12:test (default-test) @ apacheds.configuration ---
[INFO] Tests are skipped.
[INFO] 
[INFO] --- maven-jar-plugin:2.4:jar (default-jar) @ apacheds.configuration ---
[INFO] Building jar: F:\hudson\hudson-slave\workspace\dir-studio-jdk16-win\trunk\plugins\apacheds.configuration\target\apacheds.configuration-2.0.0-SNAPSHOT.jar
[INFO] 
[INFO] --- maven-site-plugin:3.0:attach-descriptor (attach-descriptor) @ apacheds.configuration
---
[INFO] Checking legal files in: apacheds.configuration-2.0.0-SNAPSHOT.jar
[INFO] 
[INFO] --- tools-maven-plugin:1.4:verify-legal-files (verify-legal-files) @ apacheds.configuration
---
[INFO] [INFO] Installing F:\hudson\hudson-slave\workspace\dir-studio-jdk16-win\trunk\plugins\apacheds.configuration\target\apacheds.configuration-2.0.0-SNAPSHOT.jar
to f:\hudson\hudson-slave\maven-repositories\0\org\apache\directory\studio\apacheds.configuration\2.0.0-SNAPSHOT\apacheds.configuration-2.0.0-SNAPSHOT.jar

[INFO] --- maven-install-plugin:2.3.1:install (default-install) @ apacheds.configuration ---
[INFO] Installing F:\hudson\hudson-slave\workspace\dir-studio-jdk16-win\trunk\plugins\apacheds.configuration\pom.xml
to f:\hudson\hudson-slave\maven-repositories\0\org\apache\directory\studio\apacheds.configuration\2.0.0-SNAPSHOT\apacheds.configuration-2.0.0-SNAPSHOT.pom
[INFO]                                                                         
[INFO] ------------------------------------------------------------------------
[INFO] Building Apache Directory Studio ApacheDS 2.0 Configuration 2.0.0-SNAPSHOT
[INFO] ------------------------------------------------------------------------
[INFO] 
[INFO] --- maven-clean-plugin:2.4.1:clean (default-clean) @ apacheds.configuration.v2 ---
[INFO] Deleting F:\hudson\hudson-slave\workspace\dir-studio-jdk16-win\trunk\plugins\apacheds.configuration.v2\target
[INFO] 
[INFO] --- maven-remote-resources-plugin:1.2.1:process (default) @ apacheds.configuration.v2
---
[debug] execute contextualize
[INFO] Using 'UTF-8' encoding to copy filtered resources.
[INFO] 
[INFO] --- maven-resources-plugin:2.5:resources (default-resources) @ apacheds.configuration.v2
---
[INFO] Copying 4 resources
[INFO] Copying 8 resources to resources
[INFO] Copying 1 resource
[INFO] Copying 15 resources
[INFO] Copying 3 resources
[INFO] 
[INFO] --- studio-maven-plugin:1.0.5:prepare-jar-package (default) @ apacheds.configuration.v2
---
[INFO] Compiling 41 source files to F:\hudson\hudson-slave\workspace\dir-studio-jdk16-win\trunk\plugins\apacheds.configuration.v2\target\classes
[INFO] 
[INFO] --- maven-compiler-plugin:2.3.2:compile (default-compile) @ apacheds.configuration.v2
---
[INFO] -------------------------------------------------------------
[ERROR] COMPILATION ERROR : 
[INFO] -------------------------------------------------------------
[ERROR] \hudson\hudson-slave\workspace\dir-studio-jdk16-win\trunk\plugins\apacheds.configuration.v2\src\main\java\org\apache\directory\studio\apacheds\configuration\v2\editor\PasswordPoliciesMasterDetailsBlock.java:[362,50]
cannot find symbol
symbol  : method removePasswordPolicies(org.apache.directory.server.config.beans.PasswordPolicyBean)
location: class org.apache.directory.server.config.beans.AuthenticationInterceptorBean
[INFO] 1 error
[INFO] -------------------------------------------------------------
[INFO] ------------------------------------------------------------------------
[INFO] Reactor Summary:
[INFO] 
[INFO] Apache Directory Studio ........................... SUCCESS [7.368s]
[INFO] Apache Directory Studio Repository ................ SUCCESS [30.698s]
[INFO] Apache Directory Studio Libraries Plugins ......... SUCCESS [0.600s]
[INFO] SLF4J API Module (for Apache Directory Studio) .... SUCCESS [22.621s]
[INFO] Ehcache Core (for Apache Directory Studio) ........ SUCCESS [2.196s]
[INFO] AntLR Parser Generator (for Apache Directory Studio)  SUCCESS [1.733s]
[INFO] Apache Commons Codec (for Apache Directory Studio)  SUCCESS [1.090s]
[INFO] Apache Commons Collections (for Apache Directory Studio)  SUCCESS [1.889s]
[INFO] Apache Commons IO (for Apache Directory Studio) ... SUCCESS [1.003s]
[INFO] Apache Commons Lang (for Apache Directory Studio) . SUCCESS [1.258s]
[INFO] Apache Commons Logging (for Apache Directory Studio)  SUCCESS [0.848s]
[INFO] Apache Commons Pool (for Apache Directory Studio) . SUCCESS [0.882s]
[INFO] Apache HttpComponents Core (for Apache Directory Studio)  SUCCESS [1.001s]
[INFO] Apache HttpComponents Client (for Apache Directory Studio)  SUCCESS [1.136s]
[INFO] Log4j (for Apache Directory Studio) ............... SUCCESS [1.046s]
[INFO] Legion of the Bouncy Castle Java Cryptography APIs (for Apache Directory Studio)  SUCCESS
[1.377s]
[INFO] dom4j (for Apache Directory Studio) ............... SUCCESS [1.165s]
[INFO] SLF4J LOG4J-12 Binding (for Apache Directory Studio)  SUCCESS [1.214s]
[INFO] XPP3 (for Apache Directory Studio) ................ SUCCESS [0.783s]
[INFO] Apache Directory Studio Plugins ................... SUCCESS [0.241s]
[INFO] Apache Directory Studio Common UI ................. SUCCESS [5.579s]
[INFO] Apache Directory Studio Common Core ............... SUCCESS [2.512s]
[INFO] Apache Directory Studio LDIF Parser ............... SUCCESS [7.291s]
[INFO] Apache Directory Studio Connection Core ........... SUCCESS [10.122s]
[INFO] Apache Directory Studio Connection UI ............. SUCCESS [12.162s]
[INFO] Apache Directory Studio LDAP Browser Core ......... SUCCESS [18.104s]
[INFO] Apache Directory Studio LDAP Browser Common ....... SUCCESS [22.791s]
[INFO] Apache Directory Studio Value Editors ............. SUCCESS [10.684s]
[INFO] Apache Directory Studio ACI Item Editor ........... SUCCESS [8.379s]
[INFO] Apache Directory Studio ApacheDS Launcher ......... SUCCESS [5.522s]
[INFO] Apache Directory Studio ApacheDS Configuration .... SUCCESS [20.414s]
[INFO] Apache Directory Studio ApacheDS 2.0 Configuration  FAILURE [13.944s]
[INFO] Apache Directory Studio LDIF Editor ............... SKIPPED
[INFO] Apache Directory Studio LDAP Browser UI ........... SKIPPED
[INFO] Apache Directory Studio LDAP Servers .............. SKIPPED
[INFO] Apache Directory Studio ApacheDS 1.5.3 LDAP Server Adapter  SKIPPED
[INFO] Apache Directory Studio ApacheDS 1.5.4 LDAP Server Adapter  SKIPPED
[INFO] Apache Directory Studio ApacheDS 1.5.5 LDAP Server Adapter  SKIPPED
[INFO] Apache Directory Studio ApacheDS 1.5.6 LDAP Server Adapter  SKIPPED
[INFO] Apache Directory Studio ApacheDS 1.5.7 LDAP Server Adapter  SKIPPED
[INFO] Apache Directory Studio ApacheDS 2.0.0 LDAP Server Adapter  SKIPPED
[INFO] Apache Directory Studio RCP ....................... SKIPPED
[INFO] Apache Directory Studio Schema Editor ............. SKIPPED
[INFO] Apache Directory Studio Apache DS Help ............ SKIPPED
[INFO] Apache Directory Studio Apache DS Configuration Help  SKIPPED
[INFO] Apache Directory Studio LDAP Browser Help ......... SKIPPED
[INFO] Apache Directory Studio LDIF Editor Help .......... SKIPPED
[INFO] Apache Directory Studio RCP Help .................. SKIPPED
[INFO] Apache Directory Studio Schema Editor Help ........ SKIPPED
[INFO] Apache Directory Studio Help Plugins .............. SKIPPED
[INFO] Apache Directory Studio Feature Plugins ........... SKIPPED
[INFO] Apache Directory Studio ApacheDS Configuration Feature  SKIPPED
[INFO] Apache Directory Studio ApacheDS 2.0 Configuration Feature  SKIPPED
[INFO] Apache Directory Studio ApacheDS Feature .......... SKIPPED
[INFO] Apache Directory Studio LDAP Browser Feature ...... SKIPPED
[INFO] Apache Directory Studio LDAP Servers Feature ...... SKIPPED
[INFO] Apache Directory Studio LDIF Editor Feature ....... SKIPPED
[INFO] Apache Directory Studio RCP Feature ............... SKIPPED
[INFO] Apache Directory Studio Schema Editor Feature ..... SKIPPED
[INFO] ------------------------------------------------------------------------
[INFO] BUILD FAILURE
[INFO] ------------------------------------------------------------------------
[INFO] Total time: 3:43.819s
[INFO] Finished at: Sat Apr 27 00:46:10 BST 2013
[INFO] Final Memory: 139M/250M
[INFO] ------------------------------------------------------------------------
[JENKINS] Archiving disabled
[JENKINS] Archiving disabled
[JENKINS] Archiving disabled
[JENKINS] Archiving disabled
[JENKINS] Archiving disabled
[JENKINS] Archiving disabled
[JENKINS] Archiving disabled
[JENKINS] Archiving disabled
[JENKINS] Archiving disabled
[JENKINS] Archiving disabled
[JENKINS] Archiving disabled
[JENKINS] Archiving disabled
[JENKINS] Archiving disabled
[JENKINS] Archiving disabled
[JENKINS] Archiving disabled
[JENKINS] Archiving disabled
[JENKINS] Archiving disabled
[JENKINS] Archiving disabled
[JENKINS] Archiving disabled
[JENKINS] Archiving disabled
[JENKINS] Archiving disabled
[JENKINS] Archiving disabled
[JENKINS] Archiving disabled
[JENKINS] Archiving disabled
[JENKINS] Archiving disabled
[JENKINS] Archiving disabled
[JENKINS] Archiving disabled
[JENKINS] Archiving disabled
[JENKINS] Archiving disabled
[JENKINS] Archiving disabled
[JENKINS] Archiving disabled
[JENKINS] Archiving disabled
[JENKINS] Archiving disabled
[JENKINS] Archiving disabled
[JENKINS] Archiving disabled
[JENKINS] Archiving disabled
[JENKINS] Archiving disabled
[JENKINS] Archiving disabled
[JENKINS] Archiving disabled
[JENKINS] Archiving disabled
[JENKINS] Archiving disabled
[JENKINS] Archiving disabled
[JENKINS] Archiving disabled
[JENKINS] Archiving disabled
[JENKINS] Archiving disabled
[JENKINS] Archiving disabled
[JENKINS] Archiving disabled
[JENKINS] Archiving disabled
[JENKINS] Archiving disabled
[JENKINS] Archiving disabled
[JENKINS] Archiving disabled
[JENKINS] Archiving disabled
[JENKINS] Archiving disabled
[JENKINS] Archiving disabled
[JENKINS] Archiving disabled
[JENKINS] Archiving disabled
[JENKINS] Archiving disabled
[JENKINS] Archiving disabled
[JENKINS] Archiving disabled
Waiting for Jenkins to finish collecting data
mavenExecutionResult exceptions not empty
message : Failed to execute goal org.apache.maven.plugins:maven-compiler-plugin:2.3.2:compile
(default-compile) on project apacheds.configuration.v2: Compilation failure
\hudson\hudson-slave\workspace\dir-studio-jdk16-win\trunk\plugins\apacheds.configuration.v2\src\main\java\org\apache\directory\studio\apacheds\configuration\v2\editor\PasswordPoliciesMasterDetailsBlock.java:[362,50]
cannot find symbol
symbol  : method removePasswordPolicies(org.apache.directory.server.config.beans.PasswordPolicyBean)
location: class org.apache.directory.server.config.beans.AuthenticationInterceptorBean

cause : Compilation failure
\hudson\hudson-slave\workspace\dir-studio-jdk16-win\trunk\plugins\apacheds.configuration.v2\src\main\java\org\apache\directory\studio\apacheds\configuration\v2\editor\PasswordPoliciesMasterDetailsBlock.java:[362,50]
cannot find symbol
symbol  : method removePasswordPolicies(org.apache.directory.server.config.beans.PasswordPolicyBean)
location: class org.apache.directory.server.config.beans.AuthenticationInterceptorBean

Stack trace : 
org.apache.maven.lifecycle.LifecycleExecutionException: Failed to execute goal org.apache.maven.plugins:maven-compiler-plugin:2.3.2:compile
(default-compile) on project apacheds.configuration.v2: Compilation failure
\hudson\hudson-slave\workspace\dir-studio-jdk16-win\trunk\plugins\apacheds.configuration.v2\src\main\java\org\apache\directory\studio\apacheds\configuration\v2\editor\PasswordPoliciesMasterDetailsBlock.java:[362,50]
cannot find symbol
symbol  : method removePasswordPolicies(org.apache.directory.server.config.beans.PasswordPolicyBean)
location: class org.apache.directory.server.config.beans.AuthenticationInterceptorBean

	at org.apache.maven.lifecycle.internal.MojoExecutor.execute(MojoExecutor.java:213)
	at org.apache.maven.lifecycle.internal.MojoExecutor.execute(MojoExecutor.java:153)
	at org.apache.maven.lifecycle.internal.MojoExecutor.execute(MojoExecutor.java:145)
	at org.apache.maven.lifecycle.internal.LifecycleModuleBuilder.buildProject(LifecycleModuleBuilder.java:84)
	at org.apache.maven.lifecycle.internal.LifecycleModuleBuilder.buildProject(LifecycleModuleBuilder.java:59)
	at org.apache.maven.lifecycle.internal.LifecycleStarter.singleThreadedBuild(LifecycleStarter.java:183)
	at org.apache.maven.lifecycle.internal.LifecycleStarter.execute(LifecycleStarter.java:161)
	at org.apache.maven.DefaultMaven.doExecute(DefaultMaven.java:319)
	at org.apache.maven.DefaultMaven.execute(DefaultMaven.java:156)
	at org.jvnet.hudson.maven3.launcher.Maven3Launcher.main(Maven3Launcher.java:79)
	at sun.reflect.NativeMethodAccessorImpl.invoke0(Native Method)
	at sun.reflect.NativeMethodAccessorImpl.invoke(NativeMethodAccessorImpl.java:39)
	at sun.reflect.DelegatingMethodAccessorImpl.invoke(DelegatingMethodAccessorImpl.java:25)
	at java.lang.reflect.Method.invoke(Method.java:597)
	at org.codehaus.plexus.classworlds.launcher.Launcher.launchStandard(Launcher.java:329)
	at org.codehaus.plexus.classworlds.launcher.Launcher.launch(Launcher.java:239)
	at org.jvnet.hudson.maven3.agent.Maven3Main.launch(Maven3Main.java:158)
	at hudson.maven.Maven3Builder.call(Maven3Builder.java:100)
	at hudson.maven.Maven3Builder.call(Maven3Builder.java:66)
	at hudson.remoting.UserRequest.perform(UserRequest.java:118)
	at hudson.remoting.UserRequest.perform(UserRequest.java:48)
	at hudson.remoting.Request$2.run(Request.java:326)
	at hudson.remoting.InterceptingExecutorService$1.call(InterceptingExecutorService.java:72)
	at java.util.concurrent.FutureTask$Sync.innerRun(FutureTask.java:303)
	at java.util.concurrent.FutureTask.run(FutureTask.java:138)
	at java.util.concurrent.ThreadPoolExecutor$Worker.runTask(ThreadPoolExecutor.java:886)
	at java.util.concurrent.ThreadPoolExecutor$Worker.run(ThreadPoolExecutor.java:908)
	at java.lang.Thread.run(Thread.java:662)
Caused by: org.apache.maven.plugin.CompilationFailureException: Compilation failure
\hudson\hudson-slave\workspace\dir-studio-jdk16-win\trunk\plugins\apacheds.configuration.v2\src\main\java\org\apache\directory\studio\apacheds\configuration\v2\editor\PasswordPoliciesMasterDetailsBlock.java:[362,50]
cannot find symbol
symbol  : method removePasswordPolicies(org.apache.directory.server.config.beans.PasswordPolicyBean)
location: class org.apache.directory.server.config.beans.AuthenticationInterceptorBean

	at org.apache.maven.plugin.AbstractCompilerMojo.execute(AbstractCompilerMojo.java:656)
	at org.apache.maven.plugin.CompilerMojo.execute(CompilerMojo.java:128)
	at org.apache.maven.plugin.DefaultBuildPluginManager.executeMojo(DefaultBuildPluginManager.java:107)
	at org.apache.maven.lifecycle.internal.MojoExecutor.execute(MojoExecutor.java:209)
	... 27 more
channel stopped

Mime
View raw message