directory-notifications mailing list archives

Site index · List index
Message view « Date » · « Thread »
Top « Date » · « Thread »
From Apache Jenkins Server <jenk...@builds.apache.org>
Subject Build failed in Jenkins: dir-apacheds-jdk16-ubuntu-deploy #972
Date Tue, 23 Apr 2013 09:53:59 GMT
See <https://builds.apache.org/job/dir-apacheds-jdk16-ubuntu-deploy/972/>

------------------------------------------
[...truncated 4073 lines...]
	at org.apache.maven.lifecycle.internal.LifecycleStarter.singleThreadedBuild(LifecycleStarter.java:183)
	at org.apache.maven.lifecycle.internal.LifecycleStarter.execute(LifecycleStarter.java:161)
	at org.apache.maven.DefaultMaven.doExecute(DefaultMaven.java:320)
	at org.apache.maven.DefaultMaven.execute(DefaultMaven.java:156)
	at org.jvnet.hudson.maven3.launcher.Maven3Launcher.main(Maven3Launcher.java:79)
	at sun.reflect.NativeMethodAccessorImpl.invoke0(Native Method)
	at sun.reflect.NativeMethodAccessorImpl.invoke(NativeMethodAccessorImpl.java:39)
	at sun.reflect.DelegatingMethodAccessorImpl.invoke(DelegatingMethodAccessorImpl.java:25)
	at java.lang.reflect.Method.invoke(Method.java:597)
	at org.codehaus.plexus.classworlds.launcher.Launcher.launchStandard(Launcher.java:329)
	at org.codehaus.plexus.classworlds.launcher.Launcher.launch(Launcher.java:239)
	at org.jvnet.hudson.maven3.agent.Maven3Main.launch(Maven3Main.java:158)
	at hudson.maven.Maven3Builder.call(Maven3Builder.java:100)
	at hudson.maven.Maven3Builder.call(Maven3Builder.java:66)
	at hudson.remoting.UserRequest.perform(UserRequest.java:118)
	at hudson.remoting.UserRequest.perform(UserRequest.java:48)
	at hudson.remoting.Request$2.run(Request.java:326)
	at hudson.remoting.InterceptingExecutorService$1.call(InterceptingExecutorService.java:72)
	at java.util.concurrent.FutureTask$Sync.innerRun(FutureTask.java:303)
	at java.util.concurrent.FutureTask.run(FutureTask.java:138)
	at java.util.concurrent.ThreadPoolExecutor$Worker.runTask(ThreadPoolExecutor.java:886)
	at java.util.concurrent.ThreadPoolExecutor$Worker.run(ThreadPoolExecutor.java:908)
	at java.lang.Thread.run(Thread.java:662)
Caused by: org.xmlpull.v1.XmlPullParserException: unexpected type (position:END_DOCUMENT null@3:1
in java.io.InputStreamReader@15840d5) 
	at org.kxml2.io.KXmlParser.exception(Unknown Source)
	at org.kxml2.io.KXmlParser.nextTag(Unknown Source)
	at org.apache.felix.bundlerepository.impl.PullParser.parseRepository(PullParser.java:43)
	at org.apache.felix.bundlerepository.impl.DataModelHelperImpl.repository(DataModelHelperImpl.java:147)
	at org.apache.felix.bundlerepository.impl.DataModelHelperImpl.repository(DataModelHelperImpl.java:118)
	at org.apache.felix.obrplugin.ObrUpdate.parseRepositoryXml(ObrUpdate.java:316)
	... 30 more

[INFO] --- maven-bundle-plugin:2.3.7:install (default-install) @ apacheds-protocol-dns ---
[INFO] Downloading: https://repository.apache.org/content/repositories/snapshots/org/apache/directory/server/apacheds-protocol-dns/2.0.0-M12-SNAPSHOT/maven-metadata.xml

[INFO] --- maven-deploy-plugin:2.7:deploy (default-deploy) @ apacheds-protocol-dns ---
Downloaded: https://repository.apache.org/content/repositories/snapshots/org/apache/directory/server/apacheds-protocol-dns/2.0.0-M12-SNAPSHOT/maven-metadata.xml
(2 KB at 1.6 KB/sec)
Uploading: https://repository.apache.org/content/repositories/snapshots/org/apache/directory/server/apacheds-protocol-dns/2.0.0-M12-SNAPSHOT/apacheds-protocol-dns-2.0.0-M12-20130423.094924-42.jar
Uploaded: https://repository.apache.org/content/repositories/snapshots/org/apache/directory/server/apacheds-protocol-dns/2.0.0-M12-SNAPSHOT/apacheds-protocol-dns-2.0.0-M12-20130423.094924-42.jar
(91 KB at 247.3 KB/sec)
Uploading: https://repository.apache.org/content/repositories/snapshots/org/apache/directory/server/apacheds-protocol-dns/2.0.0-M12-SNAPSHOT/apacheds-protocol-dns-2.0.0-M12-20130423.094924-42.pom
Uploaded: https://repository.apache.org/content/repositories/snapshots/org/apache/directory/server/apacheds-protocol-dns/2.0.0-M12-SNAPSHOT/apacheds-protocol-dns-2.0.0-M12-20130423.094924-42.pom
(4 KB at 11.8 KB/sec)
Downloading: https://repository.apache.org/content/repositories/snapshots/org/apache/directory/server/apacheds-protocol-dns/maven-metadata.xml
Downloaded: https://repository.apache.org/content/repositories/snapshots/org/apache/directory/server/apacheds-protocol-dns/maven-metadata.xml
(416 B at 1.6 KB/sec)
Uploading: https://repository.apache.org/content/repositories/snapshots/org/apache/directory/server/apacheds-protocol-dns/2.0.0-M12-SNAPSHOT/maven-metadata.xml
Uploaded: https://repository.apache.org/content/repositories/snapshots/org/apache/directory/server/apacheds-protocol-dns/2.0.0-M12-SNAPSHOT/maven-metadata.xml
(2 KB at 3.3 KB/sec)
Uploading: https://repository.apache.org/content/repositories/snapshots/org/apache/directory/server/apacheds-protocol-dns/maven-metadata.xml
Uploaded: https://repository.apache.org/content/repositories/snapshots/org/apache/directory/server/apacheds-protocol-dns/maven-metadata.xml
(416 B at 0.7 KB/sec)
Uploading: https://repository.apache.org/content/repositories/snapshots/org/apache/directory/server/apacheds-protocol-dns/2.0.0-M12-SNAPSHOT/apacheds-protocol-dns-2.0.0-M12-20130423.094924-42-sources.jar
Uploaded: https://repository.apache.org/content/repositories/snapshots/org/apache/directory/server/apacheds-protocol-dns/2.0.0-M12-SNAPSHOT/apacheds-protocol-dns-2.0.0-M12-20130423.094924-42-sources.jar
(117 KB at 255.3 KB/sec)
Uploading: https://repository.apache.org/content/repositories/snapshots/org/apache/directory/server/apacheds-protocol-dns/2.0.0-M12-SNAPSHOT/maven-metadata.xml
Uploaded: https://repository.apache.org/content/repositories/snapshots/org/apache/directory/server/apacheds-protocol-dns/2.0.0-M12-SNAPSHOT/maven-metadata.xml
(2 KB at 3.2 KB/sec)
[INFO] Remote OBR update disabled (enable with -DremoteOBR)
[INFO] 
[INFO] --- maven-bundle-plugin:2.3.7:deploy (default-deploy) @ apacheds-protocol-dns ---
[INFO] [INFO] Deleting <https://builds.apache.org/job/dir-apacheds-jdk16-ubuntu-deploy/ws/trunk/protocol-kerberos/target>
                                                                        
[INFO] ------------------------------------------------------------------------
[INFO] Building ApacheDS Protocol Kerberos 2.0.0-M12-SNAPSHOT
[INFO] ------------------------------------------------------------------------
[INFO] 
[INFO] --- maven-clean-plugin:2.4.1:clean (default-clean) @ apacheds-protocol-kerberos ---
[INFO] 
[INFO] --- maven-remote-resources-plugin:1.2.1:process (default) @ apacheds-protocol-kerberos
---
[INFO] [debug] execute contextualize
[INFO] Using 'UTF-8' encoding to copy filtered resources.

[INFO] --- maven-resources-plugin:2.5:resources (default-resources) @ apacheds-protocol-kerberos
---
[INFO] Copying 0 resource
[INFO] Copying 3 resources
[INFO] 
[INFO] --- maven-compiler-plugin:2.5.1:compile (default-compile) @ apacheds-protocol-kerberos
---
[INFO] Compiling 33 source files to <https://builds.apache.org/job/dir-apacheds-jdk16-ubuntu-deploy/ws/trunk/protocol-kerberos/target/classes>
[debug] execute contextualize
[INFO] [INFO] Using 'UTF-8' encoding to copy filtered resources.

[INFO] --- maven-resources-plugin:2.5:testResources (default-testResources) @ apacheds-protocol-kerberos
---
[INFO] Copying 2 resources
[INFO] Copying 3 resources
[INFO] 
[INFO] --- maven-compiler-plugin:2.5.1:testCompile (default-testCompile) @ apacheds-protocol-kerberos
---
[INFO] Compiling 11 source files to <https://builds.apache.org/job/dir-apacheds-jdk16-ubuntu-deploy/ws/trunk/protocol-kerberos/target/test-classes>
[INFO] [INFO] Surefire report directory: <https://builds.apache.org/job/dir-apacheds-jdk16-ubuntu-deploy/ws/trunk/protocol-kerberos/target/surefire-reports>

-------------------------------------------------------
 T E S T S
-------------------------------------------------------

[INFO] --- maven-surefire-plugin:2.12.2:test (default-test) @ apacheds-protocol-kerberos ---
Running org.apache.directory.server.kerberos.protocol.TicketGrantingServiceTest
Tests run: 37, Failures: 0, Errors: 0, Skipped: 2, Time elapsed: 1.266 sec
Running org.apache.directory.server.kerberos.protocol.AuthenticationPolicyTest
Tests run: 7, Failures: 0, Errors: 0, Skipped: 0, Time elapsed: 0.009 sec
Running org.apache.directory.server.kerberos.protocol.TicketGrantingEncryptionTypeTest
Tests run: 6, Failures: 0, Errors: 0, Skipped: 1, Time elapsed: 0.074 sec
Running org.apache.directory.server.kerberos.protocol.EncTktInSkeyTest
Tests run: 1, Failures: 0, Errors: 0, Skipped: 0, Time elapsed: 0.014 sec
Running org.apache.directory.server.kerberos.protocol.AuthenticationEncryptionTypeTest
Tests run: 4, Failures: 0, Errors: 0, Skipped: 1, Time elapsed: 0.04 sec
Running org.apache.directory.server.kerberos.protocol.TicketGrantingPolicyTest
Tests run: 12, Failures: 0, Errors: 0, Skipped: 0, Time elapsed: 0.166 sec
Running org.apache.directory.server.kerberos.protocol.PreAuthenticationTest
Tests run: 4, Failures: 0, Errors: 0, Skipped: 0, Time elapsed: 0 sec
Running org.apache.directory.server.kerberos.protocol.AuthenticationServiceTest
Tests run: 30, Failures: 0, Errors: 0, Skipped: 0, Time elapsed: 0.235 sec

Results :

Tests run: 101, Failures: 0, Errors: 0, Skipped: 4

[JENKINS] Recording test results
[INFO] 
[INFO] --- maven-bundle-plugin:2.3.7:bundle (default-bundle) @ apacheds-protocol-kerberos
---
[WARNING] Bundle org.apache.directory.server:apacheds-protocol-kerberos:bundle:2.0.0-M12-SNAPSHOT
: Split package org/apache/directory/server/kerberos/protocol/codec
Use directive -split-package:=(merge-first|merge-last|error|first) on Export/Private Package
instruction to get rid of this warning
Package found in   [Jar:., Jar:apacheds-kerberos-codec]
Reference from     <https://builds.apache.org/job/dir-apacheds-jdk16-ubuntu-deploy/ws/trunk/kerberos-codec/target/apacheds-kerberos-codec-2.0.0-M12-SNAPSHOT.jar>
Classpath          [Jar:., Jar:apacheds-core-api, Jar:commons-lang, Jar:apacheds-core-constants,
Jar:api-i18n, Jar:api-ldap-client-api, Jar:api-ldap-codec-standalone, Jar:api-ldap-net-mina,
Jar:commons-pool, Jar:api-ldap-codec-core, Jar:api-ldap-extras-aci, Jar:api-ldap-extras-util,
Jar:api-ldap-schema-data, Jar:api-util, Jar:apacheds-i18n, Jar:apacheds-kerberos-codec, Jar:api-asn1-ber,
Jar:apacheds-protocol-shared, Jar:apacheds-core-shared, Jar:api-ldap-extras-codec-api, Jar:api-asn1-api,
Jar:api-ldap-model, Jar:antlr, Jar:commons-collections, Jar:mina-core, Jar:ehcache-core, Jar:annotations,
Jar:slf4j-api]
[INFO] 
[INFO] --- maven-site-plugin:3.1:attach-descriptor (attach-descriptor) @ apacheds-protocol-kerberos
---
[INFO] [INFO] Checking legal files in: apacheds-protocol-kerberos-2.0.0-M12-SNAPSHOT.jar

[INFO] --- tools-maven-plugin:1.4:verify-legal-files (verify-legal-files) @ apacheds-protocol-kerberos
---
Apr 23, 2013 9:49:33 AM hudson.maven.ExecutedMojo <init>
WARNING: Failed to getClass for org.apache.maven.plugin.source.SourceJarMojo
[INFO] 
[INFO] --- maven-source-plugin:2.2:jar (attach-sources) @ apacheds-protocol-kerberos ---
[INFO] Building jar: <https://builds.apache.org/job/dir-apacheds-jdk16-ubuntu-deploy/ws/trunk/protocol-kerberos/target/apacheds-protocol-kerberos-2.0.0-M12-SNAPSHOT-sources.jar>
[INFO] [INFO] Installing <https://builds.apache.org/job/dir-apacheds-jdk16-ubuntu-deploy/ws/trunk/protocol-kerberos/target/apacheds-protocol-kerberos-2.0.0-M12-SNAPSHOT.jar>
to /home/jenkins/jenkins-slave/maven-repositories/0/org/apache/directory/server/apacheds-protocol-kerberos/2.0.0-M12-SNAPSHOT/apacheds-protocol-kerberos-2.0.0-M12-SNAPSHOT.jar

[INFO] --- maven-install-plugin:2.3.1:install (default-install) @ apacheds-protocol-kerberos
---
[INFO] Installing <https://builds.apache.org/job/dir-apacheds-jdk16-ubuntu-deploy/ws/trunk/protocol-kerberos/pom.xml>
to /home/jenkins/jenkins-slave/maven-repositories/0/org/apache/directory/server/apacheds-protocol-kerberos/2.0.0-M12-SNAPSHOT/apacheds-protocol-kerberos-2.0.0-M12-SNAPSHOT.pom
[INFO] Installing <https://builds.apache.org/job/dir-apacheds-jdk16-ubuntu-deploy/ws/trunk/protocol-kerberos/target/apacheds-protocol-kerberos-2.0.0-M12-SNAPSHOT-sources.jar>
to /home/jenkins/jenkins-slave/maven-repositories/0/org/apache/directory/server/apacheds-protocol-kerberos/2.0.0-M12-SNAPSHOT/apacheds-protocol-kerberos-2.0.0-M12-SNAPSHOT-sources.jar
[WARNING] Exception while updating local OBR: Unable to read repository xml: file:/home/jenkins/jenkins-slave/maven-repositories/0/repository.xml
org.apache.maven.plugin.MojoExecutionException: Unable to read repository xml: file:/home/jenkins/jenkins-slave/maven-repositories/0/repository.xml
	at org.apache.felix.obrplugin.ObrUpdate.parseRepositoryXml(ObrUpdate.java:324)
	at org.apache.felix.obrplugin.ObrInstall.execute(ObrInstall.java:141)
	at org.apache.maven.plugin.DefaultBuildPluginManager.executeMojo(DefaultBuildPluginManager.java:101)
	at org.apache.maven.lifecycle.internal.MojoExecutor.execute(MojoExecutor.java:209)
	at org.apache.maven.lifecycle.internal.MojoExecutor.execute(MojoExecutor.java:153)
	at org.apache.maven.lifecycle.internal.MojoExecutor.execute(MojoExecutor.java:145)
	at org.apache.maven.lifecycle.internal.LifecycleModuleBuilder.buildProject(LifecycleModuleBuilder.java:84)
	at org.apache.maven.lifecycle.internal.LifecycleModuleBuilder.buildProject(LifecycleModuleBuilder.java:59)
	at org.apache.maven.lifecycle.internal.LifecycleStarter.singleThreadedBuild(LifecycleStarter.java:183)
	at org.apache.maven.lifecycle.internal.LifecycleStarter.execute(LifecycleStarter.java:161)
	at org.apache.maven.DefaultMaven.doExecute(DefaultMaven.java:320)
	at org.apache.maven.DefaultMaven.execute(DefaultMaven.java:156)
	at org.jvnet.hudson.maven3.launcher.Maven3Launcher.main(Maven3Launcher.java:79)
	at sun.reflect.NativeMethodAccessorImpl.invoke0(Native Method)
	at sun.reflect.NativeMethodAccessorImpl.invoke(NativeMethodAccessorImpl.java:39)
	at sun.reflect.DelegatingMethodAccessorImpl.invoke(DelegatingMethodAccessorImpl.java:25)
	at java.lang.reflect.Method.invoke(Method.java:597)
	at org.codehaus.plexus.classworlds.launcher.Launcher.launchStandard(Launcher.java:329)
	at org.codehaus.plexus.classworlds.launcher.Launcher.launch(Launcher.java:239)
	at org.jvnet.hudson.maven3.agent.Maven3Main.launch(Maven3Main.java:158)
	at hudson.maven.Maven3Builder.call(Maven3Builder.java:100)
	at hudson.maven.Maven3Builder.call(Maven3Builder.java:66)
	at hudson.remoting.UserRequest.perform(UserRequest.java:118)
	at hudson.remoting.UserRequest.perform(UserRequest.java:48)
	at hudson.remoting.Request$2.run(Request.java:326)
	at hudson.remoting.InterceptingExecutorService$1.call(InterceptingExecutorService.java:72)
	at java.util.concurrent.FutureTask$Sync.innerRun(FutureTask.java:303)
	at java.util.concurrent.FutureTask.run(FutureTask.java:138)
	at java.util.concurrent.ThreadPoolExecutor$Worker.runTask(ThreadPoolExecutor.java:886)
	at java.util.concurrent.ThreadPoolExecutor$Worker.run(ThreadPoolExecutor.java:908)
	at java.lang.Thread.run(Thread.java:662)
Caused by: org.xmlpull.v1.XmlPullParserException: unexpected type (position:END_DOCUMENT null@3:1
in java.io.InputStreamReader@1b6fb00) 
	at org.kxml2.io.KXmlParser.exception(Unknown Source)
	at org.kxml2.io.KXmlParser.nextTag(Unknown Source)
	at org.apache.felix.bundlerepository.impl.PullParser.parseRepository(PullParser.java:43)
	at org.apache.felix.bundlerepository.impl.DataModelHelperImpl.repository(DataModelHelperImpl.java:147)
	at org.apache.felix.bundlerepository.impl.DataModelHelperImpl.repository(DataModelHelperImpl.java:118)
	at org.apache.felix.obrplugin.ObrUpdate.parseRepositoryXml(ObrUpdate.java:316)
	... 30 more
[INFO] 
[INFO] --- maven-bundle-plugin:2.3.7:install (default-install) @ apacheds-protocol-kerberos
---
[INFO] Downloading: https://repository.apache.org/content/repositories/snapshots/org/apache/directory/server/apacheds-protocol-kerberos/2.0.0-M12-SNAPSHOT/maven-metadata.xml

[INFO] --- maven-deploy-plugin:2.7:deploy (default-deploy) @ apacheds-protocol-kerberos ---
Downloaded: https://repository.apache.org/content/repositories/snapshots/org/apache/directory/server/apacheds-protocol-kerberos/2.0.0-M12-SNAPSHOT/maven-metadata.xml
(2 KB at 2.2 KB/sec)
Uploading: https://repository.apache.org/content/repositories/snapshots/org/apache/directory/server/apacheds-protocol-kerberos/2.0.0-M12-SNAPSHOT/apacheds-protocol-kerberos-2.0.0-M12-20130423.094935-42.jar
Uploaded: https://repository.apache.org/content/repositories/snapshots/org/apache/directory/server/apacheds-protocol-kerberos/2.0.0-M12-SNAPSHOT/apacheds-protocol-kerberos-2.0.0-M12-20130423.094935-42.jar
(83 KB at 180.0 KB/sec)
Uploading: https://repository.apache.org/content/repositories/snapshots/org/apache/directory/server/apacheds-protocol-kerberos/2.0.0-M12-SNAPSHOT/apacheds-protocol-kerberos-2.0.0-M12-20130423.094935-42.pom
Uploaded: https://repository.apache.org/content/repositories/snapshots/org/apache/directory/server/apacheds-protocol-kerberos/2.0.0-M12-SNAPSHOT/apacheds-protocol-kerberos-2.0.0-M12-20130423.094935-42.pom
(5 KB at 11.6 KB/sec)
Downloading: https://repository.apache.org/content/repositories/snapshots/org/apache/directory/server/apacheds-protocol-kerberos/maven-metadata.xml
Downloaded: https://repository.apache.org/content/repositories/snapshots/org/apache/directory/server/apacheds-protocol-kerberos/maven-metadata.xml
(421 B at 1.2 KB/sec)
Uploading: https://repository.apache.org/content/repositories/snapshots/org/apache/directory/server/apacheds-protocol-kerberos/2.0.0-M12-SNAPSHOT/maven-metadata.xml
Uploaded: https://repository.apache.org/content/repositories/snapshots/org/apache/directory/server/apacheds-protocol-kerberos/2.0.0-M12-SNAPSHOT/maven-metadata.xml
(2 KB at 2.8 KB/sec)
Uploading: https://repository.apache.org/content/repositories/snapshots/org/apache/directory/server/apacheds-protocol-kerberos/maven-metadata.xml
Uploaded: https://repository.apache.org/content/repositories/snapshots/org/apache/directory/server/apacheds-protocol-kerberos/maven-metadata.xml
(421 B at 1.2 KB/sec)
Uploading: https://repository.apache.org/content/repositories/snapshots/org/apache/directory/server/apacheds-protocol-kerberos/2.0.0-M12-SNAPSHOT/apacheds-protocol-kerberos-2.0.0-M12-20130423.094935-42-sources.jar
Uploaded: https://repository.apache.org/content/repositories/snapshots/org/apache/directory/server/apacheds-protocol-kerberos/2.0.0-M12-SNAPSHOT/apacheds-protocol-kerberos-2.0.0-M12-20130423.094935-42-sources.jar
(69 KB at 113.9 KB/sec)
Uploading: https://repository.apache.org/content/repositories/snapshots/org/apache/directory/server/apacheds-protocol-kerberos/2.0.0-M12-SNAPSHOT/maven-metadata.xml
Uploaded: https://repository.apache.org/content/repositories/snapshots/org/apache/directory/server/apacheds-protocol-kerberos/2.0.0-M12-SNAPSHOT/maven-metadata.xml
(2 KB at 3.1 KB/sec)
[INFO] [INFO] Remote OBR update disabled (enable with -DremoteOBR)

[INFO] --- maven-bundle-plugin:2.3.7:deploy (default-deploy) @ apacheds-protocol-kerberos
---
[INFO]                                                                         
[INFO] ------------------------------------------------------------------------
[INFO] Building ApacheDS Protocol Ldap 2.0.0-M12-SNAPSHOT
[INFO] ------------------------------------------------------------------------
Downloading: http://repository.apache.org/snapshots/org/apache/directory/api/api-ldap-extras-sp/1.0.0-M17-SNAPSHOT/maven-metadata.xml
Downloaded: http://repository.apache.org/snapshots/org/apache/directory/api/api-ldap-extras-sp/1.0.0-M17-SNAPSHOT/maven-metadata.xml
(2 KB at 2.4 KB/sec)
Downloading: http://repository.apache.org/snapshots/org/apache/directory/api/api-ldap-extras-sp/1.0.0-M17-SNAPSHOT/api-ldap-extras-sp-1.0.0-M17-20130423.090519-48.pom
Downloaded: http://repository.apache.org/snapshots/org/apache/directory/api/api-ldap-extras-sp/1.0.0-M17-SNAPSHOT/api-ldap-extras-sp-1.0.0-M17-20130423.090519-48.pom
(4 KB at 22.4 KB/sec)
Downloading: http://repository.apache.org/snapshots/org/apache/directory/api/api-ldap-extras-sp/1.0.0-M17-SNAPSHOT/api-ldap-extras-sp-1.0.0-M17-20130423.090519-48.jar
Downloaded: http://repository.apache.org/snapshots/org/apache/directory/api/api-ldap-extras-sp/1.0.0-M17-SNAPSHOT/api-ldap-extras-sp-1.0.0-M17-20130423.090519-48.jar
(13 KB at 101.1 KB/sec)
[INFO] Deleting <https://builds.apache.org/job/dir-apacheds-jdk16-ubuntu-deploy/ws/trunk/protocol-ldap/target>
[INFO] 
[INFO] --- maven-clean-plugin:2.4.1:clean (default-clean) @ apacheds-protocol-ldap ---
[INFO] 
[INFO] --- maven-remote-resources-plugin:1.2.1:process (default) @ apacheds-protocol-ldap
---
[debug] execute contextualize
[INFO] [INFO] Using 'UTF-8' encoding to copy filtered resources.

[INFO] --- maven-resources-plugin:2.5:resources (default-resources) @ apacheds-protocol-ldap
---
[INFO] Copying 0 resource
[INFO] Copying 3 resources
[INFO] 
[INFO] --- maven-compiler-plugin:2.5.1:compile (default-compile) @ apacheds-protocol-ldap
---
[INFO] Compiling 80 source files to <https://builds.apache.org/job/dir-apacheds-jdk16-ubuntu-deploy/ws/trunk/protocol-ldap/target/classes>
[INFO] [debug] execute contextualize
[INFO] Using 'UTF-8' encoding to copy filtered resources.
[INFO] Copying 1 resource
[INFO] Copying 3 resources

[INFO] --- maven-resources-plugin:2.5:testResources (default-testResources) @ apacheds-protocol-ldap
---
[INFO] 
[INFO] --- maven-compiler-plugin:2.5.1:testCompile (default-testCompile) @ apacheds-protocol-ldap
---
[INFO] Compiling 3 source files to <https://builds.apache.org/job/dir-apacheds-jdk16-ubuntu-deploy/ws/trunk/protocol-ldap/target/test-classes>
[INFO] [INFO] Surefire report directory: <https://builds.apache.org/job/dir-apacheds-jdk16-ubuntu-deploy/ws/trunk/protocol-ldap/target/surefire-reports>

-------------------------------------------------------
 T E S T S
-------------------------------------------------------

[INFO] --- maven-surefire-plugin:2.12.2:test (default-test) @ apacheds-protocol-ldap ---
Running org.apache.directory.server.ldap.SettingAlternativeHandlersTest
Tests run: 2, Failures: 0, Errors: 0, Skipped: 0, Time elapsed: 0.178 sec
Running org.apache.directory.server.ldap.JournalTest
Tests run: 3, Failures: 0, Errors: 0, Skipped: 1, Time elapsed: 205.336 sec
Running org.apache.directory.server.ldap.LdapServerSettingsTest
Tests run: 3, Failures: 0, Errors: 0, Skipped: 0, Time elapsed: 0.007 sec

Results :

Tests run: 8, Failures: 0, Errors: 0, Skipped: 1

ERROR: Maven JVM terminated unexpectedly with exit code 143


Mime
View raw message