directory-notifications mailing list archives

Site index · List index
Message view « Date » · « Thread »
Top « Date » · « Thread »
From Apache Jenkins Server <jenk...@builds.apache.org>
Subject Build failed in Jenkins: dir-apacheds-jdk16-win #373
Date Mon, 08 Apr 2013 05:16:16 GMT
See <https://builds.apache.org/job/dir-apacheds-jdk16-win/373/>

------------------------------------------
[...truncated 3354 lines...]
Completed so far : 
(consumer1 completed) 

NbAdded every 100ms : 
0, 10
<-- Done

--->Running testInitialRefresh4Consumers

Completed so far : 
(consumer2 completed) 
(consumer4 completed) 
(consumer1 completed) 
(consumer3 completed) 

<-- Done

---> Running testInitialRefreshLoad

NbAdded every 100ms : 
0, 11
<-- Done
Tests run: 4, Failures: 0, Errors: 0, Skipped: 0, Time elapsed: 21.576 sec
Running org.apache.directory.server.replication.ClientServerReplicationIT
------------------------------------- Stop consumer
------------------------------------- Start consumer
------------------------------------- Stop consumer
------------------------------------- Start consumer
------------------------------------- Stop consumer
------------------------------------- Start consumer
------------------------------------- Stop consumer
------------------------------------- Start consumer
------------------------------------- Stop consumer
------------------------------------- Start consumer
------------------------------------- Stop consumer
------------------------------------- Start consumer
------------------------------------- Stop consumer
------------------------------------- Start consumer
------------------------------------- Stop consumer
------------------------------------- Start consumer
------------------------------------- Stop consumer
------------------------------------- Start consumer
------------------------------------- Stop consumer
------------------------------------- Start consumer
>--------------------------------------- Adding Entry
    dn[n]: cn=user13,dc=example,dc=com
    objectclass: person
    cn: user13
    sn: user13

>--------------------------------------- Added 
>--------------------------------------- Modifying MessageType : MODIFY_REQUEST
Message ID : -1
    Modify Request
        Object : 'cn=user13,dc=example,dc=com'
            Modification[0]
                Operation :  add
                Modification
userPassword: secret
org.apache.directory.api.ldap.model.message.ModifyRequestImpl@6df30ed5
>--------------------------------------- Modified 
Tests run: 5, Failures: 0, Errors: 0, Skipped: 2, Time elapsed: 46.166 sec
Running org.apache.directory.server.replication.StaleEventLogDetectionIT

---> Running testDeleteStaleEventLog

NbAdded every 100ms : 
0, 11
<-- Done
Tests run: 1, Failures: 0, Errors: 0, Skipped: 0, Time elapsed: 26.662 sec
Running org.apache.directory.server.schema.SchemaIT
Tests run: 3, Failures: 0, Errors: 0, Skipped: 0, Time elapsed: 32.093 sec
Running org.apache.directory.server.ssl.LdapsIT
Tests run: 1, Failures: 0, Errors: 0, Skipped: 0, Time elapsed: 9.619 sec
Running org.apache.directory.server.ssl.LdapsUpdateCertificateIT
Tests run: 1, Failures: 0, Errors: 0, Skipped: 0, Time elapsed: 7.78 sec
Running org.apache.directory.server.ssl.StartTlsConfidentialityIT
Tests run: 1, Failures: 0, Errors: 0, Skipped: 0, Time elapsed: 10.785 sec
Running org.apache.directory.server.ssl.StartTlsIT
Tests run: 1, Failures: 0, Errors: 0, Skipped: 0, Time elapsed: 7.718 sec
Running org.apache.directory.server.ssl.StartTlsUpdateCertificateIT

Results :

Tests run: 412, Failures: 0, Errors: 0, Skipped: 14

[JENKINS] Recording test results
[INFO] ------------------------------------------------------------------------
[INFO] Reactor Summary:
[INFO] 
[INFO] ApacheDS .......................................... SUCCESS [6.421s]
[INFO] ApacheDS I18n ..................................... SUCCESS [5.623s]
[INFO] ApacheDS Core Constants ........................... SUCCESS [1.267s]
[INFO] ApacheDS Core API ................................. SUCCESS [20.036s]
[INFO] ApacheDS Core Shared .............................. SUCCESS [3.549s]
[INFO] ApacheDS Interceptors ............................. SUCCESS [0.113s]
[INFO] ApacheDS AdministrativePoint Interceptor .......... SUCCESS [1.739s]
[INFO] ApacheDS Authentication Interceptor ............... SUCCESS [4.266s]
[INFO] ApacheDS Authorization Interceptor ................ SUCCESS [5.233s]
[INFO] ApacheDS ChangeLog Interceptor .................... SUCCESS [3.105s]
[INFO] ApacheDS Collective Attribute Interceptor ......... SUCCESS [1.397s]
[INFO] ApacheDS Event Interceptor ........................ SUCCESS [1.468s]
[INFO] ApacheDS Exception Interceptor .................... SUCCESS [1.519s]
[INFO] ApacheDS Journal Interceptor ...................... SUCCESS [1.316s]
[INFO] ApacheDS Normalization Interceptor ................ SUCCESS [3.388s]
[INFO] ApacheDS Operational Attribute Interceptor ........ SUCCESS [1.325s]
[INFO] ApacheDS Referral Interceptor ..................... SUCCESS [1.515s]
[INFO] ApacheDS Schema Interceptor ....................... SUCCESS [7.512s]
[INFO] ApacheDS Subtree Interceptor ...................... SUCCESS [11.162s]
[INFO] ApacheDS Triggers Interceptor ..................... SUCCESS [1.966s]
[INFO] ApacheDS Core ..................................... SUCCESS [5.418s]
[INFO] ApacheDS Core AVL ................................. SUCCESS [7.997s]
[INFO] ApacheDS Generalized (X) DBM Partition ............ SUCCESS [20.427s]
[INFO] ApacheDS LDIF Partition ........................... SUCCESS [17.818s]
[INFO] ApacheDS JDBM Partition ........................... SUCCESS [40.053s]
[INFO] ApacheDS Core Annotations ......................... SUCCESS [45.293s]
[INFO] ApacheDS Core JNDI ................................ SUCCESS [3.071s]
[INFO] ApacheDS Protocol Kerberos Codec .................. SUCCESS [16.797s]
[INFO] ApacheDS Interceptors for Kerberos ................ SUCCESS [1.883s]
[INFO] ApacheDS Protocol Dhcp ............................ SUCCESS [2.502s]
[INFO] ApacheDS Protocol Shared .......................... SUCCESS [1.878s]
[INFO] ApacheDS Protocol Dns ............................. SUCCESS [4.529s]
[INFO] ApacheDS Protocol Kerberos ........................ SUCCESS [5.297s]
[INFO] ApacheDS Protocol Ldap ............................ SUCCESS [57.700s]
[INFO] ApacheDS Protocol Ntp ............................. SUCCESS [2.621s]
[INFO] Apacheds Server Annotations ....................... SUCCESS [1:10.548s]
[INFO] ApacheDS Server Config ............................ SUCCESS [27.409s]
[INFO] ApacheDS Server JNDI .............................. SUCCESS [3.670s]
[INFO] ApacheDS Test Framework ........................... SUCCESS [1:58.916s]
[INFO] ApacheDS All ...................................... SUCCESS [9.798s]
[INFO] ApacheDS Logger Interceptor ....................... SUCCESS [1.666s]
[INFO] ApacheDS Password Hashing Interceptor ............. SUCCESS [1.496s]
[INFO] ApacheDS Core Integration ......................... SUCCESS [32:41.301s]
[INFO] ApacheDS Server Integration ....................... FAILURE [30:23.222s]
[INFO] ApacheDS DirectoryService-WebApp bridge ........... SKIPPED
[INFO] ApacheDS Jetty HTTP Server Integration ............ SKIPPED
[INFO] ApacheDS Service Builder .......................... SKIPPED
[INFO] ApacheDS Protocol Kerberos Test ................... SKIPPED
[INFO] Apache Directory LDAP Client API test ............. SKIPPED
[INFO] kerberos-client ................................... SKIPPED
[INFO] ApacheDS Service .................................. SKIPPED
[INFO] ApacheDS Wrapper .................................. SKIPPED
[INFO] ApacheDS Installers Maven Plugin .................. SKIPPED
[INFO] ApacheDS Installers ............................... SKIPPED
[INFO] ------------------------------------------------------------------------
[INFO] BUILD FAILURE
[INFO] ------------------------------------------------------------------------
[INFO] Total time: 1:12:20.756s
[INFO] Finished at: Mon Apr 08 06:15:41 BST 2013
[INFO] Final Memory: 53M/247M
[INFO] ------------------------------------------------------------------------
[JENKINS] Archiving disabled
[JENKINS] Archiving disabled
[JENKINS] Archiving disabled
[JENKINS] Archiving disabled
[JENKINS] Archiving disabled
[JENKINS] Archiving disabled
[JENKINS] Archiving disabled
[JENKINS] Archiving disabled
[JENKINS] Archiving disabled
[JENKINS] Archiving disabled
[JENKINS] Archiving disabled
[JENKINS] Archiving disabled
[JENKINS] Archiving disabled
[JENKINS] Archiving disabled
[JENKINS] Archiving disabled
[JENKINS] Archiving disabled
[JENKINS] Archiving disabled
[JENKINS] Archiving disabled
[JENKINS] Archiving disabled
[JENKINS] Archiving disabled
[JENKINS] Archiving disabled
[JENKINS] Archiving disabled
[JENKINS] Archiving disabled
[JENKINS] Archiving disabled
[JENKINS] Archiving disabled
[JENKINS] Archiving disabled
[JENKINS] Archiving disabled
[JENKINS] Archiving disabled
[JENKINS] Archiving disabled
[JENKINS] Archiving disabled
[JENKINS] Archiving disabled
[JENKINS] Archiving disabled
[JENKINS] Archiving disabled
[JENKINS] Archiving disabled
[JENKINS] Archiving disabled
[JENKINS] Archiving disabled
[JENKINS] Archiving disabled
[JENKINS] Archiving disabled
[JENKINS] Archiving disabled
[JENKINS] Archiving disabled
[JENKINS] Archiving disabled
[JENKINS] Archiving disabled
[JENKINS] Archiving disabled
[JENKINS] Archiving disabled
[JENKINS] Archiving disabled
[JENKINS] Archiving disabled
[JENKINS] Archiving disabled
[JENKINS] Archiving disabled
[JENKINS] Archiving disabled
[JENKINS] Archiving disabled
[JENKINS] Archiving disabled
[JENKINS] Archiving disabled
[JENKINS] Archiving disabled
[JENKINS] Archiving disabled
Waiting for Jenkins to finish collecting data
mavenExecutionResult exceptions not empty
message : Failed to execute goal org.apache.maven.plugins:maven-surefire-plugin:2.12.2:test
(default-test) on project apacheds-server-integ: Failure or timeout
cause : Failure or timeout
Stack trace : 
org.apache.maven.lifecycle.LifecycleExecutionException: Failed to execute goal org.apache.maven.plugins:maven-surefire-plugin:2.12.2:test
(default-test) on project apacheds-server-integ: Failure or timeout
	at org.apache.maven.lifecycle.internal.MojoExecutor.execute(MojoExecutor.java:217)
	at org.apache.maven.lifecycle.internal.MojoExecutor.execute(MojoExecutor.java:153)
	at org.apache.maven.lifecycle.internal.MojoExecutor.execute(MojoExecutor.java:145)
	at org.apache.maven.lifecycle.internal.LifecycleModuleBuilder.buildProject(LifecycleModuleBuilder.java:84)
	at org.apache.maven.lifecycle.internal.LifecycleModuleBuilder.buildProject(LifecycleModuleBuilder.java:59)
	at org.apache.maven.lifecycle.internal.LifecycleStarter.singleThreadedBuild(LifecycleStarter.java:183)
	at org.apache.maven.lifecycle.internal.LifecycleStarter.execute(LifecycleStarter.java:161)
	at org.apache.maven.DefaultMaven.doExecute(DefaultMaven.java:319)
	at org.apache.maven.DefaultMaven.execute(DefaultMaven.java:156)
	at org.jvnet.hudson.maven3.launcher.Maven3Launcher.main(Maven3Launcher.java:79)
	at sun.reflect.NativeMethodAccessorImpl.invoke0(Native Method)
	at sun.reflect.NativeMethodAccessorImpl.invoke(NativeMethodAccessorImpl.java:39)
	at sun.reflect.DelegatingMethodAccessorImpl.invoke(DelegatingMethodAccessorImpl.java:25)
	at java.lang.reflect.Method.invoke(Method.java:597)
	at org.codehaus.plexus.classworlds.launcher.Launcher.launchStandard(Launcher.java:329)
	at org.codehaus.plexus.classworlds.launcher.Launcher.launch(Launcher.java:239)
	at org.jvnet.hudson.maven3.agent.Maven3Main.launch(Maven3Main.java:158)
	at hudson.maven.Maven3Builder.call(Maven3Builder.java:100)
	at hudson.maven.Maven3Builder.call(Maven3Builder.java:66)
	at hudson.remoting.UserRequest.perform(UserRequest.java:118)
	at hudson.remoting.UserRequest.perform(UserRequest.java:48)
	at hudson.remoting.Request$2.run(Request.java:326)
	at hudson.remoting.InterceptingExecutorService$1.call(InterceptingExecutorService.java:72)
	at java.util.concurrent.FutureTask$Sync.innerRun(FutureTask.java:303)
	at java.util.concurrent.FutureTask.run(FutureTask.java:138)
	at java.util.concurrent.ThreadPoolExecutor$Worker.runTask(ThreadPoolExecutor.java:886)
	at java.util.concurrent.ThreadPoolExecutor$Worker.run(ThreadPoolExecutor.java:908)
	at java.lang.Thread.run(Thread.java:662)
Caused by: org.apache.maven.plugin.MojoExecutionException: Failure or timeout
	at org.apache.maven.plugin.surefire.SurefirePlugin.assertNoFailureOrTimeout(SurefirePlugin.java:177)
	at org.apache.maven.plugin.surefire.SurefirePlugin.handleSummary(SurefirePlugin.java:158)
	at org.apache.maven.plugin.surefire.AbstractSurefireMojo.executeAfterPreconditionsChecked(AbstractSurefireMojo.java:626)
	at org.apache.maven.plugin.surefire.AbstractSurefireMojo.execute(AbstractSurefireMojo.java:587)
	at org.apache.maven.plugin.DefaultBuildPluginManager.executeMojo(DefaultBuildPluginManager.java:107)
	at org.apache.maven.lifecycle.internal.MojoExecutor.execute(MojoExecutor.java:209)
	... 27 more
Sending e-mails to: notifications@directory.apache.org
channel stopped

Mime
View raw message