directory-notifications mailing list archives

Site index · List index
Message view « Date » · « Thread »
Top « Date » · « Thread »
From Apache Jenkins Server <jenk...@builds.apache.org>
Subject Build failed in Jenkins: dir-apacheds-jdk16-win #371
Date Sat, 06 Apr 2013 04:51:44 GMT
See <https://builds.apache.org/job/dir-apacheds-jdk16-win/371/changes>

Changes:

[elecharny] Added the support for SASL PLAIN bind

------------------------------------------
[...truncated 3070 lines...]
Tests run: 17, Failures: 0, Errors: 0, Skipped: 16, Time elapsed: 11.935 sec
Running org.apache.directory.server.core.subtree.SubentryServiceObjectClassChangeHandlingIT
Tests run: 1, Failures: 0, Errors: 0, Skipped: 0, Time elapsed: 9.073 sec
Running org.apache.directory.server.core.trigger.SubentryServiceForTriggersIT
Tests run: 1, Failures: 0, Errors: 0, Skipped: 1, Time elapsed: 0 sec
Running org.apache.directory.server.core.trigger.TriggerInterceptorIT
Tests run: 1, Failures: 0, Errors: 0, Skipped: 1, Time elapsed: 0.004 sec

Results :

Tests run: 699, Failures: 0, Errors: 0, Skipped: 131

[JENKINS] Recording test results
[INFO] 
[INFO] --- maven-bundle-plugin:2.3.7:bundle (default-bundle) @ apacheds-core-integ ---
[WARNING] Bundle org.apache.directory.server:apacheds-core-integ:bundle:2.0.0-M12-SNAPSHOT
: Split package org/apache/directory/server/core/integ
Use directive -split-package:=(merge-first|merge-last|error|first) on Export/Private Package
instruction to get rid of this warning
Package found in   [Jar:., Jar:apacheds-test-framework]
Reference from     F:\hudson\hudson-slave\workspace\dir-apacheds-jdk16-win\trunk\test-framework\target\apacheds-test-framework-2.0.0-M12-SNAPSHOT.jar
Classpath          [Jar:., Jar:mina-core, Jar:apacheds-core, Jar:apacheds-interceptors-admin,
Jar:apacheds-interceptors-authz, Jar:apacheds-interceptors-changelog, Jar:apacheds-interceptors-collective,
Jar:apacheds-interceptors-event, Jar:apacheds-interceptors-exception, Jar:apacheds-interceptors-journal,
Jar:apacheds-interceptors-normalization, Jar:apacheds-interceptors-operational, Jar:apacheds-interceptors-referral,
Jar:apacheds-interceptors-schema, Jar:apacheds-interceptors-subtree, Jar:apacheds-interceptors-trigger,
Jar:api-ldap-extras-util, Jar:bcprov-jdk15, Jar:apacheds-core-annotations, Jar:apacheds-ldif-partition,
Jar:apacheds-jdbm-partition, Jar:apacheds-core-avl, Jar:apacheds-xdbm-partition, Jar:apacheds-core-api,
Jar:apacheds-core-constants, Jar:api-i18n, Jar:api-ldap-extras-aci, Jar:ehcache-core, Jar:apacheds-core-jndi,
Jar:apacheds-core-shared, Jar:api-ldap-extras-codec-api, Jar:apacheds-interceptors-authn,
Jar:commons-collections, Jar:apacheds-interceptors-hash, Jar:api-ldap-extras-trigger, Jar:apacheds-i18n,
Jar:apacheds-protocol-ldap, Jar:apacheds-protocol-shared, Jar:apacheds-jdbm1, Jar:apacheds-kerberos-codec,
Jar:api-asn1-ber, Jar:apacheds-server-annotations, Jar:apacheds-protocol-kerberos, Jar:apacheds-test-framework,
Jar:commons-io, Jar:commons-lang, Jar:api-ldap-client-api, Jar:commons-pool, Jar:api-ldap-extras-codec,
Jar:api-asn1-api, Jar:api-ldap-extras-sp, Jar:api-ldap-codec-core, Jar:api-ldap-model, Jar:antlr,
Jar:api-ldap-schema-data, Jar:api-util, Jar:annotations, Jar:slf4j-api]
[INFO] 
[INFO] --- maven-site-plugin:3.1:attach-descriptor (attach-descriptor) @ apacheds-core-integ
---
[INFO] 
[INFO] --- maven-jar-plugin:2.4:test-jar (default) @ apacheds-core-integ ---
[INFO] Building jar: F:\hudson\hudson-slave\workspace\dir-apacheds-jdk16-win\trunk\core-integ\target\apacheds-core-integ-2.0.0-M12-SNAPSHOT-tests.jar
[INFO] 
[INFO] --- tools-maven-plugin:1.4:verify-legal-files (verify-legal-files) @ apacheds-core-integ
---
[INFO] Checking legal files in: apacheds-core-integ-2.0.0-M12-SNAPSHOT.jar
[INFO] Checking legal files in: apacheds-core-integ-2.0.0-M12-SNAPSHOT-tests.jar
[INFO] 
[INFO] --- maven-install-plugin:2.3.1:install (default-install) @ apacheds-core-integ ---
[INFO] Installing F:\hudson\hudson-slave\workspace\dir-apacheds-jdk16-win\trunk\core-integ\target\apacheds-core-integ-2.0.0-M12-SNAPSHOT.jar
to f:\hudson\hudson-slave\maven-repositories\1\org\apache\directory\server\apacheds-core-integ\2.0.0-M12-SNAPSHOT\apacheds-core-integ-2.0.0-M12-SNAPSHOT.jar
[INFO] Installing F:\hudson\hudson-slave\workspace\dir-apacheds-jdk16-win\trunk\core-integ\pom.xml
to f:\hudson\hudson-slave\maven-repositories\1\org\apache\directory\server\apacheds-core-integ\2.0.0-M12-SNAPSHOT\apacheds-core-integ-2.0.0-M12-SNAPSHOT.pom
[INFO] Installing F:\hudson\hudson-slave\workspace\dir-apacheds-jdk16-win\trunk\core-integ\target\apacheds-core-integ-2.0.0-M12-SNAPSHOT-tests.jar
to f:\hudson\hudson-slave\maven-repositories\1\org\apache\directory\server\apacheds-core-integ\2.0.0-M12-SNAPSHOT\apacheds-core-integ-2.0.0-M12-SNAPSHOT-tests.jar
[INFO] 
[INFO] --- maven-bundle-plugin:2.3.7:install (default-install) @ apacheds-core-integ ---
[INFO] Installing org/apache/directory/server/apacheds-core-integ/2.0.0-M12-SNAPSHOT/apacheds-core-integ-2.0.0-M12-SNAPSHOT.jar
[INFO] Writing OBR metadata
[INFO]                                                                         
[INFO] ------------------------------------------------------------------------
[INFO] Building ApacheDS Server Integration 2.0.0-M12-SNAPSHOT
[INFO] ------------------------------------------------------------------------
Downloading: http://repository.apache.org/snapshots/org/apache/directory/api/api-dsml-engine/1.0.0-M17-SNAPSHOT/maven-metadata.xml
Downloaded: http://repository.apache.org/snapshots/org/apache/directory/api/api-dsml-engine/1.0.0-M17-SNAPSHOT/maven-metadata.xml
(1023 B at 3.5 KB/sec)
Downloading: http://repository.apache.org/snapshots/org/apache/directory/api/api-dsml-parent/1.0.0-M17-SNAPSHOT/maven-metadata.xml
Downloaded: http://repository.apache.org/snapshots/org/apache/directory/api/api-dsml-parent/1.0.0-M17-SNAPSHOT/maven-metadata.xml
(842 B at 5.8 KB/sec)
Downloading: http://repository.apache.org/snapshots/org/apache/directory/api/api-dsml-parser/1.0.0-M17-SNAPSHOT/maven-metadata.xml
Downloaded: http://repository.apache.org/snapshots/org/apache/directory/api/api-dsml-parser/1.0.0-M17-SNAPSHOT/maven-metadata.xml
(1023 B at 6.9 KB/sec)
[INFO] 
[INFO] --- maven-clean-plugin:2.4.1:clean (default-clean) @ apacheds-server-integ ---
[INFO] Deleting F:\hudson\hudson-slave\workspace\dir-apacheds-jdk16-win\trunk\server-integ\target
[INFO] 
[INFO] --- maven-remote-resources-plugin:1.2.1:process (default) @ apacheds-server-integ ---
[INFO] 
[INFO] --- maven-resources-plugin:2.5:resources (default-resources) @ apacheds-server-integ
---
[debug] execute contextualize
[INFO] Using 'UTF-8' encoding to copy filtered resources.
[INFO] Copying 0 resource
[INFO] Copying 3 resources
[INFO] 
[INFO] --- maven-compiler-plugin:2.5.1:compile (default-compile) @ apacheds-server-integ ---
[INFO] Compiling 1 source file to F:\hudson\hudson-slave\workspace\dir-apacheds-jdk16-win\trunk\server-integ\target\classes
[INFO] [INFO] Configured Artifact: org.apache.directory.api:api-ldap-extras-codec:?:jar

[INFO] --- maven-dependency-plugin:2.5:copy (copy) @ apacheds-server-integ ---
[INFO] Copying api-ldap-extras-codec-1.0.0-M17-SNAPSHOT.jar to F:\hudson\hudson-slave\workspace\dir-apacheds-jdk16-win\trunk\server-integ\target\pluginDirectory\api-ldap-extras-codec-1.0.0-M17-20130405.031712-34.jar
[INFO] [debug] execute contextualize
[INFO] Using 'UTF-8' encoding to copy filtered resources.

[INFO] --- maven-resources-plugin:2.5:testResources (default-testResources) @ apacheds-server-integ
---
[INFO] Copying 7 resources
[INFO] Copying 3 resources
[INFO] 
[INFO] --- maven-compiler-plugin:2.5.1:testCompile (default-testCompile) @ apacheds-server-integ
---
[INFO] Compiling 71 source files to F:\hudson\hudson-slave\workspace\dir-apacheds-jdk16-win\trunk\server-integ\target\test-classes
[INFO] -------------------------------------------------------------
[ERROR] COMPILATION ERROR : 
[INFO] -------------------------------------------------------------
[ERROR] F:\hudson\hudson-slave\workspace\dir-apacheds-jdk16-win\trunk\server-integ\src\test\java\org\apache\directory\server\operations\bind\SaslBindIT.java:[270,38]
cannot find symbol
symbol  : method bindSaslPlain(java.lang.String,java.lang.String)
location: class org.apache.directory.ldap.client.api.LdapNetworkConnection
[ERROR] F:\hudson\hudson-slave\workspace\dir-apacheds-jdk16-win\trunk\server-integ\src\test\java\org\apache\directory\server\operations\bind\SaslBindIT.java:[280,25]
cannot find symbol
symbol  : method bindSaslPlain(java.lang.String,java.lang.String)
location: class org.apache.directory.ldap.client.api.LdapNetworkConnection
[ERROR] F:\hudson\hudson-slave\workspace\dir-apacheds-jdk16-win\trunk\server-integ\src\test\java\org\apache\directory\server\operations\bind\SaslBindIT.java:[284,25]
cannot find symbol
symbol  : method bindSaslPlain(java.lang.String,java.lang.String)
location: class org.apache.directory.ldap.client.api.LdapNetworkConnection
[INFO] 3 errors 
[INFO] -------------------------------------------------------------
[INFO] ------------------------------------------------------------------------
[INFO] Reactor Summary:
[INFO] 
[INFO] ApacheDS .......................................... SUCCESS [5.744s]
[INFO] ApacheDS I18n ..................................... SUCCESS [5.338s]
[INFO] ApacheDS Core Constants ........................... SUCCESS [2.245s]
[INFO] ApacheDS Core API ................................. SUCCESS [23.681s]
[INFO] ApacheDS Core Shared .............................. SUCCESS [2.931s]
[INFO] ApacheDS Interceptors ............................. SUCCESS [0.146s]
[INFO] ApacheDS AdministrativePoint Interceptor .......... SUCCESS [2.129s]
[INFO] ApacheDS Authentication Interceptor ............... SUCCESS [4.185s]
[INFO] ApacheDS Authorization Interceptor ................ SUCCESS [5.498s]
[INFO] ApacheDS ChangeLog Interceptor .................... SUCCESS [3.273s]
[INFO] ApacheDS Collective Attribute Interceptor ......... SUCCESS [1.629s]
[INFO] ApacheDS Event Interceptor ........................ SUCCESS [1.357s]
[INFO] ApacheDS Exception Interceptor .................... SUCCESS [1.351s]
[INFO] ApacheDS Journal Interceptor ...................... SUCCESS [1.659s]
[INFO] ApacheDS Normalization Interceptor ................ SUCCESS [3.330s]
[INFO] ApacheDS Operational Attribute Interceptor ........ SUCCESS [1.598s]
[INFO] ApacheDS Referral Interceptor ..................... SUCCESS [1.618s]
[INFO] ApacheDS Schema Interceptor ....................... SUCCESS [7.362s]
[INFO] ApacheDS Subtree Interceptor ...................... SUCCESS [11.967s]
[INFO] ApacheDS Triggers Interceptor ..................... SUCCESS [2.335s]
[INFO] ApacheDS Core ..................................... SUCCESS [5.185s]
[INFO] ApacheDS Core AVL ................................. SUCCESS [8.379s]
[INFO] ApacheDS Generalized (X) DBM Partition ............ SUCCESS [22.778s]
[INFO] ApacheDS LDIF Partition ........................... SUCCESS [17.717s]
[INFO] ApacheDS JDBM Partition ........................... SUCCESS [39.650s]
[INFO] ApacheDS Core Annotations ......................... SUCCESS [51.625s]
[INFO] ApacheDS Core JNDI ................................ SUCCESS [3.032s]
[INFO] ApacheDS Protocol Kerberos Codec .................. SUCCESS [17.043s]
[INFO] ApacheDS Interceptors for Kerberos ................ SUCCESS [2.067s]
[INFO] ApacheDS Protocol Dhcp ............................ SUCCESS [2.936s]
[INFO] ApacheDS Protocol Shared .......................... SUCCESS [3.343s]
[INFO] ApacheDS Protocol Dns ............................. SUCCESS [4.874s]
[INFO] ApacheDS Protocol Kerberos ........................ SUCCESS [5.536s]
[INFO] ApacheDS Protocol Ldap ............................ SUCCESS [1:20.586s]
[INFO] ApacheDS Protocol Ntp ............................. SUCCESS [21.496s]
[INFO] Apacheds Server Annotations ....................... SUCCESS [57.604s]
[INFO] ApacheDS Server Config ............................ SUCCESS [36.796s]
[INFO] ApacheDS Server JNDI .............................. SUCCESS [4.440s]
[INFO] ApacheDS Test Framework ........................... SUCCESS [1:59.729s]
[INFO] ApacheDS All ...................................... SUCCESS [7.120s]
[INFO] ApacheDS Logger Interceptor ....................... SUCCESS [1.861s]
[INFO] ApacheDS Password Hashing Interceptor ............. SUCCESS [3.056s]
[INFO] ApacheDS Core Integration ......................... SUCCESS [38:21.714s]
[INFO] ApacheDS Server Integration ....................... FAILURE [16.506s]
[INFO] ApacheDS DirectoryService-WebApp bridge ........... SKIPPED
[INFO] ApacheDS Jetty HTTP Server Integration ............ SKIPPED
[INFO] ApacheDS Service Builder .......................... SKIPPED
[INFO] ApacheDS Protocol Kerberos Test ................... SKIPPED
[INFO] Apache Directory LDAP Client API test ............. SKIPPED
[INFO] kerberos-client ................................... SKIPPED
[INFO] ApacheDS Service .................................. SKIPPED
[INFO] ApacheDS Wrapper .................................. SKIPPED
[INFO] ApacheDS Installers Maven Plugin .................. SKIPPED
[INFO] ApacheDS Installers ............................... SKIPPED
[INFO] ------------------------------------------------------------------------
[INFO] BUILD FAILURE
[INFO] ------------------------------------------------------------------------
[INFO] Total time: 48:50.487s
[INFO] Finished at: Sat Apr 06 05:51:13 BST 2013
[INFO] Final Memory: 56M/310M
[INFO] ------------------------------------------------------------------------
[JENKINS] Archiving disabled
[JENKINS] Archiving disabled
[JENKINS] Archiving disabled
[JENKINS] Archiving disabled
[JENKINS] Archiving disabled
[JENKINS] Archiving disabled
[JENKINS] Archiving disabled
[JENKINS] Archiving disabled
[JENKINS] Archiving disabled
[JENKINS] Archiving disabled
[JENKINS] Archiving disabled
[JENKINS] Archiving disabled
[JENKINS] Archiving disabled
[JENKINS] Archiving disabled
[JENKINS] Archiving disabled
[JENKINS] Archiving disabled
[JENKINS] Archiving disabled
[JENKINS] Archiving disabled
[JENKINS] Archiving disabled
[JENKINS] Archiving disabled
[JENKINS] Archiving disabled
[JENKINS] Archiving disabled
[JENKINS] Archiving disabled
[JENKINS] Archiving disabled
[JENKINS] Archiving disabled
[JENKINS] Archiving disabled
[JENKINS] Archiving disabled
[JENKINS] Archiving disabled
[JENKINS] Archiving disabled
[JENKINS] Archiving disabled
[JENKINS] Archiving disabled
[JENKINS] Archiving disabled
[JENKINS] Archiving disabled
[JENKINS] Archiving disabled
[JENKINS] Archiving disabled
[JENKINS] Archiving disabled
[JENKINS] Archiving disabled
[JENKINS] Archiving disabled
[JENKINS] Archiving disabled
[JENKINS] Archiving disabled
[JENKINS] Archiving disabled
[JENKINS] Archiving disabled
[JENKINS] Archiving disabled
[JENKINS] Archiving disabled
[JENKINS] Archiving disabled
[JENKINS] Archiving disabled
[JENKINS] Archiving disabled
[JENKINS] Archiving disabled
[JENKINS] Archiving disabled
[JENKINS] Archiving disabled
[JENKINS] Archiving disabled
[JENKINS] Archiving disabled
[JENKINS] Archiving disabled
[JENKINS] Archiving disabled
Waiting for Jenkins to finish collecting data
mavenExecutionResult exceptions not empty
message : Failed to execute goal org.apache.maven.plugins:maven-compiler-plugin:2.5.1:testCompile
(default-testCompile) on project apacheds-server-integ: Compilation failure
cause : Compilation failure
Stack trace : 
org.apache.maven.lifecycle.LifecycleExecutionException: Failed to execute goal org.apache.maven.plugins:maven-compiler-plugin:2.5.1:testCompile
(default-testCompile) on project apacheds-server-integ: Compilation failure
	at org.apache.maven.lifecycle.internal.MojoExecutor.execute(MojoExecutor.java:213)
	at org.apache.maven.lifecycle.internal.MojoExecutor.execute(MojoExecutor.java:153)
	at org.apache.maven.lifecycle.internal.MojoExecutor.execute(MojoExecutor.java:145)
	at org.apache.maven.lifecycle.internal.LifecycleModuleBuilder.buildProject(LifecycleModuleBuilder.java:84)
	at org.apache.maven.lifecycle.internal.LifecycleModuleBuilder.buildProject(LifecycleModuleBuilder.java:59)
	at org.apache.maven.lifecycle.internal.LifecycleStarter.singleThreadedBuild(LifecycleStarter.java:183)
	at org.apache.maven.lifecycle.internal.LifecycleStarter.execute(LifecycleStarter.java:161)
	at org.apache.maven.DefaultMaven.doExecute(DefaultMaven.java:319)
	at org.apache.maven.DefaultMaven.execute(DefaultMaven.java:156)
	at org.jvnet.hudson.maven3.launcher.Maven3Launcher.main(Maven3Launcher.java:79)
	at sun.reflect.NativeMethodAccessorImpl.invoke0(Native Method)
	at sun.reflect.NativeMethodAccessorImpl.invoke(NativeMethodAccessorImpl.java:39)
	at sun.reflect.DelegatingMethodAccessorImpl.invoke(DelegatingMethodAccessorImpl.java:25)
	at java.lang.reflect.Method.invoke(Method.java:597)
	at org.codehaus.plexus.classworlds.launcher.Launcher.launchStandard(Launcher.java:329)
	at org.codehaus.plexus.classworlds.launcher.Launcher.launch(Launcher.java:239)
	at org.jvnet.hudson.maven3.agent.Maven3Main.launch(Maven3Main.java:158)
	at hudson.maven.Maven3Builder.call(Maven3Builder.java:100)
	at hudson.maven.Maven3Builder.call(Maven3Builder.java:66)
	at hudson.remoting.UserRequest.perform(UserRequest.java:118)
	at hudson.remoting.UserRequest.perform(UserRequest.java:48)
	at hudson.remoting.Request$2.run(Request.java:326)
	at hudson.remoting.InterceptingExecutorService$1.call(InterceptingExecutorService.java:72)
	at java.util.concurrent.FutureTask$Sync.innerRun(FutureTask.java:303)
	at java.util.concurrent.FutureTask.run(FutureTask.java:138)
	at java.util.concurrent.ThreadPoolExecutor$Worker.runTask(ThreadPoolExecutor.java:886)
	at java.util.concurrent.ThreadPoolExecutor$Worker.run(ThreadPoolExecutor.java:908)
	at java.lang.Thread.run(Thread.java:662)
Caused by: org.apache.maven.plugin.CompilationFailureException: Compilation failure
	at org.apache.maven.plugin.AbstractCompilerMojo.execute(AbstractCompilerMojo.java:729)
	at org.apache.maven.plugin.TestCompilerMojo.execute(TestCompilerMojo.java:161)
	at org.apache.maven.plugin.DefaultBuildPluginManager.executeMojo(DefaultBuildPluginManager.java:107)
	at org.apache.maven.lifecycle.internal.MojoExecutor.execute(MojoExecutor.java:209)
	... 27 more
Sending e-mails to: notifications@directory.apache.org
channel stopped

Mime
View raw message