directory-notifications mailing list archives

Site index · List index
Message view « Date » · « Thread »
Top « Date » · « Thread »
From Apache Jenkins Server <jenk...@builds.apache.org>
Subject Build failed in Jenkins: dir-apacheds-jdk16-ubuntu-deploy #974
Date Thu, 25 Apr 2013 20:03:47 GMT
See <https://builds.apache.org/job/dir-apacheds-jdk16-ubuntu-deploy/974/changes>

Changes:

[kayyagari] allow cipher suites to be configurable (DIRSERVER-1584)

[kayyagari] o make replication pinger thread's sleep time to be configurable (DIRSERVER-1831)
o allow cipher suites to be configurable (DIRSERVER-1584)

[elecharny] o Remove the bind() method from the Normalization interceptor
o Normalize the BindContext DN before injecting in into the OperationManager in the coreContextFactory,
LdapCoreSessionConnection and getSession() methods in DirectoryService

[elecharny] o Modified the way we initialize the Anonymous session in the DefaultCoreSession
constructor to avoid creating a new LdapPrincipal everytime
o The isAnonymous() methods work slightly differently
o Don't erase the credentials when we do a bind as admin with another DN : this is a password
reset
o Added two tests for the pwdModify extended request
o Added some missing Javadoc

[elecharny] Get back the adminSession directly from the DS

------------------------------------------
[...truncated 3225 lines...]
[INFO] Writing OBR metadata
[INFO] Downloading: https://repository.apache.org/content/repositories/snapshots/org/apache/directory/server/apacheds-server-annotations/2.0.0-M12-SNAPSHOT/maven-metadata.xml

[INFO] --- maven-deploy-plugin:2.7:deploy (default-deploy) @ apacheds-server-annotations ---
Downloaded: https://repository.apache.org/content/repositories/snapshots/org/apache/directory/server/apacheds-server-annotations/2.0.0-M12-SNAPSHOT/maven-metadata.xml
(819 B at 1.3 KB/sec)
Uploading: https://repository.apache.org/content/repositories/snapshots/org/apache/directory/server/apacheds-server-annotations/2.0.0-M12-SNAPSHOT/apacheds-server-annotations-2.0.0-M12-20130425.195915-43.jar
Uploaded: https://repository.apache.org/content/repositories/snapshots/org/apache/directory/server/apacheds-server-annotations/2.0.0-M12-SNAPSHOT/apacheds-server-annotations-2.0.0-M12-20130425.195915-43.jar
(21 KB at 65.6 KB/sec)
Uploading: https://repository.apache.org/content/repositories/snapshots/org/apache/directory/server/apacheds-server-annotations/2.0.0-M12-SNAPSHOT/apacheds-server-annotations-2.0.0-M12-20130425.195915-43.pom
Uploaded: https://repository.apache.org/content/repositories/snapshots/org/apache/directory/server/apacheds-server-annotations/2.0.0-M12-SNAPSHOT/apacheds-server-annotations-2.0.0-M12-20130425.195915-43.pom
(5 KB at 15.3 KB/sec)
Downloading: https://repository.apache.org/content/repositories/snapshots/org/apache/directory/server/apacheds-server-annotations/maven-metadata.xml
Downloaded: https://repository.apache.org/content/repositories/snapshots/org/apache/directory/server/apacheds-server-annotations/maven-metadata.xml
(422 B at 0.0 KB/sec)
Uploading: https://repository.apache.org/content/repositories/snapshots/org/apache/directory/server/apacheds-server-annotations/2.0.0-M12-SNAPSHOT/maven-metadata.xml
Uploaded: https://repository.apache.org/content/repositories/snapshots/org/apache/directory/server/apacheds-server-annotations/2.0.0-M12-SNAPSHOT/maven-metadata.xml
(819 B at 2.6 KB/sec)
Uploading: https://repository.apache.org/content/repositories/snapshots/org/apache/directory/server/apacheds-server-annotations/maven-metadata.xml
Uploaded: https://repository.apache.org/content/repositories/snapshots/org/apache/directory/server/apacheds-server-annotations/maven-metadata.xml
(422 B at 1.1 KB/sec)
[INFO] [INFO] Remote OBR update disabled (enable with -DremoteOBR)

[INFO] --- maven-bundle-plugin:2.3.7:deploy (default-deploy) @ apacheds-server-annotations
---
[INFO] [INFO] Deleting <https://builds.apache.org/job/dir-apacheds-jdk16-ubuntu-deploy/ws/trunk/server-config/target>
                                                                        
[INFO] ------------------------------------------------------------------------
[INFO] Building ApacheDS Server Config 2.0.0-M12-SNAPSHOT
[INFO] ------------------------------------------------------------------------
[INFO] 
[INFO] --- maven-clean-plugin:2.4.1:clean (default-clean) @ apacheds-server-config ---
[INFO] 
[INFO] --- maven-remote-resources-plugin:1.2.1:process (default) @ apacheds-server-config
---
[debug] execute contextualize
[INFO] [INFO] Using 'UTF-8' encoding to copy filtered resources.

[INFO] --- maven-resources-plugin:2.5:resources (default-resources) @ apacheds-server-config
---
[INFO] Copying 1 resource
[INFO] Copying 3 resources
[INFO] 
[INFO] --- maven-compiler-plugin:2.5.1:compile (default-compile) @ apacheds-server-config
---
[INFO] Compiling 38 source files to <https://builds.apache.org/job/dir-apacheds-jdk16-ubuntu-deploy/ws/trunk/server-config/target/classes>
[debug] execute contextualize
[INFO] [INFO] Using 'UTF-8' encoding to copy filtered resources.
[INFO] Copying 5 resources

[INFO] --- maven-resources-plugin:2.5:testResources (default-testResources) @ apacheds-server-config
---
[INFO] Copying 3 resources
[INFO] 
[INFO] --- maven-compiler-plugin:2.5.1:testCompile (default-testCompile) @ apacheds-server-config
---
[INFO] Compiling 6 source files to <https://builds.apache.org/job/dir-apacheds-jdk16-ubuntu-deploy/ws/trunk/server-config/target/test-classes>
[INFO] Surefire report directory: <https://builds.apache.org/job/dir-apacheds-jdk16-ubuntu-deploy/ws/trunk/server-config/target/surefire-reports>
[INFO] 
-------------------------------------------------------
 T E S T S
-------------------------------------------------------

[INFO] --- maven-surefire-plugin:2.12.2:test (default-test) @ apacheds-server-config ---
Running org.apache.directory.server.config.ConfigWriterTest
Tests run: 1, Failures: 0, Errors: 1, Skipped: 0, Time elapsed: 1.962 sec <<< FAILURE!
Running org.apache.directory.server.config.ConfigPartitionReaderTest
Tests run: 1, Failures: 0, Errors: 1, Skipped: 0, Time elapsed: 0.697 sec <<< FAILURE!
Running org.apache.directory.server.config.HttpServerConfigReaderTest
Tests run: 1, Failures: 0, Errors: 0, Skipped: 0, Time elapsed: 0.579 sec
Running org.apache.directory.server.config.ChangePasswordConfigReaderTest
Tests run: 1, Failures: 0, Errors: 0, Skipped: 0, Time elapsed: 0.496 sec
Running org.apache.directory.server.config.LdapServerConfigReaderTest
Tests run: 1, Failures: 0, Errors: 1, Skipped: 0, Time elapsed: 0.45 sec <<< FAILURE!
Running org.apache.directory.server.config.KerberosServerConfigReaderTest
Tests run: 1, Failures: 0, Errors: 0, Skipped: 0, Time elapsed: 0.449 sec

Results :

Tests in error: 
  testConfigWriter(org.apache.directory.server.config.ConfigWriterTest): ERR_04269 ATTRIBUTE_TYPE
for OID ads-replpingersleep does not exist!
  testReadFullConfig(org.apache.directory.server.config.ConfigPartitionReaderTest): ERR_04269
ATTRIBUTE_TYPE for OID ads-replpingersleep does not exist!
  testLdapServer(org.apache.directory.server.config.LdapServerConfigReaderTest): ERR_04269
ATTRIBUTE_TYPE for OID ads-replpingersleep does not exist!

Tests run: 6, Failures: 0, Errors: 3, Skipped: 0

[ERROR] There are test failures.

Please refer to <https://builds.apache.org/job/dir-apacheds-jdk16-ubuntu-deploy/ws/trunk/server-config/target/surefire-reports>
for the individual test results.
[JENKINS] Recording test results
[INFO] 
[INFO] --- maven-bundle-plugin:2.3.7:bundle (default-bundle) @ apacheds-server-config ---
[INFO] 
[INFO] --- maven-site-plugin:3.1:attach-descriptor (attach-descriptor) @ apacheds-server-config
---
[INFO] [INFO] Checking legal files in: apacheds-server-config-2.0.0-M12-SNAPSHOT.jar

[INFO] --- tools-maven-plugin:1.4:verify-legal-files (verify-legal-files) @ apacheds-server-config
---
[INFO] [INFO] Installing <https://builds.apache.org/job/dir-apacheds-jdk16-ubuntu-deploy/ws/trunk/server-config/target/apacheds-server-config-2.0.0-M12-SNAPSHOT.jar>
to /home/jenkins/jenkins-slave/maven-repositories/0/org/apache/directory/server/apacheds-server-config/2.0.0-M12-SNAPSHOT/apacheds-server-config-2.0.0-M12-SNAPSHOT.jar

[INFO] --- maven-install-plugin:2.3.1:install (default-install) @ apacheds-server-config ---
[INFO] Installing <https://builds.apache.org/job/dir-apacheds-jdk16-ubuntu-deploy/ws/trunk/server-config/pom.xml>
to /home/jenkins/jenkins-slave/maven-repositories/0/org/apache/directory/server/apacheds-server-config/2.0.0-M12-SNAPSHOT/apacheds-server-config-2.0.0-M12-SNAPSHOT.pom
[INFO] 
[INFO] --- maven-bundle-plugin:2.3.7:install (default-install) @ apacheds-server-config ---
[INFO] Installing org/apache/directory/server/apacheds-server-config/2.0.0-M12-SNAPSHOT/apacheds-server-config-2.0.0-M12-SNAPSHOT.jar
[INFO] Writing OBR metadata
[INFO] Downloading: https://repository.apache.org/content/repositories/snapshots/org/apache/directory/server/apacheds-server-config/2.0.0-M12-SNAPSHOT/maven-metadata.xml

[INFO] --- maven-deploy-plugin:2.7:deploy (default-deploy) @ apacheds-server-config ---
Downloaded: https://repository.apache.org/content/repositories/snapshots/org/apache/directory/server/apacheds-server-config/2.0.0-M12-SNAPSHOT/maven-metadata.xml
(814 B at 4.6 KB/sec)
Uploading: https://repository.apache.org/content/repositories/snapshots/org/apache/directory/server/apacheds-server-config/2.0.0-M12-SNAPSHOT/apacheds-server-config-2.0.0-M12-20130425.195938-43.jar
Uploaded: https://repository.apache.org/content/repositories/snapshots/org/apache/directory/server/apacheds-server-config/2.0.0-M12-SNAPSHOT/apacheds-server-config-2.0.0-M12-20130425.195938-43.jar
(82 KB at 221.5 KB/sec)
Uploading: https://repository.apache.org/content/repositories/snapshots/org/apache/directory/server/apacheds-server-config/2.0.0-M12-SNAPSHOT/apacheds-server-config-2.0.0-M12-20130425.195938-43.pom
Uploaded: https://repository.apache.org/content/repositories/snapshots/org/apache/directory/server/apacheds-server-config/2.0.0-M12-SNAPSHOT/apacheds-server-config-2.0.0-M12-20130425.195938-43.pom
(4 KB at 11.5 KB/sec)
Downloading: https://repository.apache.org/content/repositories/snapshots/org/apache/directory/server/apacheds-server-config/maven-metadata.xml
Downloaded: https://repository.apache.org/content/repositories/snapshots/org/apache/directory/server/apacheds-server-config/maven-metadata.xml
(417 B at 2.0 KB/sec)
Uploading: https://repository.apache.org/content/repositories/snapshots/org/apache/directory/server/apacheds-server-config/2.0.0-M12-SNAPSHOT/maven-metadata.xml
Uploaded: https://repository.apache.org/content/repositories/snapshots/org/apache/directory/server/apacheds-server-config/2.0.0-M12-SNAPSHOT/maven-metadata.xml
(814 B at 2.9 KB/sec)
Uploading: https://repository.apache.org/content/repositories/snapshots/org/apache/directory/server/apacheds-server-config/maven-metadata.xml
Uploaded: https://repository.apache.org/content/repositories/snapshots/org/apache/directory/server/apacheds-server-config/maven-metadata.xml
(417 B at 1.2 KB/sec)
[INFO] [INFO] Remote OBR update disabled (enable with -DremoteOBR)

[INFO] --- maven-bundle-plugin:2.3.7:deploy (default-deploy) @ apacheds-server-config ---
[INFO] [INFO] Deleting <https://builds.apache.org/job/dir-apacheds-jdk16-ubuntu-deploy/ws/trunk/server-jndi/target>
                                                                        
[INFO] ------------------------------------------------------------------------
[INFO] Building ApacheDS Server JNDI 2.0.0-M12-SNAPSHOT
[INFO] ------------------------------------------------------------------------
[INFO] 
[INFO] --- maven-clean-plugin:2.4.1:clean (default-clean) @ apacheds-server-jndi ---
[INFO] 
[INFO] --- maven-remote-resources-plugin:1.2.1:process (default) @ apacheds-server-jndi ---
[INFO] [debug] execute contextualize
[INFO] Using 'UTF-8' encoding to copy filtered resources.
[INFO] Copying 0 resource
[INFO] Copying 3 resources

[INFO] --- maven-resources-plugin:2.5:resources (default-resources) @ apacheds-server-jndi
---
[INFO] [INFO] Compiling 1 source file to <https://builds.apache.org/job/dir-apacheds-jdk16-ubuntu-deploy/ws/trunk/server-jndi/target/classes>

[INFO] --- maven-compiler-plugin:2.5.1:compile (default-compile) @ apacheds-server-jndi ---
[debug] execute contextualize
[INFO] [INFO] Using 'UTF-8' encoding to copy filtered resources.

[INFO] --- maven-resources-plugin:2.5:testResources (default-testResources) @ apacheds-server-jndi
---
[INFO] Copying 1 resource
[INFO] Copying 3 resources
[INFO] 
[INFO] --- maven-compiler-plugin:2.5.1:testCompile (default-testCompile) @ apacheds-server-jndi
---
[INFO] Compiling 1 source file to <https://builds.apache.org/job/dir-apacheds-jdk16-ubuntu-deploy/ws/trunk/server-jndi/target/test-classes>
[INFO] [INFO] Surefire report directory: <https://builds.apache.org/job/dir-apacheds-jdk16-ubuntu-deploy/ws/trunk/server-jndi/target/surefire-reports>

-------------------------------------------------------
 T E S T S
-------------------------------------------------------

[INFO] --- maven-surefire-plugin:2.12.2:test (default-test) @ apacheds-server-jndi ---
Running org.apache.directory.server.configuration.ApacheDSTest
TODO: Fix this the real test case and delete me!
Tests run: 1, Failures: 0, Errors: 0, Skipped: 0, Time elapsed: 0.072 sec

Results :

Tests run: 1, Failures: 0, Errors: 0, Skipped: 0

[JENKINS] Recording test results
[INFO] 
[INFO] --- maven-bundle-plugin:2.3.7:bundle (default-bundle) @ apacheds-server-jndi ---
[INFO] 
[INFO] --- maven-site-plugin:3.1:attach-descriptor (attach-descriptor) @ apacheds-server-jndi
---
[INFO] [INFO] Checking legal files in: apacheds-server-jndi-2.0.0-M12-SNAPSHOT.jar

[INFO] --- tools-maven-plugin:1.4:verify-legal-files (verify-legal-files) @ apacheds-server-jndi
---
Apr 25, 2013 7:59:43 PM hudson.maven.ExecutedMojo <init>
WARNING: Failed to getClass for org.apache.maven.plugin.source.SourceJarMojo
[INFO] 
[INFO] --- maven-source-plugin:2.2:jar (attach-sources) @ apacheds-server-jndi ---
[INFO] Building jar: <https://builds.apache.org/job/dir-apacheds-jdk16-ubuntu-deploy/ws/trunk/server-jndi/target/apacheds-server-jndi-2.0.0-M12-SNAPSHOT-sources.jar>
[INFO] [INFO] Installing <https://builds.apache.org/job/dir-apacheds-jdk16-ubuntu-deploy/ws/trunk/server-jndi/target/apacheds-server-jndi-2.0.0-M12-SNAPSHOT.jar>
to /home/jenkins/jenkins-slave/maven-repositories/0/org/apache/directory/server/apacheds-server-jndi/2.0.0-M12-SNAPSHOT/apacheds-server-jndi-2.0.0-M12-SNAPSHOT.jar

[INFO] --- maven-install-plugin:2.3.1:install (default-install) @ apacheds-server-jndi ---
[INFO] Installing <https://builds.apache.org/job/dir-apacheds-jdk16-ubuntu-deploy/ws/trunk/server-jndi/pom.xml>
to /home/jenkins/jenkins-slave/maven-repositories/0/org/apache/directory/server/apacheds-server-jndi/2.0.0-M12-SNAPSHOT/apacheds-server-jndi-2.0.0-M12-SNAPSHOT.pom
[INFO] Installing <https://builds.apache.org/job/dir-apacheds-jdk16-ubuntu-deploy/ws/trunk/server-jndi/target/apacheds-server-jndi-2.0.0-M12-SNAPSHOT-sources.jar>
to /home/jenkins/jenkins-slave/maven-repositories/0/org/apache/directory/server/apacheds-server-jndi/2.0.0-M12-SNAPSHOT/apacheds-server-jndi-2.0.0-M12-SNAPSHOT-sources.jar
[INFO] 
[INFO] --- maven-bundle-plugin:2.3.7:install (default-install) @ apacheds-server-jndi ---
[INFO] Installing org/apache/directory/server/apacheds-server-jndi/2.0.0-M12-SNAPSHOT/apacheds-server-jndi-2.0.0-M12-SNAPSHOT.jar
[INFO] Writing OBR metadata
[INFO] Downloading: https://repository.apache.org/content/repositories/snapshots/org/apache/directory/server/apacheds-server-jndi/2.0.0-M12-SNAPSHOT/maven-metadata.xml

[INFO] --- maven-deploy-plugin:2.7:deploy (default-deploy) @ apacheds-server-jndi ---
Downloaded: https://repository.apache.org/content/repositories/snapshots/org/apache/directory/server/apacheds-server-jndi/2.0.0-M12-SNAPSHOT/maven-metadata.xml
(2 KB at 3.0 KB/sec)
Uploading: https://repository.apache.org/content/repositories/snapshots/org/apache/directory/server/apacheds-server-jndi/2.0.0-M12-SNAPSHOT/apacheds-server-jndi-2.0.0-M12-20130425.195945-43.jar
Uploaded: https://repository.apache.org/content/repositories/snapshots/org/apache/directory/server/apacheds-server-jndi/2.0.0-M12-SNAPSHOT/apacheds-server-jndi-2.0.0-M12-20130425.195945-43.jar
(16 KB at 49.5 KB/sec)
Uploading: https://repository.apache.org/content/repositories/snapshots/org/apache/directory/server/apacheds-server-jndi/2.0.0-M12-SNAPSHOT/apacheds-server-jndi-2.0.0-M12-20130425.195945-43.pom
Uploaded: https://repository.apache.org/content/repositories/snapshots/org/apache/directory/server/apacheds-server-jndi/2.0.0-M12-SNAPSHOT/apacheds-server-jndi-2.0.0-M12-20130425.195945-43.pom
(5 KB at 14.4 KB/sec)
Downloading: https://repository.apache.org/content/repositories/snapshots/org/apache/directory/server/apacheds-server-jndi/maven-metadata.xml
Downloaded: https://repository.apache.org/content/repositories/snapshots/org/apache/directory/server/apacheds-server-jndi/maven-metadata.xml
(415 B at 0.6 KB/sec)
Uploading: https://repository.apache.org/content/repositories/snapshots/org/apache/directory/server/apacheds-server-jndi/2.0.0-M12-SNAPSHOT/maven-metadata.xml
Uploaded: https://repository.apache.org/content/repositories/snapshots/org/apache/directory/server/apacheds-server-jndi/2.0.0-M12-SNAPSHOT/maven-metadata.xml
(2 KB at 3.4 KB/sec)
Uploading: https://repository.apache.org/content/repositories/snapshots/org/apache/directory/server/apacheds-server-jndi/maven-metadata.xml
Uploaded: https://repository.apache.org/content/repositories/snapshots/org/apache/directory/server/apacheds-server-jndi/maven-metadata.xml
(415 B at 1.1 KB/sec)
Uploading: https://repository.apache.org/content/repositories/snapshots/org/apache/directory/server/apacheds-server-jndi/2.0.0-M12-SNAPSHOT/apacheds-server-jndi-2.0.0-M12-20130425.195945-43-sources.jar
Uploaded: https://repository.apache.org/content/repositories/snapshots/org/apache/directory/server/apacheds-server-jndi/2.0.0-M12-SNAPSHOT/apacheds-server-jndi-2.0.0-M12-20130425.195945-43-sources.jar
(12 KB at 32.6 KB/sec)
Uploading: https://repository.apache.org/content/repositories/snapshots/org/apache/directory/server/apacheds-server-jndi/2.0.0-M12-SNAPSHOT/maven-metadata.xml
Uploaded: https://repository.apache.org/content/repositories/snapshots/org/apache/directory/server/apacheds-server-jndi/2.0.0-M12-SNAPSHOT/maven-metadata.xml
(2 KB at 3.2 KB/sec)
[INFO] [INFO] Remote OBR update disabled (enable with -DremoteOBR)

[INFO] --- maven-bundle-plugin:2.3.7:deploy (default-deploy) @ apacheds-server-jndi ---
[INFO]                                                                         
[INFO] ------------------------------------------------------------------------
[INFO] Building ApacheDS Test Framework 2.0.0-M12-SNAPSHOT
[INFO] [INFO] Deleting <https://builds.apache.org/job/dir-apacheds-jdk16-ubuntu-deploy/ws/trunk/test-framework/target>
------------------------------------------------------------------------
[INFO] 
[INFO] --- maven-clean-plugin:2.4.1:clean (default-clean) @ apacheds-test-framework ---
[INFO] 
[INFO] --- maven-remote-resources-plugin:1.2.1:process (default) @ apacheds-test-framework
---
[INFO] [debug] execute contextualize
[INFO] Using 'UTF-8' encoding to copy filtered resources.
[INFO] skip non existing resourceDirectory <https://builds.apache.org/job/dir-apacheds-jdk16-ubuntu-deploy/ws/trunk/test-framework/src/main/resources>
[INFO] Copying 3 resources

[INFO] --- maven-resources-plugin:2.5:resources (default-resources) @ apacheds-test-framework
---
[INFO] 
[INFO] --- maven-compiler-plugin:2.5.1:compile (default-compile) @ apacheds-test-framework
---
[INFO] Compiling 3 source files to <https://builds.apache.org/job/dir-apacheds-jdk16-ubuntu-deploy/ws/trunk/test-framework/target/classes>
[debug] execute contextualize
[INFO] [INFO] Using 'UTF-8' encoding to copy filtered resources.
[INFO] Copying 2 resources
[INFO] Copying 3 resources

[INFO] --- maven-resources-plugin:2.5:testResources (default-testResources) @ apacheds-test-framework
---
[INFO] [INFO] Compiling 6 source files to <https://builds.apache.org/job/dir-apacheds-jdk16-ubuntu-deploy/ws/trunk/test-framework/target/test-classes>

[INFO] --- maven-compiler-plugin:2.5.1:testCompile (default-testCompile) @ apacheds-test-framework
---
[INFO] [INFO] Surefire report directory: <https://builds.apache.org/job/dir-apacheds-jdk16-ubuntu-deploy/ws/trunk/test-framework/target/surefire-reports>

-------------------------------------------------------
 T E S T S
-------------------------------------------------------

[INFO] --- maven-surefire-plugin:2.12.2:test (default-test) @ apacheds-test-framework ---
Running org.apache.directory.server.core.integ.TestClassB
Tests run: 2, Failures: 0, Errors: 0, Skipped: 0, Time elapsed: 50.12 sec
Running org.apache.directory.server.core.integ.TestMultiLevelDS
Tests run: 2, Failures: 0, Errors: 0, Skipped: 0, Time elapsed: 39.902 sec
Running org.apache.directory.server.core.integ.TestWithClassLevelLdapServer
Tests run: 1, Failures: 0, Errors: 0, Skipped: 0, Time elapsed: 14.211 sec
Running org.apache.directory.server.core.integ.TestClassA
Tests run: 2, Failures: 0, Errors: 0, Skipped: 0, Time elapsed: 40.011 sec
Running org.apache.directory.server.core.integ.TestClassServer
Tests run: 1, Failures: 0, Errors: 0, Skipped: 0, Time elapsed: 24.269 sec
Running org.apache.directory.server.core.integ.TestClassC
Tests run: 2, Failures: 0, Errors: 0, Skipped: 0, Time elapsed: 25.132 sec

Results :

Tests run: 10, Failures: 0, Errors: 0, Skipped: 0

Sending e-mails to: notifications@directory.apache.org
ERROR: Maven JVM terminated unexpectedly with exit code 143


Mime
View raw message