directory-notifications mailing list archives

Site index · List index
Message view « Date » · « Thread »
Top « Date » · « Thread »
From Apache Jenkins Server <jenk...@builds.apache.org>
Subject Build failed in Jenkins: dir-apacheds-jdk16-ubuntu-deploy #975
Date Fri, 26 Apr 2013 15:03:24 GMT
See <https://builds.apache.org/job/dir-apacheds-jdk16-ubuntu-deploy/975/>

------------------------------------------
[...truncated 2619 lines...]
	at org.codehaus.plexus.classworlds.launcher.Launcher.launch(Launcher.java:239)
	at org.jvnet.hudson.maven3.agent.Maven3Main.launch(Maven3Main.java:158)
	at hudson.maven.Maven3Builder.call(Maven3Builder.java:100)
	at hudson.maven.Maven3Builder.call(Maven3Builder.java:66)
	at hudson.remoting.UserRequest.perform(UserRequest.java:118)
	at hudson.remoting.UserRequest.perform(UserRequest.java:48)
	at hudson.remoting.Request$2.run(Request.java:326)
	at hudson.remoting.InterceptingExecutorService$1.call(InterceptingExecutorService.java:72)
	at java.util.concurrent.FutureTask$Sync.innerRun(FutureTask.java:303)
	at java.util.concurrent.FutureTask.run(FutureTask.java:138)
	at java.util.concurrent.ThreadPoolExecutor$Worker.runTask(ThreadPoolExecutor.java:886)
	at java.util.concurrent.ThreadPoolExecutor$Worker.run(ThreadPoolExecutor.java:908)
	at java.lang.Thread.run(Thread.java:662)
Caused by: org.xmlpull.v1.XmlPullParserException: unexpected type (position:END_DOCUMENT null@3:1
in java.io.InputStreamReader@1684413) 
	at org.kxml2.io.KXmlParser.exception(Unknown Source)
	at org.kxml2.io.KXmlParser.nextTag(Unknown Source)
	at org.apache.felix.bundlerepository.impl.PullParser.parseRepository(PullParser.java:43)
	at org.apache.felix.bundlerepository.impl.DataModelHelperImpl.repository(DataModelHelperImpl.java:147)
	at org.apache.felix.bundlerepository.impl.DataModelHelperImpl.repository(DataModelHelperImpl.java:118)
	at org.apache.felix.obrplugin.ObrUpdate.parseRepositoryXml(ObrUpdate.java:316)
	... 30 more

[INFO] --- maven-bundle-plugin:2.3.7:install (default-install) @ apacheds-core-avl ---
[INFO] Downloading: https://repository.apache.org/content/repositories/snapshots/org/apache/directory/server/apacheds-core-avl/2.0.0-M12-SNAPSHOT/maven-metadata.xml

[INFO] --- maven-deploy-plugin:2.7:deploy (default-deploy) @ apacheds-core-avl ---
Downloaded: https://repository.apache.org/content/repositories/snapshots/org/apache/directory/server/apacheds-core-avl/2.0.0-M12-SNAPSHOT/maven-metadata.xml
(809 B at 0.8 KB/sec)
Uploading: https://repository.apache.org/content/repositories/snapshots/org/apache/directory/server/apacheds-core-avl/2.0.0-M12-SNAPSHOT/apacheds-core-avl-2.0.0-M12-20130426.150048-46.jar
Uploaded: https://repository.apache.org/content/repositories/snapshots/org/apache/directory/server/apacheds-core-avl/2.0.0-M12-SNAPSHOT/apacheds-core-avl-2.0.0-M12-20130426.150048-46.jar
(60 KB at 167.7 KB/sec)
Uploading: https://repository.apache.org/content/repositories/snapshots/org/apache/directory/server/apacheds-core-avl/2.0.0-M12-SNAPSHOT/apacheds-core-avl-2.0.0-M12-20130426.150048-46.pom
Uploaded: https://repository.apache.org/content/repositories/snapshots/org/apache/directory/server/apacheds-core-avl/2.0.0-M12-SNAPSHOT/apacheds-core-avl-2.0.0-M12-20130426.150048-46.pom
(4 KB at 9.9 KB/sec)
Downloading: https://repository.apache.org/content/repositories/snapshots/org/apache/directory/server/apacheds-core-avl/maven-metadata.xml
Downloaded: https://repository.apache.org/content/repositories/snapshots/org/apache/directory/server/apacheds-core-avl/maven-metadata.xml
(412 B at 0.5 KB/sec)
Uploading: https://repository.apache.org/content/repositories/snapshots/org/apache/directory/server/apacheds-core-avl/2.0.0-M12-SNAPSHOT/maven-metadata.xml
Uploaded: https://repository.apache.org/content/repositories/snapshots/org/apache/directory/server/apacheds-core-avl/2.0.0-M12-SNAPSHOT/maven-metadata.xml
(809 B at 2.8 KB/sec)
Uploading: https://repository.apache.org/content/repositories/snapshots/org/apache/directory/server/apacheds-core-avl/maven-metadata.xml
Uploaded: https://repository.apache.org/content/repositories/snapshots/org/apache/directory/server/apacheds-core-avl/maven-metadata.xml
(412 B at 1.2 KB/sec)
[INFO] Remote OBR update disabled (enable with -DremoteOBR)
[INFO] 
[INFO] --- maven-bundle-plugin:2.3.7:deploy (default-deploy) @ apacheds-core-avl ---
[INFO]                                                                         
[INFO] ------------------------------------------------------------------------
[INFO] Building ApacheDS Generalized (X) DBM Partition 2.0.0-M12-SNAPSHOT
[INFO] ------------------------------------------------------------------------
[INFO] [INFO] Deleting <https://builds.apache.org/job/dir-apacheds-jdk16-ubuntu-deploy/ws/trunk/xdbm-partition/target>

[INFO] --- maven-clean-plugin:2.4.1:clean (default-clean) @ apacheds-xdbm-partition ---
[INFO] 
[INFO] --- maven-remote-resources-plugin:1.2.1:process (default) @ apacheds-xdbm-partition
---
[INFO] [debug] execute contextualize
[INFO] Using 'UTF-8' encoding to copy filtered resources.
[INFO] skip non existing resourceDirectory <https://builds.apache.org/job/dir-apacheds-jdk16-ubuntu-deploy/ws/trunk/xdbm-partition/src/main/resources>
[INFO] Copying 3 resources

[INFO] --- maven-resources-plugin:2.5:resources (default-resources) @ apacheds-xdbm-partition
---
[INFO] 
[INFO] --- maven-compiler-plugin:2.5.1:compile (default-compile) @ apacheds-xdbm-partition
---
[INFO] Compiling 69 source files to <https://builds.apache.org/job/dir-apacheds-jdk16-ubuntu-deploy/ws/trunk/xdbm-partition/target/classes>
[debug] execute contextualize
[INFO] [INFO] Using 'UTF-8' encoding to copy filtered resources.

[INFO] --- maven-resources-plugin:2.5:testResources (default-testResources) @ apacheds-xdbm-partition
---
[INFO] Copying 1 resource
[INFO] Copying 3 resources
[INFO] 
[INFO] --- maven-compiler-plugin:2.5.1:testCompile (default-testCompile) @ apacheds-xdbm-partition
---
[INFO] Compiling 25 source files to <https://builds.apache.org/job/dir-apacheds-jdk16-ubuntu-deploy/ws/trunk/xdbm-partition/target/test-classes>
[INFO] Surefire report directory: <https://builds.apache.org/job/dir-apacheds-jdk16-ubuntu-deploy/ws/trunk/xdbm-partition/target/surefire-reports>
[INFO] 
-------------------------------------------------------
 T E S T S
-------------------------------------------------------

[INFO] --- maven-surefire-plugin:2.12.2:test (default-test) @ apacheds-xdbm-partition ---
Running org.apache.directory.server.xdbm.PartitionTest
Tests run: 8, Failures: 0, Errors: 0, Skipped: 0, Time elapsed: 4.515 sec
Running org.apache.directory.server.xdbm.ParentIdAndRdnTest
Tests run: 1, Failures: 0, Errors: 0, Skipped: 0, Time elapsed: 0.5 sec
Running org.apache.directory.server.xdbm.IndexNotFoundExceptionTest
Tests run: 3, Failures: 0, Errors: 0, Skipped: 0, Time elapsed: 0.002 sec
Running org.apache.directory.server.xdbm.TupleTest
Tests run: 10, Failures: 0, Errors: 0, Skipped: 0, Time elapsed: 0.004 sec
Running org.apache.directory.server.xdbm.EmptyIndexCursorTest
Tests run: 16, Failures: 0, Errors: 0, Skipped: 0, Time elapsed: 0.006 sec
Running org.apache.directory.server.xdbm.IndexEntryTest
Tests run: 7, Failures: 0, Errors: 0, Skipped: 0, Time elapsed: 0.014 sec
Running org.apache.directory.server.xdbm.SingletonIndexCursorTest
Tests run: 14, Failures: 0, Errors: 0, Skipped: 0, Time elapsed: 0 sec
Running org.apache.directory.server.xdbm.search.impl.PresenceTest
Tests run: 10, Failures: 0, Errors: 0, Skipped: 0, Time elapsed: 0.533 sec
Running org.apache.directory.server.xdbm.search.impl.OrCursorTest
Tests run: 2, Failures: 0, Errors: 0, Skipped: 0, Time elapsed: 0.429 sec
Running org.apache.directory.server.xdbm.search.impl.LessEqTest
Tests run: 8, Failures: 0, Errors: 0, Skipped: 0, Time elapsed: 0.66 sec
Running org.apache.directory.server.xdbm.search.impl.NotCursorTest
Tests run: 2, Failures: 0, Errors: 0, Skipped: 0, Time elapsed: 0.356 sec
Running org.apache.directory.server.xdbm.search.impl.NestedFilterTest
Tests run: 4, Failures: 0, Errors: 0, Skipped: 0, Time elapsed: 0.321 sec
Running org.apache.directory.server.xdbm.search.impl.SubstringTest
Tests run: 12, Failures: 0, Errors: 0, Skipped: 0, Time elapsed: 0.441 sec
Running org.apache.directory.server.xdbm.search.impl.GreaterEqTest
Tests run: 8, Failures: 0, Errors: 0, Skipped: 0, Time elapsed: 0.569 sec
Running org.apache.directory.server.xdbm.search.impl.AndCursorTest
Tests run: 2, Failures: 0, Errors: 0, Skipped: 0, Time elapsed: 0.312 sec
Running org.apache.directory.server.xdbm.search.impl.EqualityTest
Tests run: 11, Failures: 0, Errors: 0, Skipped: 0, Time elapsed: 0.301 sec
Running org.apache.directory.server.xdbm.AbstractIndexCursorTest
Tests run: 9, Failures: 0, Errors: 0, Skipped: 0, Time elapsed: 0.003 sec
Running org.apache.directory.server.xdbm.impl.avl.AvlPartitionTest
Tests run: 13, Failures: 0, Errors: 0, Skipped: 0, Time elapsed: 0.316 sec
Running org.apache.directory.server.xdbm.impl.avl.AvlTableTest
Tests run: 5, Failures: 0, Errors: 0, Skipped: 0, Time elapsed: 0.011 sec
Running org.apache.directory.server.xdbm.impl.avl.AvlRdnIndexTest
Tests run: 8, Failures: 0, Errors: 0, Skipped: 1, Time elapsed: 0.378 sec

Results :

Tests run: 153, Failures: 0, Errors: 0, Skipped: 1

[JENKINS] Recording test results
[INFO] 
[INFO] --- maven-bundle-plugin:2.3.7:bundle (default-bundle) @ apacheds-xdbm-partition ---
[WARNING] Bundle org.apache.directory.server:apacheds-xdbm-partition:bundle:2.0.0-M12-SNAPSHOT
: Instructions in Export-Package that are never used: org\.apache\.directory\.server\.log\.impl\.avl
Classpath: Jar:.,Jar:apacheds-core-avl,Jar:commons-lang,Jar:apacheds-core-api,Jar:apacheds-core-constants,Jar:api-i18n,Jar:api-asn1-api,Jar:api-ldap-client-api,Jar:api-ldap-codec-standalone,Jar:api-ldap-net-mina,Jar:commons-pool,Jar:api-ldap-codec-core,Jar:api-ldap-extras-aci,Jar:api-ldap-extras-util,Jar:mina-core,Jar:ehcache-core,Jar:apacheds-i18n,Jar:commons-io,Jar:commons-collections,Jar:api-ldap-model,Jar:api-asn1-ber,Jar:antlr,Jar:api-ldap-schema-data,Jar:api-util,Jar:annotations,Jar:slf4j-api

[WARNING] Bundle org.apache.directory.server:apacheds-xdbm-partition:bundle:2.0.0-M12-SNAPSHOT
: Superfluous export-package instructions: [org.apache.directory.server.log.impl.avl]
[INFO] 
[INFO] --- maven-site-plugin:3.1:attach-descriptor (attach-descriptor) @ apacheds-xdbm-partition
---
[INFO] [INFO] Building jar: <https://builds.apache.org/job/dir-apacheds-jdk16-ubuntu-deploy/ws/trunk/xdbm-partition/target/apacheds-xdbm-partition-2.0.0-M12-SNAPSHOT-tests.jar>

[INFO] --- maven-jar-plugin:2.4:test-jar (attach-tests) @ apacheds-xdbm-partition ---
[INFO] [INFO] Checking legal files in: apacheds-xdbm-partition-2.0.0-M12-SNAPSHOT.jar
[INFO] Checking legal files in: apacheds-xdbm-partition-2.0.0-M12-SNAPSHOT-tests.jar

[INFO] --- tools-maven-plugin:1.4:verify-legal-files (verify-legal-files) @ apacheds-xdbm-partition
---
[INFO] [INFO] Installing <https://builds.apache.org/job/dir-apacheds-jdk16-ubuntu-deploy/ws/trunk/xdbm-partition/target/apacheds-xdbm-partition-2.0.0-M12-SNAPSHOT.jar>
to /home/jenkins/jenkins-slave/maven-repositories/0/org/apache/directory/server/apacheds-xdbm-partition/2.0.0-M12-SNAPSHOT/apacheds-xdbm-partition-2.0.0-M12-SNAPSHOT.jar
[INFO] Installing <https://builds.apache.org/job/dir-apacheds-jdk16-ubuntu-deploy/ws/trunk/xdbm-partition/pom.xml>
to /home/jenkins/jenkins-slave/maven-repositories/0/org/apache/directory/server/apacheds-xdbm-partition/2.0.0-M12-SNAPSHOT/apacheds-xdbm-partition-2.0.0-M12-SNAPSHOT.pom

[INFO] --- maven-install-plugin:2.3.1:install (default-install) @ apacheds-xdbm-partition
---
[INFO] Installing <https://builds.apache.org/job/dir-apacheds-jdk16-ubuntu-deploy/ws/trunk/xdbm-partition/target/apacheds-xdbm-partition-2.0.0-M12-SNAPSHOT-tests.jar>
to /home/jenkins/jenkins-slave/maven-repositories/0/org/apache/directory/server/apacheds-xdbm-partition/2.0.0-M12-SNAPSHOT/apacheds-xdbm-partition-2.0.0-M12-SNAPSHOT-tests.jar
[INFO] [WARNING] Exception while updating local OBR: Unable to read repository xml: file:/home/jenkins/jenkins-slave/maven-repositories/0/repository.xml
org.apache.maven.plugin.MojoExecutionException: Unable to read repository xml: file:/home/jenkins/jenkins-slave/maven-repositories/0/repository.xml
	at org.apache.felix.obrplugin.ObrUpdate.parseRepositoryXml(ObrUpdate.java:324)
	at org.apache.felix.obrplugin.ObrInstall.execute(ObrInstall.java:141)
	at org.apache.maven.plugin.DefaultBuildPluginManager.executeMojo(DefaultBuildPluginManager.java:101)
	at org.apache.maven.lifecycle.internal.MojoExecutor.execute(MojoExecutor.java:209)
	at org.apache.maven.lifecycle.internal.MojoExecutor.execute(MojoExecutor.java:153)
	at org.apache.maven.lifecycle.internal.MojoExecutor.execute(MojoExecutor.java:145)
	at org.apache.maven.lifecycle.internal.LifecycleModuleBuilder.buildProject(LifecycleModuleBuilder.java:84)
	at org.apache.maven.lifecycle.internal.LifecycleModuleBuilder.buildProject(LifecycleModuleBuilder.java:59)
	at org.apache.maven.lifecycle.internal.LifecycleStarter.singleThreadedBuild(LifecycleStarter.java:183)
	at org.apache.maven.lifecycle.internal.LifecycleStarter.execute(LifecycleStarter.java:161)
	at org.apache.maven.DefaultMaven.doExecute(DefaultMaven.java:320)
	at org.apache.maven.DefaultMaven.execute(DefaultMaven.java:156)
	at org.jvnet.hudson.maven3.launcher.Maven3Launcher.main(Maven3Launcher.java:79)
	at sun.reflect.NativeMethodAccessorImpl.invoke0(Native Method)
	at sun.reflect.NativeMethodAccessorImpl.invoke(NativeMethodAccessorImpl.java:39)
	at sun.reflect.DelegatingMethodAccessorImpl.invoke(DelegatingMethodAccessorImpl.java:25)
	at java.lang.reflect.Method.invoke(Method.java:597)
	at org.codehaus.plexus.classworlds.launcher.Launcher.launchStandard(Launcher.java:329)
	at org.codehaus.plexus.classworlds.launcher.Launcher.launch(Launcher.java:239)
	at org.jvnet.hudson.maven3.agent.Maven3Main.launch(Maven3Main.java:158)
	at hudson.maven.Maven3Builder.call(Maven3Builder.java:100)
	at hudson.maven.Maven3Builder.call(Maven3Builder.java:66)
	at hudson.remoting.UserRequest.perform(UserRequest.java:118)
	at hudson.remoting.UserRequest.perform(UserRequest.java:48)
	at hudson.remoting.Request$2.run(Request.java:326)
	at hudson.remoting.InterceptingExecutorService$1.call(InterceptingExecutorService.java:72)
	at java.util.concurrent.FutureTask$Sync.innerRun(FutureTask.java:303)
	at java.util.concurrent.FutureTask.run(FutureTask.java:138)
	at java.util.concurrent.ThreadPoolExecutor$Worker.runTask(ThreadPoolExecutor.java:886)
	at java.util.concurrent.ThreadPoolExecutor$Worker.run(ThreadPoolExecutor.java:908)
	at java.lang.Thread.run(Thread.java:662)
Caused by: org.xmlpull.v1.XmlPullParserException: unexpected type (position:END_DOCUMENT null@3:1
in java.io.InputStreamReader@bb893a) 
	at org.kxml2.io.KXmlParser.exception(Unknown Source)
	at org.kxml2.io.KXmlParser.nextTag(Unknown Source)
	at org.apache.felix.bundlerepository.impl.PullParser.parseRepository(PullParser.java:43)
	at org.apache.felix.bundlerepository.impl.DataModelHelperImpl.repository(DataModelHelperImpl.java:147)
	at org.apache.felix.bundlerepository.impl.DataModelHelperImpl.repository(DataModelHelperImpl.java:118)
	at org.apache.felix.obrplugin.ObrUpdate.parseRepositoryXml(ObrUpdate.java:316)
	... 30 more

[INFO] --- maven-bundle-plugin:2.3.7:install (default-install) @ apacheds-xdbm-partition ---
Downloading: https://repository.apache.org/content/repositories/snapshots/org/apache/directory/server/apacheds-xdbm-partition/2.0.0-M12-SNAPSHOT/maven-metadata.xml
[INFO] 
[INFO] --- maven-deploy-plugin:2.7:deploy (default-deploy) @ apacheds-xdbm-partition ---
Downloaded: https://repository.apache.org/content/repositories/snapshots/org/apache/directory/server/apacheds-xdbm-partition/2.0.0-M12-SNAPSHOT/maven-metadata.xml
(2 KB at 3.1 KB/sec)
Uploading: https://repository.apache.org/content/repositories/snapshots/org/apache/directory/server/apacheds-xdbm-partition/2.0.0-M12-SNAPSHOT/apacheds-xdbm-partition-2.0.0-M12-20130426.150113-46.jar
Uploaded: https://repository.apache.org/content/repositories/snapshots/org/apache/directory/server/apacheds-xdbm-partition/2.0.0-M12-SNAPSHOT/apacheds-xdbm-partition-2.0.0-M12-20130426.150113-46.jar
(172 KB at 383.7 KB/sec)
Uploading: https://repository.apache.org/content/repositories/snapshots/org/apache/directory/server/apacheds-xdbm-partition/2.0.0-M12-SNAPSHOT/apacheds-xdbm-partition-2.0.0-M12-20130426.150113-46.pom
Uploaded: https://repository.apache.org/content/repositories/snapshots/org/apache/directory/server/apacheds-xdbm-partition/2.0.0-M12-SNAPSHOT/apacheds-xdbm-partition-2.0.0-M12-20130426.150113-46.pom
(5 KB at 14.5 KB/sec)
Downloading: https://repository.apache.org/content/repositories/snapshots/org/apache/directory/server/apacheds-xdbm-partition/maven-metadata.xml
Downloaded: https://repository.apache.org/content/repositories/snapshots/org/apache/directory/server/apacheds-xdbm-partition/maven-metadata.xml
(418 B at 0.3 KB/sec)
Uploading: https://repository.apache.org/content/repositories/snapshots/org/apache/directory/server/apacheds-xdbm-partition/2.0.0-M12-SNAPSHOT/maven-metadata.xml
Uploaded: https://repository.apache.org/content/repositories/snapshots/org/apache/directory/server/apacheds-xdbm-partition/2.0.0-M12-SNAPSHOT/maven-metadata.xml
(2 KB at 1.7 KB/sec)
Uploading: https://repository.apache.org/content/repositories/snapshots/org/apache/directory/server/apacheds-xdbm-partition/maven-metadata.xml
Uploaded: https://repository.apache.org/content/repositories/snapshots/org/apache/directory/server/apacheds-xdbm-partition/maven-metadata.xml
(418 B at 0.9 KB/sec)
Uploading: https://repository.apache.org/content/repositories/snapshots/org/apache/directory/server/apacheds-xdbm-partition/2.0.0-M12-SNAPSHOT/apacheds-xdbm-partition-2.0.0-M12-20130426.150113-46-tests.jar
Uploaded: https://repository.apache.org/content/repositories/snapshots/org/apache/directory/server/apacheds-xdbm-partition/2.0.0-M12-SNAPSHOT/apacheds-xdbm-partition-2.0.0-M12-20130426.150113-46-tests.jar
(99 KB at 222.8 KB/sec)
Uploading: https://repository.apache.org/content/repositories/snapshots/org/apache/directory/server/apacheds-xdbm-partition/2.0.0-M12-SNAPSHOT/maven-metadata.xml
Uploaded: https://repository.apache.org/content/repositories/snapshots/org/apache/directory/server/apacheds-xdbm-partition/2.0.0-M12-SNAPSHOT/maven-metadata.xml
(2 KB at 3.2 KB/sec)
[INFO] [INFO] Remote OBR update disabled (enable with -DremoteOBR)

[INFO] --- maven-bundle-plugin:2.3.7:deploy (default-deploy) @ apacheds-xdbm-partition ---
[INFO] [INFO] Deleting <https://builds.apache.org/job/dir-apacheds-jdk16-ubuntu-deploy/ws/trunk/ldif-partition/target>
                                                                        
[INFO] ------------------------------------------------------------------------
[INFO] Building ApacheDS LDIF Partition 2.0.0-M12-SNAPSHOT
[INFO] ------------------------------------------------------------------------
[INFO] 
[INFO] --- maven-clean-plugin:2.4.1:clean (default-clean) @ apacheds-ldif-partition ---
[INFO] 
[INFO] --- maven-remote-resources-plugin:1.2.1:process (default) @ apacheds-ldif-partition
---
[INFO] [debug] execute contextualize
[INFO] Using 'UTF-8' encoding to copy filtered resources.
[INFO] Copying 2 resources
[INFO] Copying 3 resources

[INFO] --- maven-resources-plugin:2.5:resources (default-resources) @ apacheds-ldif-partition
---
[INFO] 
[INFO] --- maven-compiler-plugin:2.5.1:compile (default-compile) @ apacheds-ldif-partition
---
[INFO] Compiling 3 source files to <https://builds.apache.org/job/dir-apacheds-jdk16-ubuntu-deploy/ws/trunk/ldif-partition/target/classes>
[debug] execute contextualize
[INFO] [INFO] Using 'UTF-8' encoding to copy filtered resources.
[INFO] Copying 1 resource
[INFO] Copying 3 resources

[INFO] --- maven-resources-plugin:2.5:testResources (default-testResources) @ apacheds-ldif-partition
---
[INFO] 
[INFO] --- maven-compiler-plugin:2.5.1:testCompile (default-testCompile) @ apacheds-ldif-partition
---
[INFO] Compiling 2 source files to <https://builds.apache.org/job/dir-apacheds-jdk16-ubuntu-deploy/ws/trunk/ldif-partition/target/test-classes>
[INFO] [INFO] Surefire report directory: <https://builds.apache.org/job/dir-apacheds-jdk16-ubuntu-deploy/ws/trunk/ldif-partition/target/surefire-reports>

-------------------------------------------------------
 T E S T S
-------------------------------------------------------

[INFO] --- maven-surefire-plugin:2.12.2:test (default-test) @ apacheds-ldif-partition ---
Running org.apache.directory.server.core.partition.ldif.SingleFileLdifPartitionTest
Tests run: 14, Failures: 0, Errors: 0, Skipped: 1, Time elapsed: 30.731 sec
Running org.apache.directory.server.core.partition.ldif.LdifPartitionTest
Tests run: 11, Failures: 0, Errors: 0, Skipped: 0, Time elapsed: 0.764 sec

Results :

Tests run: 25, Failures: 0, Errors: 0, Skipped: 1

ERROR: Maven JVM terminated unexpectedly with exit code 143


Mime
View raw message