directory-notifications mailing list archives

Site index · List index
Message view « Date » · « Thread »
Top « Date » · « Thread »
From Apache Jenkins Server <jenk...@builds.apache.org>
Subject Build failed in Jenkins: dir-apacheds-jdk16-win #339
Date Sun, 03 Mar 2013 05:08:13 GMT
See <https://builds.apache.org/job/dir-apacheds-jdk16-win/339/>

------------------------------------------
[...truncated 3918 lines...]
[INFO] 
[INFO] --- maven-clean-plugin:2.4.1:clean (default-clean) @ apacheds-service ---
[INFO] Deleting F:\hudson\hudson-slave\workspace\dir-apacheds-jdk16-win\trunk\service\target
[INFO] 
[INFO] --- maven-remote-resources-plugin:1.2.1:process (default) @ apacheds-service ---
[INFO] [debug] execute contextualize

[INFO] Using 'UTF-8' encoding to copy filtered resources.
[INFO] [INFO] skip non existing resourceDirectory F:\hudson\hudson-slave\workspace\dir-apacheds-jdk16-win\trunk\service\src\main\resources
--- maven-resources-plugin:2.5:resources (default-resources) @ apacheds-service ---
[INFO] Copying 3 resources
[INFO] 
[INFO] --- maven-compiler-plugin:2.5.1:compile (default-compile) @ apacheds-service ---
[INFO] Compiling 3 source files to F:\hudson\hudson-slave\workspace\dir-apacheds-jdk16-win\trunk\service\target\classes
[INFO] [debug] execute contextualize

[INFO] --- maven-resources-plugin:2.5:testResources (default-testResources) @ apacheds-service
---
[INFO] Using 'UTF-8' encoding to copy filtered resources.
[INFO] Copying 3 resources
[INFO] Copying 3 resources
[INFO] 
[INFO] --- maven-compiler-plugin:2.5.1:testCompile (default-testCompile) @ apacheds-service
---
[INFO] Compiling 1 source file to F:\hudson\hudson-slave\workspace\dir-apacheds-jdk16-win\trunk\service\target\test-classes
[INFO] 
[INFO] --- maven-surefire-plugin:2.12.2:test (default-test) @ apacheds-service ---
[INFO] Surefire report directory: F:\hudson\hudson-slave\workspace\dir-apacheds-jdk16-win\trunk\service\target\surefire-reports

-------------------------------------------------------
 T E S T S
-------------------------------------------------------
Running org.apache.directory.server.UberJarMainTest
java.io.IOException: ERR_09001_DIRECTORY_CREATION_FAILED The directory C:\Users\hudson\AppData\Local\Temp\ApacheDS-2013235758\partitions\schema\ou=schema\cn=dhcp\ou=objectclasses
could not be created
	at org.apache.directory.api.ldap.schemaextractor.impl.DefaultSchemaLdifExtractor.extractFromClassLoader(DefaultSchemaLdifExtractor.java:417)
	at org.apache.directory.api.ldap.schemaextractor.impl.DefaultSchemaLdifExtractor.extractOrCopy(DefaultSchemaLdifExtractor.java:167)
	at org.apache.directory.api.ldap.schemaextractor.impl.DefaultSchemaLdifExtractor.extractOrCopy(DefaultSchemaLdifExtractor.java:187)
	at org.apache.directory.server.ApacheDsService.initSchemaManager(ApacheDsService.java:222)
	at org.apache.directory.server.ApacheDsService.start(ApacheDsService.java:167)
	at org.apache.directory.server.UberjarMain.start(UberjarMain.java:76)
	at org.apache.directory.server.UberJarMainTest.serviceInstanceTest(UberJarMainTest.java:98)
	at sun.reflect.NativeMethodAccessorImpl.invoke0(Native Method)
	at sun.reflect.NativeMethodAccessorImpl.invoke(NativeMethodAccessorImpl.java:39)
	at sun.reflect.DelegatingMethodAccessorImpl.invoke(DelegatingMethodAccessorImpl.java:25)
	at java.lang.reflect.Method.invoke(Method.java:597)
	at org.junit.runners.model.FrameworkMethod$1.runReflectiveCall(FrameworkMethod.java:47)
	at org.junit.internal.runners.model.ReflectiveCallable.run(ReflectiveCallable.java:12)
	at org.junit.runners.model.FrameworkMethod.invokeExplosively(FrameworkMethod.java:44)
	at org.junit.internal.runners.statements.InvokeMethod.evaluate(InvokeMethod.java:17)
	at org.junit.internal.runners.statements.RunBefores.evaluate(RunBefores.java:26)
	at org.junit.internal.runners.statements.RunAfters.evaluate(RunAfters.java:27)
	at org.junit.runners.ParentRunner.runLeaf(ParentRunner.java:271)
	at org.junit.runners.BlockJUnit4ClassRunner.runChild(BlockJUnit4ClassRunner.java:70)
	at org.junit.runners.BlockJUnit4ClassRunner.runChild(BlockJUnit4ClassRunner.java:50)
	at org.junit.runners.ParentRunner$3.run(ParentRunner.java:238)
	at org.junit.runners.ParentRunner$1.schedule(ParentRunner.java:63)
	at org.junit.runners.ParentRunner.runChildren(ParentRunner.java:236)
	at org.junit.runners.ParentRunner.access$000(ParentRunner.java:53)
	at org.junit.runners.ParentRunner$2.evaluate(ParentRunner.java:229)
	at org.junit.runners.ParentRunner.run(ParentRunner.java:309)
	at org.apache.maven.surefire.junit4.JUnit4Provider.execute(JUnit4Provider.java:252)
	at org.apache.maven.surefire.junit4.JUnit4Provider.executeTestSet(JUnit4Provider.java:141)
	at org.apache.maven.surefire.junit4.JUnit4Provider.invoke(JUnit4Provider.java:112)
	at sun.reflect.NativeMethodAccessorImpl.invoke0(Native Method)
	at sun.reflect.NativeMethodAccessorImpl.invoke(NativeMethodAccessorImpl.java:39)
	at sun.reflect.DelegatingMethodAccessorImpl.invoke(DelegatingMethodAccessorImpl.java:25)
	at java.lang.reflect.Method.invoke(Method.java:597)
	at org.apache.maven.surefire.util.ReflectionUtils.invokeMethodWithArray(ReflectionUtils.java:189)
	at org.apache.maven.surefire.booter.ProviderFactory$ProviderProxy.invoke(ProviderFactory.java:165)
	at org.apache.maven.surefire.booter.ProviderFactory.invokeProvider(ProviderFactory.java:85)
	at org.apache.maven.surefire.booter.ForkedBooter.runSuitesInProcess(ForkedBooter.java:113)
	at org.apache.maven.surefire.booter.ForkedBooter.main(ForkedBooter.java:75)

Results :

Tests run: 0, Failures: 0, Errors: 0, Skipped: 0

[JENKINS] Recording test results
[INFO] ------------------------------------------------------------------------
[INFO] Reactor Summary:
[INFO] 
[INFO] ApacheDS .......................................... SUCCESS [3.661s]
[INFO] ApacheDS I18n ..................................... SUCCESS [4.700s]
[INFO] ApacheDS Core Constants ........................... SUCCESS [2.511s]
[INFO] ApacheDS Core API ................................. SUCCESS [19.051s]
[INFO] ApacheDS Core Shared .............................. SUCCESS [3.900s]
[INFO] ApacheDS Interceptors ............................. SUCCESS [0.310s]
[INFO] ApacheDS AdministrativePoint Interceptor .......... SUCCESS [2.420s]
[INFO] ApacheDS Authentication Interceptor ............... SUCCESS [4.616s]
[INFO] ApacheDS Authorization Interceptor ................ SUCCESS [11.902s]
[INFO] ApacheDS ChangeLog Interceptor .................... SUCCESS [3.725s]
[INFO] ApacheDS Collective Attribute Interceptor ......... SUCCESS [1.939s]
[INFO] ApacheDS Event Interceptor ........................ SUCCESS [1.592s]
[INFO] ApacheDS Exception Interceptor .................... SUCCESS [1.472s]
[INFO] ApacheDS Journal Interceptor ...................... SUCCESS [2.018s]
[INFO] ApacheDS Normalization Interceptor ................ SUCCESS [3.241s]
[INFO] ApacheDS Operational Attribute Interceptor ........ SUCCESS [1.695s]
[INFO] ApacheDS Referral Interceptor ..................... SUCCESS [2.003s]
[INFO] ApacheDS Schema Interceptor ....................... SUCCESS [7.914s]
[INFO] ApacheDS Subtree Interceptor ...................... SUCCESS [12.284s]
[INFO] ApacheDS Triggers Interceptor ..................... SUCCESS [2.558s]
[INFO] ApacheDS Core ..................................... SUCCESS [5.389s]
[INFO] ApacheDS Core AVL ................................. SUCCESS [9.022s]
[INFO] ApacheDS Generalized (X) DBM Partition ............ SUCCESS [20.483s]
[INFO] ApacheDS LDIF Partition ........................... SUCCESS [20.423s]
[INFO] ApacheDS JDBM Partition ........................... SUCCESS [46.706s]
[INFO] ApacheDS Core Annotations ......................... SUCCESS [43.728s]
[INFO] ApacheDS Core JNDI ................................ SUCCESS [2.829s]
[INFO] ApacheDS Protocol Kerberos Codec .................. SUCCESS [17.055s]
[INFO] ApacheDS Interceptors for Kerberos ................ SUCCESS [2.168s]
[INFO] ApacheDS Protocol Dhcp ............................ SUCCESS [4.640s]
[INFO] ApacheDS Protocol Shared .......................... SUCCESS [2.291s]
[INFO] ApacheDS Protocol Dns ............................. SUCCESS [5.285s]
[INFO] ApacheDS Protocol Kerberos ........................ SUCCESS [5.131s]
[INFO] ApacheDS Protocol Ldap ............................ SUCCESS [1:02.870s]
[INFO] ApacheDS Protocol Ntp ............................. SUCCESS [3.021s]
[INFO] Apacheds Server Annotations ....................... SUCCESS [45.944s]
[INFO] ApacheDS Server Config ............................ SUCCESS [30.479s]
[INFO] ApacheDS Server JNDI .............................. SUCCESS [2.365s]
[INFO] ApacheDS Test Framework ........................... SUCCESS [1:19.429s]
[INFO] ApacheDS All ...................................... SUCCESS [4.224s]
[INFO] ApacheDS Logger Interceptor ....................... SUCCESS [1.795s]
[INFO] ApacheDS Password Hashing Interceptor ............. SUCCESS [1.575s]
[INFO] ApacheDS Core Integration ......................... SUCCESS [28:33.567s]
[INFO] ApacheDS Server Integration ....................... SUCCESS [22:10.311s]
[INFO] ApacheDS DirectoryService-WebApp bridge ........... SUCCESS [1.331s]
[INFO] ApacheDS Jetty HTTP Server Integration ............ SUCCESS [1.760s]
[INFO] ApacheDS Service Builder .......................... SUCCESS [2.184s]
[INFO] ApacheDS Protocol Kerberos Test ................... SUCCESS [2.741s]
[INFO] Apache Directory LDAP Client API test ............. SUCCESS [3.032s]
[INFO] kerberos-client ................................... SUCCESS [2.196s]
[INFO] ApacheDS Service .................................. FAILURE [2.767s]
[INFO] ApacheDS Wrapper .................................. SKIPPED
[INFO] ApacheDS Installers Maven Plugin .................. SKIPPED
[INFO] ApacheDS Installers ............................... SKIPPED
[INFO] ------------------------------------------------------------------------
[INFO] BUILD FAILURE
[INFO] ------------------------------------------------------------------------
[INFO] Total time: 59:33.939s
[INFO] Finished at: Sun Mar 03 05:07:59 GMT 2013
[INFO] Final Memory: 60M/295M
[INFO] ------------------------------------------------------------------------
[JENKINS] Archiving disabled
[JENKINS] Archiving disabled
[JENKINS] Archiving disabled
[JENKINS] Archiving disabled
[JENKINS] Archiving disabled
[JENKINS] Archiving disabled
[JENKINS] Archiving disabled
[JENKINS] Archiving disabled
[JENKINS] Archiving disabled
[JENKINS] Archiving disabled
[JENKINS] Archiving disabled
[JENKINS] Archiving disabled
[JENKINS] Archiving disabled
[JENKINS] Archiving disabled
[JENKINS] Archiving disabled
[JENKINS] Archiving disabled
[JENKINS] Archiving disabled
[JENKINS] Archiving disabled
[JENKINS] Archiving disabled
[JENKINS] Archiving disabled
[JENKINS] Archiving disabled
[JENKINS] Archiving disabled
[JENKINS] Archiving disabled
[JENKINS] Archiving disabled
[JENKINS] Archiving disabled
[JENKINS] Archiving disabled
[JENKINS] Archiving disabled
[JENKINS] Archiving disabled
[JENKINS] Archiving disabled
[JENKINS] Archiving disabled
[JENKINS] Archiving disabled
[JENKINS] Archiving disabled
[JENKINS] Archiving disabled
[JENKINS] Archiving disabled
[JENKINS] Archiving disabled
[JENKINS] Archiving disabled
[JENKINS] Archiving disabled
[JENKINS] Archiving disabled
[JENKINS] Archiving disabled
[JENKINS] Archiving disabled
[JENKINS] Archiving disabled
[JENKINS] Archiving disabled
[JENKINS] Archiving disabled
[JENKINS] Archiving disabled
[JENKINS] Archiving disabled
[JENKINS] Archiving disabled
[JENKINS] Archiving disabled
[JENKINS] Archiving disabled
[JENKINS] Archiving disabled
[JENKINS] Archiving disabled
[JENKINS] Archiving disabled
[JENKINS] Archiving disabled
[JENKINS] Archiving disabled
[JENKINS] Archiving disabled
Waiting for Jenkins to finish collecting data
mavenExecutionResult exceptions not empty
message : Failed to execute goal org.apache.maven.plugins:maven-surefire-plugin:2.12.2:test
(default-test) on project apacheds-service: Execution default-test of goal org.apache.maven.plugins:maven-surefire-plugin:2.12.2:test
failed: The forked VM terminated without saying properly goodbye. VM crash or System.exit
called ?
cause : Execution default-test of goal org.apache.maven.plugins:maven-surefire-plugin:2.12.2:test
failed: The forked VM terminated without saying properly goodbye. VM crash or System.exit
called ?
Stack trace : 
org.apache.maven.lifecycle.LifecycleExecutionException: Failed to execute goal org.apache.maven.plugins:maven-surefire-plugin:2.12.2:test
(default-test) on project apacheds-service: Execution default-test of goal org.apache.maven.plugins:maven-surefire-plugin:2.12.2:test
failed: The forked VM terminated without saying properly goodbye. VM crash or System.exit
called ?
	at org.apache.maven.lifecycle.internal.MojoExecutor.execute(MojoExecutor.java:225)
	at org.apache.maven.lifecycle.internal.MojoExecutor.execute(MojoExecutor.java:153)
	at org.apache.maven.lifecycle.internal.MojoExecutor.execute(MojoExecutor.java:145)
	at org.apache.maven.lifecycle.internal.LifecycleModuleBuilder.buildProject(LifecycleModuleBuilder.java:84)
	at org.apache.maven.lifecycle.internal.LifecycleModuleBuilder.buildProject(LifecycleModuleBuilder.java:59)
	at org.apache.maven.lifecycle.internal.LifecycleStarter.singleThreadedBuild(LifecycleStarter.java:183)
	at org.apache.maven.lifecycle.internal.LifecycleStarter.execute(LifecycleStarter.java:161)
	at org.apache.maven.DefaultMaven.doExecute(DefaultMaven.java:319)
	at org.apache.maven.DefaultMaven.execute(DefaultMaven.java:156)
	at org.jvnet.hudson.maven3.launcher.Maven3Launcher.main(Maven3Launcher.java:79)
	at sun.reflect.NativeMethodAccessorImpl.invoke0(Native Method)
	at sun.reflect.NativeMethodAccessorImpl.invoke(NativeMethodAccessorImpl.java:39)
	at sun.reflect.DelegatingMethodAccessorImpl.invoke(DelegatingMethodAccessorImpl.java:25)
	at java.lang.reflect.Method.invoke(Method.java:597)
	at org.codehaus.plexus.classworlds.launcher.Launcher.launchStandard(Launcher.java:329)
	at org.codehaus.plexus.classworlds.launcher.Launcher.launch(Launcher.java:239)
	at org.jvnet.hudson.maven3.agent.Maven3Main.launch(Maven3Main.java:158)
	at hudson.maven.Maven3Builder.call(Maven3Builder.java:100)
	at hudson.maven.Maven3Builder.call(Maven3Builder.java:66)
	at hudson.remoting.UserRequest.perform(UserRequest.java:118)
	at hudson.remoting.UserRequest.perform(UserRequest.java:48)
	at hudson.remoting.Request$2.run(Request.java:326)
	at hudson.remoting.InterceptingExecutorService$1.call(InterceptingExecutorService.java:72)
	at java.util.concurrent.FutureTask$Sync.innerRun(FutureTask.java:303)
	at java.util.concurrent.FutureTask.run(FutureTask.java:138)
	at java.util.concurrent.ThreadPoolExecutor$Worker.runTask(ThreadPoolExecutor.java:886)
	at java.util.concurrent.ThreadPoolExecutor$Worker.run(ThreadPoolExecutor.java:908)
	at java.lang.Thread.run(Thread.java:662)
Caused by: org.apache.maven.plugin.PluginExecutionException: Execution default-test of goal
org.apache.maven.plugins:maven-surefire-plugin:2.12.2:test failed: The forked VM terminated
without saying properly goodbye. VM crash or System.exit called ?
	at org.apache.maven.plugin.DefaultBuildPluginManager.executeMojo(DefaultBuildPluginManager.java:116)
	at org.apache.maven.lifecycle.internal.MojoExecutor.execute(MojoExecutor.java:209)
	... 27 more
Caused by: java.lang.RuntimeException: The forked VM terminated without saying properly goodbye.
VM crash or System.exit called ?
	at org.apache.maven.plugin.surefire.booterclient.output.ForkClient.close(ForkClient.java:245)
	at org.apache.maven.plugin.surefire.booterclient.ForkStarter.fork(ForkStarter.java:282)
	at org.apache.maven.plugin.surefire.booterclient.ForkStarter.run(ForkStarter.java:116)
	at org.apache.maven.plugin.surefire.AbstractSurefireMojo.executeProvider(AbstractSurefireMojo.java:695)
	at org.apache.maven.plugin.surefire.AbstractSurefireMojo.executeAllProviders(AbstractSurefireMojo.java:666)
	at org.apache.maven.plugin.surefire.AbstractSurefireMojo.executeAfterPreconditionsChecked(AbstractSurefireMojo.java:624)
	at org.apache.maven.plugin.surefire.AbstractSurefireMojo.execute(AbstractSurefireMojo.java:587)
	at org.apache.maven.plugin.DefaultBuildPluginManager.executeMojo(DefaultBuildPluginManager.java:107)
	... 28 more
Maven failed with error.
Sending e-mails to: notifications@directory.apache.org
Sending e-mails to: notifications@directory.apache.org
Sending e-mails to: notifications@directory.apache.org
Sending e-mails to: notifications@directory.apache.org
Sending e-mails to: notifications@directory.apache.org
channel stopped

Mime
View raw message