directory-notifications mailing list archives

Site index · List index
Message view « Date » · « Thread »
Top « Date » · « Thread »
From Apache Jenkins Server <jenk...@builds.apache.org>
Subject Build failed in Jenkins: dir-apacheds-jdbm-jdk16-win #280
Date Wed, 06 Mar 2013 04:18:38 GMT
See <https://builds.apache.org/job/dir-apacheds-jdbm-jdk16-win/280/>

------------------------------------------
Started by timer
Building remotely on windows1 in workspace <https://builds.apache.org/job/dir-apacheds-jdbm-jdk16-win/ws/>
Updating https://svn.apache.org/repos/asf/directory/jdbm/trunk
At revision 1453158
no change for https://svn.apache.org/repos/asf/directory/jdbm/trunk since the previous build
Parsing POMs
Modules changed, recalculating dependency graph
[dir-apacheds-jdbm-jdk16-win] $ f:\hudson\tools\java\latest-1.6-64/bin/java -cp f:\hudson\hudson-slave\maven3-agent.jar;f:\hudson\tools\maven\latest\boot\plexus-classworlds-2.4.jar
org.jvnet.hudson.maven3.agent.Maven3Main f:\hudson\tools\maven\latest C:\Users\hudson\AppData\LocalLow\Sun\Java\Deployment\cache\6.0\39\4bb6b7e7-33fec62f
f:\hudson\hudson-slave\maven3-interceptor.jar 53496
<===[JENKINS REMOTING CAPACITY]===>   channel started
log4j:WARN No appenders could be found for logger (org.apache.commons.beanutils.converters.BooleanConverter).
log4j:WARN Please initialize the log4j system properly.
Executing Maven:  -B -f <https://builds.apache.org/job/dir-apacheds-jdbm-jdk16-win/ws/pom.xml>
-Dmaven.repo.local=f:\hudson\hudson-slave\maven-repositories\1 clean install
[INFO] Scanning for projects...
[INFO] ------------------------------------------------------------------------
[INFO] Reactor Build Order:
[INFO] 
[INFO] ApacheDS JDBM
[INFO] ApacheDS JDBM Original Implementation
[INFO] ApacheDS JDBM Implementation MVCC
[INFO]                                                                         
[INFO] ------------------------------------------------------------------------
[INFO] Building ApacheDS JDBM 2.0.0-M3-SNAPSHOT
[INFO] ------------------------------------------------------------------------
[INFO] 
[INFO] --- maven-clean-plugin:2.4.1:clean (default-clean) @ apacheds-jdbm-parent ---
[INFO] Deleting <https://builds.apache.org/job/dir-apacheds-jdbm-jdk16-win/ws/target>
[INFO] 
[INFO] --- maven-remote-resources-plugin:1.2.1:process (default) @ apacheds-jdbm-parent ---
[INFO] 
[INFO] --- maven-site-plugin:3.0:attach-descriptor (attach-descriptor) @ apacheds-jdbm-parent
---
[INFO] 
[INFO] --- tools-maven-plugin:1.4:verify-legal-files (verify-legal-files) @ apacheds-jdbm-parent
---
[INFO] 
[INFO] --- maven-install-plugin:2.3.1:install (default-install) @ apacheds-jdbm-parent ---
[INFO] Installing <https://builds.apache.org/job/dir-apacheds-jdbm-jdk16-win/ws/pom.xml>
to f:\hudson\hudson-slave\maven-repositories\1\org\apache\directory\jdbm\apacheds-jdbm-parent\2.0.0-M3-SNAPSHOT\apacheds-jdbm-parent-2.0.0-M3-SNAPSHOT.pom
[INFO]                                                                         
[INFO] ------------------------------------------------------------------------
[INFO] Building ApacheDS JDBM Original Implementation 2.0.0-M3-SNAPSHOT
[INFO] ------------------------------------------------------------------------
[INFO] 
[INFO] --- maven-clean-plugin:2.4.1:clean (default-clean) @ apacheds-jdbm1 ---
[INFO] Deleting F:\hudson\hudson-slave\workspace\dir-apacheds-jdbm-jdk16-win\jdbm1\target
[INFO] 
[INFO] --- maven-remote-resources-plugin:1.2.1:process (default) @ apacheds-jdbm1 ---
[INFO] 
[INFO] --- maven-resources-plugin:2.5:resources (default-resources) @ apacheds-jdbm1 ---
[debug] execute contextualize
[INFO] Using 'UTF-8' encoding to copy filtered resources.
[INFO] Copying 6 resources
[INFO] Copying 3 resources
[INFO] 
[INFO] --- maven-compiler-plugin:2.5.1:compile (default-compile) @ apacheds-jdbm1 ---
[INFO] Compiling 58 source files to F:\hudson\hudson-slave\workspace\dir-apacheds-jdbm-jdk16-win\jdbm1\target\classes
[INFO] 
[INFO] --- maven-resources-plugin:2.5:testResources (default-testResources) @ apacheds-jdbm1
---
[debug] execute contextualize
[INFO] Using 'UTF-8' encoding to copy filtered resources.
[INFO] skip non existing resourceDirectory F:\hudson\hudson-slave\workspace\dir-apacheds-jdbm-jdk16-win\jdbm1\src\test\resources
[INFO] Copying 3 resources
[INFO] 
[INFO] --- maven-compiler-plugin:2.5.1:testCompile (default-testCompile) @ apacheds-jdbm1
---
[INFO] Compiling 3 source files to F:\hudson\hudson-slave\workspace\dir-apacheds-jdbm-jdk16-win\jdbm1\target\test-classes
[INFO] 
[INFO] --- maven-surefire-plugin:2.12.2:test (default-test) @ apacheds-jdbm1 ---
[INFO] Surefire report directory: F:\hudson\hudson-slave\workspace\dir-apacheds-jdbm-jdk16-win\jdbm1\target\surefire-reports

-------------------------------------------------------
 T E S T S
-------------------------------------------------------
Running jdbm.btree.TestBTree
Tests run: 10, Failures: 0, Errors: 0, Skipped: 1, Time elapsed: 10.553 sec
Running jdbm.recman.LocationTest
Tests run: 8, Failures: 0, Errors: 0, Skipped: 2, Time elapsed: 0.007 sec

Results :

Tests run: 18, Failures: 0, Errors: 0, Skipped: 3

[JENKINS] Recording test results
[INFO] 
[INFO] --- maven-bundle-plugin:2.3.7:bundle (default-bundle) @ apacheds-jdbm1 ---
[INFO] 
[INFO] --- maven-site-plugin:3.0:attach-descriptor (attach-descriptor) @ apacheds-jdbm1 ---
[INFO] 
[INFO] --- tools-maven-plugin:1.4:verify-legal-files (verify-legal-files) @ apacheds-jdbm1
---
[INFO] Checking legal files in: apacheds-jdbm1-2.0.0-M3-SNAPSHOT.jar
[INFO] [INFO] Installing F:\hudson\hudson-slave\workspace\dir-apacheds-jdbm-jdk16-win\jdbm1\target\apacheds-jdbm1-2.0.0-M3-SNAPSHOT.jar
to f:\hudson\hudson-slave\maven-repositories\1\org\apache\directory\jdbm\apacheds-jdbm1\2.0.0-M3-SNAPSHOT\apacheds-jdbm1-2.0.0-M3-SNAPSHOT.jar

[INFO] --- maven-install-plugin:2.3.1:install (default-install) @ apacheds-jdbm1 ---
[INFO] Installing F:\hudson\hudson-slave\workspace\dir-apacheds-jdbm-jdk16-win\jdbm1\pom.xml
to f:\hudson\hudson-slave\maven-repositories\1\org\apache\directory\jdbm\apacheds-jdbm1\2.0.0-M3-SNAPSHOT\apacheds-jdbm1-2.0.0-M3-SNAPSHOT.pom
[INFO] 
[INFO] --- maven-bundle-plugin:2.3.7:install (default-install) @ apacheds-jdbm1 ---
[INFO] Installing org/apache/directory/jdbm/apacheds-jdbm1/2.0.0-M3-SNAPSHOT/apacheds-jdbm1-2.0.0-M3-SNAPSHOT.jar
[INFO] Writing OBR metadata
[INFO]                                                                         
[INFO] ------------------------------------------------------------------------
[INFO] Building ApacheDS JDBM Implementation MVCC 2.0.0-M3-SNAPSHOT
[INFO] ------------------------------------------------------------------------
[INFO] [INFO] Deleting F:\hudson\hudson-slave\workspace\dir-apacheds-jdbm-jdk16-win\jdbm2\target

[INFO] --- maven-clean-plugin:2.4.1:clean (default-clean) @ apacheds-jdbm2 ---
[INFO] 
[INFO] --- maven-remote-resources-plugin:1.2.1:process (default) @ apacheds-jdbm2 ---
[debug] execute contextualize
[INFO] Using 'UTF-8' encoding to copy filtered resources.
[INFO] 
[INFO] --- maven-resources-plugin:2.5:resources (default-resources) @ apacheds-jdbm2 ---
[INFO] Copying 6 resources
[INFO] Copying 3 resources
[INFO] 
[INFO] --- maven-compiler-plugin:2.5.1:compile (default-compile) @ apacheds-jdbm2 ---
[INFO] Compiling 65 source files to F:\hudson\hudson-slave\workspace\dir-apacheds-jdbm-jdk16-win\jdbm2\target\classes
[debug] execute contextualize
[INFO] [INFO] Using 'UTF-8' encoding to copy filtered resources.

[INFO] --- maven-resources-plugin:2.5:testResources (default-testResources) @ apacheds-jdbm2
---
[INFO] Copying 1 resource
[INFO] Copying 3 resources
[INFO] 
[INFO] --- maven-compiler-plugin:2.5.1:testCompile (default-testCompile) @ apacheds-jdbm2
---
[INFO] Compiling 8 source files to F:\hudson\hudson-slave\workspace\dir-apacheds-jdbm-jdk16-win\jdbm2\target\test-classes
[INFO] Surefire report directory: F:\hudson\hudson-slave\workspace\dir-apacheds-jdbm-jdk16-win\jdbm2\target\surefire-reports
[INFO] 
[INFO] --- maven-surefire-plugin:2.12.2:test (default-test) @ apacheds-jdbm2 ---

-------------------------------------------------------
 T E S T S
-------------------------------------------------------
Running jdbm.btree.TestBTree
Tests run: 9, Failures: 0, Errors: 0, Skipped: 0, Time elapsed: 10.659 sec
Running jdbm.btree.TestBTreeBrowser
Tests run: 11, Failures: 0, Errors: 0, Skipped: 0, Time elapsed: 0.469 sec
Running jdbm.btree.TestSnapshotBTree
#
# There is insufficient memory for the Java Runtime Environment to continue.
# Native memory allocation (malloc) failed to allocate 1526656 bytes for Chunk::new
# An error report file with more information is saved as:
# F:\hudson\hudson-slave\workspace\dir-apacheds-jdbm-jdk16-win\jdbm2\hs_err_pid17772.log

Results :

Tests run: 20, Failures: 0, Errors: 0, Skipped: 0

[JENKINS] Recording test results
[INFO] ------------------------------------------------------------------------
[INFO] Reactor Summary:
[INFO] 
[INFO] ApacheDS JDBM ..................................... SUCCESS [5.134s]
[INFO] ApacheDS JDBM Original Implementation ............. SUCCESS [19.847s]
[INFO] ApacheDS JDBM Implementation MVCC ................. FAILURE [14.829s]
[INFO] ------------------------------------------------------------------------
[INFO] BUILD FAILURE
[INFO] ------------------------------------------------------------------------
[INFO] Total time: 41.830s
[INFO] Finished at: Wed Mar 06 04:18:33 GMT 2013
[INFO] Final Memory: 18M/111M
[INFO] ------------------------------------------------------------------------
[JENKINS] Archiving <https://builds.apache.org/job/dir-apacheds-jdbm-jdk16-win/ws/pom.xml>
to /home/hudson/hudson/jobs/dir-apacheds-jdbm-jdk16-win/modules/org.apache.directory.jdbm$apacheds-jdbm-parent/builds/2013-03-06_04-17-52/archive/org.apache.directory.jdbm/apacheds-jdbm-parent/2.0.0-M3-SNAPSHOT/apacheds-jdbm-parent-2.0.0-M3-SNAPSHOT.pom
[JENKINS] Archiving F:\hudson\hudson-slave\workspace\dir-apacheds-jdbm-jdk16-win\jdbm1\pom.xml
to /home/hudson/hudson/jobs/dir-apacheds-jdbm-jdk16-win/modules/org.apache.directory.jdbm$apacheds-jdbm1/builds/2013-03-06_04-17-52/archive/org.apache.directory.jdbm/apacheds-jdbm1/2.0.0-M3-SNAPSHOT/apacheds-jdbm1-2.0.0-M3-SNAPSHOT.pom
[JENKINS] Archiving F:\hudson\hudson-slave\workspace\dir-apacheds-jdbm-jdk16-win\jdbm1\target\apacheds-jdbm1-2.0.0-M3-SNAPSHOT.jar
to /home/hudson/hudson/jobs/dir-apacheds-jdbm-jdk16-win/modules/org.apache.directory.jdbm$apacheds-jdbm1/builds/2013-03-06_04-17-52/archive/org.apache.directory.jdbm/apacheds-jdbm1/2.0.0-M3-SNAPSHOT/apacheds-jdbm1-2.0.0-M3-SNAPSHOT.jar
[JENKINS] Archiving F:\hudson\hudson-slave\workspace\dir-apacheds-jdbm-jdk16-win\jdbm2\pom.xml
to /home/hudson/hudson/jobs/dir-apacheds-jdbm-jdk16-win/modules/org.apache.directory.jdbm$apacheds-jdbm2/builds/2013-03-06_04-17-52/archive/org.apache.directory.jdbm/apacheds-jdbm2/2.0.0-M3-SNAPSHOT/apacheds-jdbm2-2.0.0-M3-SNAPSHOT.pom
Waiting for Jenkins to finish collecting data
mavenExecutionResult exceptions not empty
message : Failed to execute goal org.apache.maven.plugins:maven-surefire-plugin:2.12.2:test
(default-test) on project apacheds-jdbm2: Execution default-test of goal org.apache.maven.plugins:maven-surefire-plugin:2.12.2:test
failed: The forked VM terminated without saying properly goodbye. VM crash or System.exit
called ?
cause : Execution default-test of goal org.apache.maven.plugins:maven-surefire-plugin:2.12.2:test
failed: The forked VM terminated without saying properly goodbye. VM crash or System.exit
called ?
Stack trace : 
org.apache.maven.lifecycle.LifecycleExecutionException: Failed to execute goal org.apache.maven.plugins:maven-surefire-plugin:2.12.2:test
(default-test) on project apacheds-jdbm2: Execution default-test of goal org.apache.maven.plugins:maven-surefire-plugin:2.12.2:test
failed: The forked VM terminated without saying properly goodbye. VM crash or System.exit
called ?
	at org.apache.maven.lifecycle.internal.MojoExecutor.execute(MojoExecutor.java:225)
	at org.apache.maven.lifecycle.internal.MojoExecutor.execute(MojoExecutor.java:153)
	at org.apache.maven.lifecycle.internal.MojoExecutor.execute(MojoExecutor.java:145)
	at org.apache.maven.lifecycle.internal.LifecycleModuleBuilder.buildProject(LifecycleModuleBuilder.java:84)
	at org.apache.maven.lifecycle.internal.LifecycleModuleBuilder.buildProject(LifecycleModuleBuilder.java:59)
	at org.apache.maven.lifecycle.internal.LifecycleStarter.singleThreadedBuild(LifecycleStarter.java:183)
	at org.apache.maven.lifecycle.internal.LifecycleStarter.execute(LifecycleStarter.java:161)
	at org.apache.maven.DefaultMaven.doExecute(DefaultMaven.java:319)
	at org.apache.maven.DefaultMaven.execute(DefaultMaven.java:156)
	at org.jvnet.hudson.maven3.launcher.Maven3Launcher.main(Maven3Launcher.java:79)
	at sun.reflect.NativeMethodAccessorImpl.invoke0(Native Method)
	at sun.reflect.NativeMethodAccessorImpl.invoke(NativeMethodAccessorImpl.java:39)
	at sun.reflect.DelegatingMethodAccessorImpl.invoke(DelegatingMethodAccessorImpl.java:25)
	at java.lang.reflect.Method.invoke(Method.java:597)
	at org.codehaus.plexus.classworlds.launcher.Launcher.launchStandard(Launcher.java:329)
	at org.codehaus.plexus.classworlds.launcher.Launcher.launch(Launcher.java:239)
	at org.jvnet.hudson.maven3.agent.Maven3Main.launch(Maven3Main.java:158)
	at hudson.maven.Maven3Builder.call(Maven3Builder.java:100)
	at hudson.maven.Maven3Builder.call(Maven3Builder.java:66)
	at hudson.remoting.UserRequest.perform(UserRequest.java:118)
	at hudson.remoting.UserRequest.perform(UserRequest.java:48)
	at hudson.remoting.Request$2.run(Request.java:326)
	at hudson.remoting.InterceptingExecutorService$1.call(InterceptingExecutorService.java:72)
	at java.util.concurrent.FutureTask$Sync.innerRun(FutureTask.java:303)
	at java.util.concurrent.FutureTask.run(FutureTask.java:138)
	at java.util.concurrent.ThreadPoolExecutor$Worker.runTask(ThreadPoolExecutor.java:886)
	at java.util.concurrent.ThreadPoolExecutor$Worker.run(ThreadPoolExecutor.java:908)
	at java.lang.Thread.run(Thread.java:662)
Caused by: org.apache.maven.plugin.PluginExecutionException: Execution default-test of goal
org.apache.maven.plugins:maven-surefire-plugin:2.12.2:test failed: The forked VM terminated
without saying properly goodbye. VM crash or System.exit called ?
	at org.apache.maven.plugin.DefaultBuildPluginManager.executeMojo(DefaultBuildPluginManager.java:116)
	at org.apache.maven.lifecycle.internal.MojoExecutor.execute(MojoExecutor.java:209)
	... 27 more
Caused by: java.lang.RuntimeException: The forked VM terminated without saying properly goodbye.
VM crash or System.exit called ?
	at org.apache.maven.plugin.surefire.booterclient.output.ForkClient.close(ForkClient.java:245)
	at org.apache.maven.plugin.surefire.booterclient.ForkStarter.fork(ForkStarter.java:282)
	at org.apache.maven.plugin.surefire.booterclient.ForkStarter.run(ForkStarter.java:116)
	at org.apache.maven.plugin.surefire.AbstractSurefireMojo.executeProvider(AbstractSurefireMojo.java:695)
	at org.apache.maven.plugin.surefire.AbstractSurefireMojo.executeAllProviders(AbstractSurefireMojo.java:666)
	at org.apache.maven.plugin.surefire.AbstractSurefireMojo.executeAfterPreconditionsChecked(AbstractSurefireMojo.java:624)
	at org.apache.maven.plugin.surefire.AbstractSurefireMojo.execute(AbstractSurefireMojo.java:587)
	at org.apache.maven.plugin.DefaultBuildPluginManager.executeMojo(DefaultBuildPluginManager.java:107)
	... 28 more
Sending e-mails to: notifications@directory.apache.org
channel stopped

Mime
View raw message