directory-notifications mailing list archives

Site index · List index
Message view « Date » · « Thread »
Top « Date » · « Thread »
From Apache Jenkins Server <jenk...@builds.apache.org>
Subject Build failed in Jenkins: dir-apacheds-jdk16-win #356
Date Wed, 20 Mar 2013 04:14:25 GMT
See <https://builds.apache.org/job/dir-apacheds-jdk16-win/356/>

------------------------------------------
[...truncated 4683 lines...]
[INFO] --- maven-remote-resources-plugin:1.2.1:process (default) @ apacheds-service ---
[debug] execute contextualize
[INFO] [INFO] Using 'UTF-8' encoding to copy filtered resources.
[INFO] skip non existing resourceDirectory F:\hudson\hudson-slave\workspace\dir-apacheds-jdk16-win\trunk\service\src\main\resources
[INFO] Copying 3 resources

[INFO] --- maven-resources-plugin:2.5:resources (default-resources) @ apacheds-service ---
[INFO] 
[INFO] --- maven-compiler-plugin:2.5.1:compile (default-compile) @ apacheds-service ---
[INFO] Compiling 3 source files to F:\hudson\hudson-slave\workspace\dir-apacheds-jdk16-win\trunk\service\target\classes
[debug] execute contextualize
[INFO] [INFO] Using 'UTF-8' encoding to copy filtered resources.

[INFO] --- maven-resources-plugin:2.5:testResources (default-testResources) @ apacheds-service
---
[INFO] Copying 3 resources
[INFO] Copying 3 resources
[INFO] 
[INFO] --- maven-compiler-plugin:2.5.1:testCompile (default-testCompile) @ apacheds-service
---
[INFO] Compiling 1 source file to F:\hudson\hudson-slave\workspace\dir-apacheds-jdk16-win\trunk\service\target\test-classes
[INFO] 
[INFO] --- maven-surefire-plugin:2.12.2:test (default-test) @ apacheds-service ---
[INFO] Surefire report directory: F:\hudson\hudson-slave\workspace\dir-apacheds-jdk16-win\trunk\service\target\surefire-reports

-------------------------------------------------------
 T E S T S
-------------------------------------------------------
Running org.apache.directory.server.UberJarMainTest
net.sf.ehcache.CacheException: java.io.FileNotFoundException: C:\Users\hudson\AppData\Local\Temp\ApacheDS-201322041410\cache\groupCache.data
(There is not enough space on the disk)
	at net.sf.ehcache.store.compound.factories.DiskStorageFactory.<init>(DiskStorageFactory.java:102)
	at net.sf.ehcache.store.compound.factories.DiskOverflowStorageFactory.<init>(DiskOverflowStorageFactory.java:71)
	at net.sf.ehcache.store.compound.impl.OverflowToDiskStore.create(OverflowToDiskStore.java:63)
	at net.sf.ehcache.Cache.initialise(Cache.java:1113)
	at net.sf.ehcache.CacheManager.addCacheNoCheck(CacheManager.java:1082)
	at net.sf.ehcache.CacheManager.addConfiguredCaches(CacheManager.java:657)
	at net.sf.ehcache.CacheManager.init(CacheManager.java:375)
	at net.sf.ehcache.CacheManager.<init>(CacheManager.java:228)
	at org.apache.directory.server.core.api.CacheService.initialize(CacheService.java:110)
	at org.apache.directory.server.ApacheDsService.start(ApacheDsService.java:165)
	at org.apache.directory.server.UberjarMain.start(UberjarMain.java:76)
	at org.apache.directory.server.UberJarMainTest.serviceInstanceTest(UberJarMainTest.java:98)
	at sun.reflect.NativeMethodAccessorImpl.invoke0(Native Method)
	at sun.reflect.NativeMethodAccessorImpl.invoke(NativeMethodAccessorImpl.java:39)
	at sun.reflect.DelegatingMethodAccessorImpl.invoke(DelegatingMethodAccessorImpl.java:25)
	at java.lang.reflect.Method.invoke(Method.java:597)
	at org.junit.runners.model.FrameworkMethod$1.runReflectiveCall(FrameworkMethod.java:47)
	at org.junit.internal.runners.model.ReflectiveCallable.run(ReflectiveCallable.java:12)
	at org.junit.runners.model.FrameworkMethod.invokeExplosively(FrameworkMethod.java:44)
	at org.junit.internal.runners.statements.InvokeMethod.evaluate(InvokeMethod.java:17)
	at org.junit.internal.runners.statements.RunBefores.evaluate(RunBefores.java:26)
	at org.junit.internal.runners.statements.RunAfters.evaluate(RunAfters.java:27)
	at org.junit.runners.ParentRunner.runLeaf(ParentRunner.java:271)
	at org.junit.runners.BlockJUnit4ClassRunner.runChild(BlockJUnit4ClassRunner.java:70)
	at org.junit.runners.BlockJUnit4ClassRunner.runChild(BlockJUnit4ClassRunner.java:50)
	at org.junit.runners.ParentRunner$3.run(ParentRunner.java:238)
	at org.junit.runners.ParentRunner$1.schedule(ParentRunner.java:63)
	at org.junit.runners.ParentRunner.runChildren(ParentRunner.java:236)
	at org.junit.runners.ParentRunner.access$000(ParentRunner.java:53)
	at org.junit.runners.ParentRunner$2.evaluate(ParentRunner.java:229)
	at org.junit.runners.ParentRunner.run(ParentRunner.java:309)
	at org.apache.maven.surefire.junit4.JUnit4Provider.execute(JUnit4Provider.java:252)
	at org.apache.maven.surefire.junit4.JUnit4Provider.executeTestSet(JUnit4Provider.java:141)
	at org.apache.maven.surefire.junit4.JUnit4Provider.invoke(JUnit4Provider.java:112)
	at sun.reflect.NativeMethodAccessorImpl.invoke0(Native Method)
	at sun.reflect.NativeMethodAccessorImpl.invoke(NativeMethodAccessorImpl.java:39)
	at sun.reflect.DelegatingMethodAccessorImpl.invoke(DelegatingMethodAccessorImpl.java:25)
	at java.lang.reflect.Method.invoke(Method.java:597)
	at org.apache.maven.surefire.util.ReflectionUtils.invokeMethodWithArray(ReflectionUtils.java:189)
	at org.apache.maven.surefire.booter.ProviderFactory$ProviderProxy.invoke(ProviderFactory.java:165)
	at org.apache.maven.surefire.booter.ProviderFactory.invokeProvider(ProviderFactory.java:85)
	at org.apache.maven.surefire.booter.ForkedBooter.runSuitesInProcess(ForkedBooter.java:113)
	at org.apache.maven.surefire.booter.ForkedBooter.main(ForkedBooter.java:75)
Caused by: java.io.FileNotFoundException: C:\Users\hudson\AppData\Local\Temp\ApacheDS-201322041410\cache\groupCache.data
(There is not enough space on the disk)
	at java.io.RandomAccessFile.open(Native Method)
	at java.io.RandomAccessFile.<init>(RandomAccessFile.java:216)
	at net.sf.ehcache.store.compound.factories.DiskStorageFactory.allocateRandomAccessFiles(DiskStorageFactory.java:130)
	at net.sf.ehcache.store.compound.factories.DiskStorageFactory.<init>(DiskStorageFactory.java:100)
	... 42 more

Results :

Tests run: 0, Failures: 0, Errors: 0, Skipped: 0

[JENKINS] Recording test results
[INFO] ------------------------------------------------------------------------
[INFO] Reactor Summary:
[INFO] 
[INFO] ApacheDS .......................................... SUCCESS [7.008s]
[INFO] ApacheDS I18n ..................................... SUCCESS [6.562s]
[INFO] ApacheDS Core Constants ........................... SUCCESS [3.294s]
[INFO] ApacheDS Core API ................................. SUCCESS [37.511s]
[INFO] ApacheDS Core Shared .............................. SUCCESS [3.159s]
[INFO] ApacheDS Interceptors ............................. SUCCESS [0.155s]
[INFO] ApacheDS AdministrativePoint Interceptor .......... SUCCESS [2.509s]
[INFO] ApacheDS Authentication Interceptor ............... SUCCESS [4.747s]
[INFO] ApacheDS Authorization Interceptor ................ SUCCESS [5.638s]
[INFO] ApacheDS ChangeLog Interceptor .................... SUCCESS [3.885s]
[INFO] ApacheDS Collective Attribute Interceptor ......... SUCCESS [1.570s]
[INFO] ApacheDS Event Interceptor ........................ SUCCESS [2.245s]
[INFO] ApacheDS Exception Interceptor .................... SUCCESS [2.008s]
[INFO] ApacheDS Journal Interceptor ...................... SUCCESS [1.769s]
[INFO] ApacheDS Normalization Interceptor ................ SUCCESS [4.307s]
[INFO] ApacheDS Operational Attribute Interceptor ........ SUCCESS [2.252s]
[INFO] ApacheDS Referral Interceptor ..................... SUCCESS [1.603s]
[INFO] ApacheDS Schema Interceptor ....................... SUCCESS [8.057s]
[INFO] ApacheDS Subtree Interceptor ...................... SUCCESS [11.800s]
[INFO] ApacheDS Triggers Interceptor ..................... SUCCESS [3.294s]
[INFO] ApacheDS Core ..................................... SUCCESS [7.464s]
[INFO] ApacheDS Core AVL ................................. SUCCESS [9.872s]
[INFO] ApacheDS Generalized (X) DBM Partition ............ SUCCESS [26.334s]
[INFO] ApacheDS LDIF Partition ........................... SUCCESS [18.528s]
[INFO] ApacheDS JDBM Partition ........................... SUCCESS [41.099s]
[INFO] ApacheDS Core Annotations ......................... SUCCESS [46.513s]
[INFO] ApacheDS Core JNDI ................................ SUCCESS [6.574s]
[INFO] ApacheDS Protocol Kerberos Codec .................. SUCCESS [24.725s]
[INFO] ApacheDS Interceptors for Kerberos ................ SUCCESS [2.350s]
[INFO] ApacheDS Protocol Dhcp ............................ SUCCESS [3.714s]
[INFO] ApacheDS Protocol Shared .......................... SUCCESS [2.233s]
[INFO] ApacheDS Protocol Dns ............................. SUCCESS [5.015s]
[INFO] ApacheDS Protocol Kerberos ........................ SUCCESS [5.866s]
[INFO] ApacheDS Protocol Ldap ............................ SUCCESS [1:05.126s]
[INFO] ApacheDS Protocol Ntp ............................. SUCCESS [2.181s]
[INFO] Apacheds Server Annotations ....................... SUCCESS [3.688s]
[INFO] ApacheDS Server Config ............................ SUCCESS [8.167s]
[INFO] ApacheDS Server JNDI .............................. SUCCESS [2.142s]
[INFO] ApacheDS Test Framework ........................... SUCCESS [3.577s]
[INFO] ApacheDS All ...................................... SUCCESS [4.377s]
[INFO] ApacheDS Logger Interceptor ....................... SUCCESS [1.278s]
[INFO] ApacheDS Password Hashing Interceptor ............. SUCCESS [1.193s]
[INFO] ApacheDS Core Integration ......................... SUCCESS [4:27.302s]
[INFO] ApacheDS Server Integration ....................... SUCCESS [31.360s]
[INFO] ApacheDS DirectoryService-WebApp bridge ........... SUCCESS [2.420s]
[INFO] ApacheDS Jetty HTTP Server Integration ............ SUCCESS [2.574s]
[INFO] ApacheDS Service Builder .......................... SUCCESS [2.364s]
[INFO] ApacheDS Protocol Kerberos Test ................... SUCCESS [5.879s]
[INFO] Apache Directory LDAP Client API test ............. SUCCESS [3.404s]
[INFO] kerberos-client ................................... SUCCESS [3.136s]
[INFO] ApacheDS Service .................................. FAILURE [2.681s]
[INFO] ApacheDS Wrapper .................................. SKIPPED
[INFO] ApacheDS Installers Maven Plugin .................. SKIPPED
[INFO] ApacheDS Installers ............................... SKIPPED
[INFO] ------------------------------------------------------------------------
[INFO] BUILD FAILURE
[INFO] ------------------------------------------------------------------------
[INFO] Total time: 12:11.065s
[INFO] Finished at: Wed Mar 20 04:14:11 GMT 2013
[INFO] Final Memory: 62M/271M
[INFO] ------------------------------------------------------------------------
[JENKINS] Archiving disabled
[JENKINS] Archiving disabled
[JENKINS] Archiving disabled
[JENKINS] Archiving disabled
[JENKINS] Archiving disabled
[JENKINS] Archiving disabled
[JENKINS] Archiving disabled
[JENKINS] Archiving disabled
[JENKINS] Archiving disabled
[JENKINS] Archiving disabled
[JENKINS] Archiving disabled
[JENKINS] Archiving disabled
[JENKINS] Archiving disabled
[JENKINS] Archiving disabled
[JENKINS] Archiving disabled
[JENKINS] Archiving disabled
[JENKINS] Archiving disabled
[JENKINS] Archiving disabled
[JENKINS] Archiving disabled
[JENKINS] Archiving disabled
[JENKINS] Archiving disabled
[JENKINS] Archiving disabled
[JENKINS] Archiving disabled
[JENKINS] Archiving disabled
[JENKINS] Archiving disabled
[JENKINS] Archiving disabled
[JENKINS] Archiving disabled
[JENKINS] Archiving disabled
[JENKINS] Archiving disabled
[JENKINS] Archiving disabled
[JENKINS] Archiving disabled
[JENKINS] Archiving disabled
[JENKINS] Archiving disabled
[JENKINS] Archiving disabled
[JENKINS] Archiving disabled
[JENKINS] Archiving disabled
[JENKINS] Archiving disabled
[JENKINS] Archiving disabled
[JENKINS] Archiving disabled
[JENKINS] Archiving disabled
[JENKINS] Archiving disabled
[JENKINS] Archiving disabled
[JENKINS] Archiving disabled
[JENKINS] Archiving disabled
[JENKINS] Archiving disabled
[JENKINS] Archiving disabled
[JENKINS] Archiving disabled
[JENKINS] Archiving disabled
[JENKINS] Archiving disabled
[JENKINS] Archiving disabled
[JENKINS] Archiving disabled
[JENKINS] Archiving disabled
[JENKINS] Archiving disabled
[JENKINS] Archiving disabled
Sending e-mails to: notifications@directory.apache.org
Sending e-mails to: notifications@directory.apache.org
Sending e-mails to: notifications@directory.apache.org
Sending e-mails to: notifications@directory.apache.org
Sending e-mails to: notifications@directory.apache.org
Sending e-mails to: notifications@directory.apache.org
Sending e-mails to: notifications@directory.apache.org
Sending e-mails to: notifications@directory.apache.org
Sending e-mails to: notifications@directory.apache.org
Sending e-mails to: notifications@directory.apache.org
channel stopped
ERROR: Failed to parse POMs
java.io.IOException: Remote call on Channel to Maven [f:\hudson\tools\java\latest-1.6-64/bin/java,
-Xmx512m, -XX:MaxPermSize=128m, -cp, f:\hudson\hudson-slave\maven3-agent.jar;f:\hudson\tools\maven\latest3\boot\plexus-classworlds-2.4.jar,
org.jvnet.hudson.maven3.agent.Maven3Main, f:\hudson\tools\maven\latest3, C:\Users\hudson\AppData\LocalLow\Sun\Java\Deployment\cache\6.0\39\4bb6b7e7-33fec62f,
f:\hudson\hudson-slave\maven3-interceptor.jar, 53405] failed
	at hudson.remoting.Channel.call(Channel.java:681)
	at hudson.maven.ProcessCache$MavenProcess.call(ProcessCache.java:156)
	at hudson.maven.MavenModuleSetBuild$MavenModuleSetBuildExecution.doRun(MavenModuleSetBuild.java:755)
	at hudson.model.AbstractBuild$AbstractBuildExecution.run(AbstractBuild.java:592)
	at hudson.model.Run.execute(Run.java:1568)
	at hudson.maven.MavenModuleSetBuild.run(MavenModuleSetBuild.java:477)
	at hudson.model.ResourceController.execute(ResourceController.java:88)
	at hudson.model.Executor.run(Executor.java:236)
Caused by: java.lang.Error: Unable to load resource hudson/maven/Messages.properties
	at hudson.remoting.RemoteClassLoader.findResource(RemoteClassLoader.java:241)
	at java.lang.ClassLoader.getResource(ClassLoader.java:1002)
	at java.lang.Class.getResource(Class.java:2074)
	at org.jvnet.localizer.ResourceBundleHolder.get(ResourceBundleHolder.java:83)
	at org.jvnet.localizer.ResourceBundleHolder.get(ResourceBundleHolder.java:102)
	at org.jvnet.localizer.ResourceBundleHolder.get(ResourceBundleHolder.java:102)
	at org.jvnet.localizer.ResourceBundleHolder.format(ResourceBundleHolder.java:139)
	at hudson.maven.Messages.MavenBuilder_Waiting(Messages.java:491)
	at hudson.maven.AbstractMavenBuilder.waitForAsynchronousExecutions(AbstractMavenBuilder.java:183)
	at hudson.maven.Maven3Builder.call(Maven3Builder.java:105)
	at hudson.maven.Maven3Builder.call(Maven3Builder.java:66)
	at hudson.remoting.UserRequest.perform(UserRequest.java:118)
	at hudson.remoting.UserRequest.perform(UserRequest.java:48)
	at hudson.remoting.Request$2.run(Request.java:326)
	at hudson.remoting.InterceptingExecutorService$1.call(InterceptingExecutorService.java:72)
	at java.util.concurrent.FutureTask$Sync.innerRun(FutureTask.java:303)
	at java.util.concurrent.FutureTask.run(FutureTask.java:138)
	at java.util.concurrent.ThreadPoolExecutor$Worker.runTask(ThreadPoolExecutor.java:886)
	at java.util.concurrent.ThreadPoolExecutor$Worker.run(ThreadPoolExecutor.java:908)
	at java.lang.Thread.run(Thread.java:662)
Caused by: java.io.IOException: There is not enough space on the disk
	at java.io.FileOutputStream.writeBytes(Native Method)
	at java.io.FileOutputStream.write(FileOutputStream.java:269)
	at hudson.remoting.RemoteClassLoader.makeResource(RemoteClassLoader.java:310)
	at hudson.remoting.RemoteClassLoader.findResource(RemoteClassLoader.java:237)
	... 19 more

Mime
View raw message